<?xml version="1.0" encoding="UTF-8" standalone="no"?>
<svg
   width="180"
   height="180"
   version="1.1"
   id="svg14"
   sodipodi:docname="apple-touch-icon.svg"
   inkscape:version="1.1.2 (0a00cf5339, 2022-02-04)"
   inkscape:export-filename="/home/jimmac/src/git/gnome/gnome-gsoc-site/apple-touch-icon.png"
   inkscape:export-xdpi="96"
   inkscape:export-ydpi="96"
   xmlns:inkscape="http://www.inkscape.org/namespaces/inkscape"
   xmlns:sodipodi="http://sodipodi.sourceforge.net/DTD/sodipodi-0.dtd"
   xmlns="http://www.w3.org/2000/svg"
   xmlns:svg="http://www.w3.org/2000/svg"
   xmlns:rdf="http://www.w3.org/1999/02/22-rdf-syntax-ns#"
   xmlns:cc="http://creativecommons.org/ns#"
   xmlns:dc="http://purl.org/dc/elements/1.1/">
  <metadata
     id="metadata20">
    <rdf:RDF>
      <cc:Work
         rdf:about="">
        <dc:format>image/svg+xml</dc:format>
        <dc:type
           rdf:resource="http://purl.org/dc/dcmitype/StillImage" />
        <dc:title />
      </cc:Work>
    </rdf:RDF>
  </metadata>
  <defs
     id="defs18" />
  <sodipodi:namedview
     pagecolor="#ffffff"
     bordercolor="#666666"
     borderopacity="1"
     objecttolerance="10"
     gridtolerance="10"
     guidetolerance="10"
     inkscape:pageopacity="0"
     inkscape:pageshadow="2"
     inkscape:window-width="1920"
     inkscape:window-height="1016"
     id="namedview16"
     showgrid="false"
     inkscape:zoom="1.0603119"
     inkscape:cx="142.64289"
     inkscape:cy="33.052005"
     inkscape:window-x="0"
     inkscape:window-y="0"
     inkscape:window-maximized="1"
     inkscape:current-layer="svg14"
     inkscape:document-rotation="0"
     inkscape:snap-object-midpoints="true"
     inkscape:pagecheckerboard="1">
    <inkscape:grid
       type="xygrid"
       id="grid52"
       originx="-0.0087961219"
       originy="-0.0049772212" />
  </sodipodi:namedview>
  <rect
     y="1.219757e-09"
     x="1.8816066e-09"
     height="180"
     width="180"
     fill="#201a26"
     stroke-width="1"
     id="rect2"
     style="fill:#4a86cf;fill-opacity:1"
     rx="22" />
  <g
     id="Group-3"
     transform="matrix(0.81471278,0,0,0.81471278,-5.5617661,18.305218)">
    <path
       id="Shape-6"
       style="fill:#ffffff;fill-opacity:1"
       d="M 117.29601,0.19929 91.594843,25.90046 h -36.40039 v 36.40039 l -25.69922,25.69922 25.69922,25.69922 v 36.40039 h 36.40039 l 25.701167,25.70117 25.69922,-25.70117 h 36.40039 V 113.69929 L 205.09484,88.00007 179.39562,62.30085 V 25.90046 h -36.40039 z m 0,25.10156 c 34.58084,0 62.69922,28.11838 62.69922,62.69922 0,34.58084 -28.11838,62.69922 -62.69922,62.69922 -34.580837,0 -62.699217,-28.11838 -62.699217,-62.69922 0,-34.58084 28.11838,-62.69922 62.699217,-62.69922 z m 0,8 c -30.257317,0 -54.699217,24.44189 -54.699217,54.69922 0,30.25732 24.4419,54.69922 54.699217,54.69922 30.25732,0 54.69922,-24.4419 54.69922,-54.69922 0,-30.25733 -24.4419,-54.69922 -54.69922,-54.69922 z m 2.79883,27.19922 h 7.40039 l -0.40039,2 -11.90039,52.5 -0.0996,0.40039 h -7.40039 l 0.40039,-2 11.90039,-52.5 z m -18.90039,7.19922 v 9 L 86.694453,88.00007 101.19445,99.09968 v 9 l -1,-0.69922 -21.499997,-16.70117 -1.39844,-1.09961 v -3.40039 l 1.39844,-1.09961 21.499997,-16.69922 z m 32.20117,0 0.90039,0.80078 21.59961,16.80078 1.40039,1.09961 v 3.40039 l -1.40039,1.09961 -21.5,16.69922 -1,0.70117 v -9 l 14.5,-11.30078 -14.5,-11.30078 z" />
  </g>
</svg>
