Move node creation to Rust

3 jobs for load_rust in 5 minutes and 49 seconds (queued for 4 seconds)
latest
Status Job ID Name Coverage
  Test
failed #41061
fedora:test

00:05:49

 
  Lint
skipped #41063
allowed to fail manual
clippy
skipped #41062
rustfmt
 
Name Stage Failure
failed
fedora:test Test
make[2]: *** [Makefile:1381: check] Error 2
make[1]: Leaving directory '/builds/saurvs/librsvg'
make[1]: *** [Makefile:1706: check-recursive] Error 1
make: *** [Makefile:1998: check] Error 2
Uploading artifacts...
tests/*.log: found 7 matching files
tests/output/: found 625 matching files
Uploading artifacts to coordinator... ok id=41061 responseStatus=201 Created token=zRTC2SKZ
ERROR: Job failed: exit code 1