text: move text drawing into text.rs

7 jobs from shuffle in 2 minutes and 7 seconds (queued for 2 seconds)
latest
Status Job ID Name Coverage
  Test
failed #177604
fedora test

00:02:07

 
  Lint
skipped #177606
allowed to fail manual
clippy
skipped #177605
rustfmt
skipped #177607
tarball
 
  Cross Distro
skipped #177610
debian_i386:testing
skipped #177609
debian:testing
skipped #177608
fedora:rawhide
 
Name Stage Failure
failed
fedora test Test
error: Could not compile `unicode-normalization`.

To learn more, run the command again with --verbose.
make[2]: Leaving directory '/builds/pborelli/librsvg/_build'
make[2]: *** [Makefile:1954: /builds/pborelli/librsvg/_build/target/debug/librsvg_internals.a] Error 101
make[1]: *** [Makefile:1460: all-recursive] Error 1
make[1]: Leaving directory '/builds/pborelli/librsvg/_build'
make: *** [Makefile:963: all] Error 2
ERROR: Job failed: exit code 1