Replace lazy_static with once_cell

7 jobs for once_cell in 35 minutes and 39 seconds (queued for 3 seconds)
Status Job ID Name Coverage
  Test
passed #494490
opensuse:tumbleweed

00:12:27

 
  Lint
manual #494492
allowed to fail manual
clippy
manual #494491
allowed to fail manual
rustfmt
passed #494493
tarball

00:10:36

 
  Cross Distro
failed #494496
allowed to fail
debian_i386:testing

00:10:03

failed #494495
allowed to fail
debian:testing

00:12:34

failed #494494
allowed to fail
fedora:rawhide

00:08:28

 
Name Stage Failure
failed
debian:testing Cross Distro
make[4]: Leaving directory '/builds/pborelli/librsvg/_build/tests'
make[3]: *** [Makefile:1324: check-TESTS] Error 2
make[3]: Leaving directory '/builds/pborelli/librsvg/_build/tests'
make[2]: *** [Makefile:1447: check-am] Error 2
make[2]: Leaving directory '/builds/pborelli/librsvg/_build/tests'
make[1]: *** [Makefile:1450: check] Error 2
make[1]: Leaving directory '/builds/pborelli/librsvg/_build/tests'
make: *** [Makefile:1273: check-recursive] Error 1
ERROR: Job failed: exit code 1
failed
debian_i386:testing Cross Distro
make[4]: Leaving directory '/builds/pborelli/librsvg/_build/tests'
make[3]: *** [Makefile:1324: check-TESTS] Error 2
make[3]: Leaving directory '/builds/pborelli/librsvg/_build/tests'
make[2]: *** [Makefile:1447: check-am] Error 2
make[2]: Leaving directory '/builds/pborelli/librsvg/_build/tests'
make[1]: *** [Makefile:1450: check] Error 2
make[1]: Leaving directory '/builds/pborelli/librsvg/_build/tests'
make: *** [Makefile:1273: check-recursive] Error 1
ERROR: Job failed: exit code 1
failed
fedora:rawhide Cross Distro
make[4]: Leaving directory '/builds/pborelli/librsvg/_build/tests'
make[3]: *** [Makefile:1324: check-TESTS] Error 2
make[3]: Leaving directory '/builds/pborelli/librsvg/_build/tests'
make[2]: *** [Makefile:1447: check-am] Error 2
make[2]: Leaving directory '/builds/pborelli/librsvg/_build/tests'
make[1]: *** [Makefile:1450: check] Error 2
make[1]: Leaving directory '/builds/pborelli/librsvg/_build/tests'
make: *** [Makefile:1273: check-recursive] Error 1
ERROR: Job failed: exit code 1