Trim Makefile.am

7 jobs for cc in 3 minutes and 40 seconds (queued for 3 seconds)
latest
Status Job ID Name Coverage
  Test
failed #218168
fedora test

00:03:40

 
  Lint
skipped #218170
allowed to fail manual
clippy
skipped #218169
rustfmt
skipped #218171
tarball
 
  Cross Distro
skipped #218174
debian_i386:testing
skipped #218173
debian:testing
skipped #218172
fedora:rawhide
 
Name Stage Failure
failed
fedora test Test
make[2]: *** [Makefile:1066: librsvg-2.la] Error 1
make[1]: *** [Makefile:1328: all-recursive] Error 1
make[1]: Leaving directory '/builds/kornelski/librsvg/_build'
make: *** [Makefile:919: all] Error 2
Uploading artifacts...
WARNING: _build/tests/*.log: no matching files
WARNING: _build/tests/output/: no matching files
ERROR: No files to upload
ERROR: Job failed: exit code 1