Don't use private enums submodule

7 jobs for enum in 2 minutes and 16 seconds (queued for 2 seconds)
latest
Status Job ID Name Coverage
  Test
failed #174275
fedora test

00:02:16

 
  Lint
skipped #174277
allowed to fail manual
clippy
skipped #174276
rustfmt
skipped #174278
tarball
 
  Cross Distro
skipped #174281
debian_i386:testing
skipped #174280
debian:testing
skipped #174279
fedora:rawhide
 
Name Stage Failure
failed
fedora test Test
make[2]: *** [Makefile:1954: /builds/kornelski/librsvg/_build/target/debug/librsvg_internals.a] Error 101
make[1]: *** [Makefile:1460: all-recursive] Error 1
make[1]: Leaving directory '/builds/kornelski/librsvg/_build'
make: *** [Makefile:963: all] Error 2
Uploading artifacts...
WARNING: _build/tests/*.log: no matching files
WARNING: _build/tests/output/: no matching files
ERROR: No files to upload
ERROR: Job failed: exit code 1