tests: Add a Gtk4 test for drag and drop operations

11 jobs for wip/jfelder/gtk4-toolbutton in 5 minutes and 31 seconds (queued for 2 seconds)
latest
Status Job ID Name Coverage
  Build And Test
passed #631977
flatpak
gnome-master

00:01:28

failed #631978
flatpak allowed to fail
gnome-master-gtk4

00:01:37

failed #631975
allowed to fail
pypy3.6

00:01:52

passed #631971
python3.5

00:02:52

passed #631972
python3.6

00:02:44

passed #631973
python3.7

00:04:42

passed #631974
python3.8

00:04:11

passed #631969
win32
python3-mingw32

00:02:08

passed #631970
win32
python3-mingw64

00:02:25

passed #631976
xenial-i386-py3

00:02:01

 
  Coverage
passed #631979
coverage

00:00:48

 
Name Stage Failure
failed
pypy3.6 Build And Test

Ok: 0
Expected Fail: 0
Fail: 1
Unexpected Pass: 0
Skipped: 0
Timeout: 0

ERROR: Job failed: exit code 1
failed
gnome-master-gtk4 Build And Test
FAILED tests/test_gtk_template.py::test_from_string_bytes - AttributeError: t...
FAILED tests/test_gtk_template.py::test_from_resource - AttributeError: type ...
FAILED tests/test_gtk_template.py::test_internal_child - AttributeError: type...
FAILED tests/test_overrides_gtk.py::TestGtk::test_window - TypeError: object ...
FAILED tests/test_overrides_gtk.py::TestBuilder::test_builder - gi.repository...
FAILED tests/test_overrides_gtk.py::TestBuilder::test_builder_with_handler_and_args
FAILED tests/test_overrides_gtk.py::TestBuilder::test_builder_with_handler_object
========== 16 failed, 1331 passed, 103 skipped, 12 xfailed in 26.55s ===========
ERROR: Job failed: exit code 1