tests: Fix gtk_drag_methods method for Gtk4

11 jobs for wip/jfelder/gtk4-toolbutton in 5 minutes and 1 second (queued for 1 second)
Status Job ID Name Coverage
  Build And Test
passed #631811
flatpak
gnome-master

00:01:34

failed #631812
flatpak allowed to fail
gnome-master-gtk4

00:01:35

failed #631809
allowed to fail
pypy3.6

00:01:45

passed #631805
python3.5

00:02:49

passed #631806
python3.6

00:02:41

passed #631807
python3.7

00:04:07

passed #631808
python3.8

00:04:05

passed #631803
win32
python3-mingw32

00:02:17

passed #631804
win32
python3-mingw64

00:02:29

passed #631810
xenial-i386-py3

00:01:37

 
  Coverage
passed #631813
coverage

00:00:52

 
Name Stage Failure
failed
pypy3.6 Build And Test

Ok: 0
Expected Fail: 0
Fail: 1
Unexpected Pass: 0
Skipped: 0
Timeout: 0

ERROR: Job failed: exit code 1
failed
gnome-master-gtk4 Build And Test
FAILED tests/test_overrides_gtk.py::TestSignals::test_class_closure_override_with_aliased_type
FAILED tests/test_overrides_gtk.py::TestBuilder::test_builder - gi.repository...
FAILED tests/test_overrides_gtk.py::TestBuilder::test_builder_with_handler_and_args
FAILED tests/test_overrides_gtk.py::TestBuilder::test_builder_with_handler_object
FAILED tests/test_overrides_gtk.py::TestTreeView::test_tree_view - AttributeE...
FAILED tests/test_overrides_gtk.py::TestTreeView::test_tree_view_add_column_with_attributes
FAILED tests/test_overrides_gtk.py::TestTreeView::test_tree_view_column_set_attributes
========== 21 failed, 1326 passed, 102 skipped, 12 xfailed in 23.44s ===========
ERROR: Job failed: exit code 1