{
    "uuid": "notifications@gjs.guide",
    "name": "Notifications Example",
    "description": "This is an example of using notifications in an extension.",
    "shell-version": [ "46" ],
    "url": "https://gjs.guide/extensions/topics/notifications"
}