Public
Authored by Jordan Petridis

Broken test

Output

  Compiling html2pango v0.1.0 (file:///srv/app)
    Finished dev [unoptimized + debuginfo] target(s) in 3.5 secs
     Running target/debug/deps/html2pango-33354da5f9945706

running 2 tests
test test::test_markup ... FAILED
test test::test_matrix ... ok

failures:

---- test::test_markup stdout ----
    thread 'test::test_markup' panicked at 'assertion failed: `(left == right)`

Diff < left / right > :
<"Learn more at &lt;a href=\"<a href=\"http://99percentinvisible.org\">99percentinvisible.org</a>\"&gt;99percentinvisible.org&lt;/a&gt;."
>"Learn more at <a href=\"http://99percentinvisible.org\">99percentinvisible.org</a>."

', src/lib.rs:185:9
note: Run with `RUST_BACKTRACE=1` for a backtrace.


failures:
    test::test_markup

test result: FAILED. 1 passed; 1 failed; 0 ignored; 0 measured; 0 filtered out

error: test failed, to rerun pass '--lib'
Edited
312 Bytes
Markdown is supported
0% or
You are about to add 0 people to the discussion. Proceed with caution.
Finish editing this message first!
Please register or to comment