{
    "id": "org.gnome.design.SymbolicPreviewDevel",
    "runtime": "org.gnome.Platform",
    "runtime-version": "master",
    "sdk": "org.gnome.Sdk",
    "sdk-extensions": [
        "org.freedesktop.Sdk.Extension.rust-stable"
    ],
    "command": "symbolic-preview",
    "finish-args": [
        "--filesystem=home",
        "--filesystem=/tmp",
        "--share=ipc",
        "--socket=fallback-x11",
        "--socket=wayland",
        "--device=dri",
        "--env=RUST_BACKTRACE=1",
        "--env=RUST_LOG=symbolic_preview=info",
        "--env=G_MESSAGES_DEBUG=none"
    ],
    "build-options": {
        "append-path": "/usr/lib/sdk/rust-stable/bin",
        "build-args": [
            "--share=network"
        ],
        "test-args": [
            "--socket=x11",
            "--share=network"
        ]
    },
    "modules": [
        {
            "name": "symbolic-preview",
            "buildsystem": "meson",
            "config-opts": [
                "-Dprofile=development"
            ],
            "sources": [
                {
                    "type": "git",
                    "url": "https://gitlab.gnome.org/World/design/symbolic-preview.git"
                }
            ]
        }
    ]
}
