<?xml version="1.0" encoding="UTF-8"?>
<svg height="16px" viewBox="0 0 16 16" width="16px" xmlns="http://www.w3.org/2000/svg" xmlns:xlink="http://www.w3.org/1999/xlink">
    <filter id="a" height="100%" width="100%" x="0%" y="0%">
        <feColorMatrix in="SourceGraphic" type="matrix" values="0 0 0 0 1 0 0 0 0 1 0 0 0 0 1 0 0 0 1 0"/>
    </filter>
    <mask id="b">
        <g filter="url(#a)">
            <rect fill-opacity="0.1" height="16" width="16"/>
        </g>
    </mask>
    <clipPath id="c">
        <rect height="152" width="192"/>
    </clipPath>
    <mask id="d">
        <g filter="url(#a)">
            <rect fill-opacity="0.2" height="16" width="16"/>
        </g>
    </mask>
    <clipPath id="e">
        <rect height="152" width="192"/>
    </clipPath>
    <mask id="f">
        <g filter="url(#a)">
            <rect fill-opacity="0.2" height="16" width="16"/>
        </g>
    </mask>
    <clipPath id="g">
        <rect height="152" width="192"/>
    </clipPath>
    <mask id="h">
        <g filter="url(#a)">
            <rect fill-opacity="0.1" height="16" width="16"/>
        </g>
    </mask>
    <clipPath id="i">
        <rect height="152" width="192"/>
    </clipPath>
    <mask id="j">
        <g filter="url(#a)">
            <rect fill-opacity="0.33" height="16" width="16"/>
        </g>
    </mask>
    <clipPath id="k">
        <rect height="152" width="192"/>
    </clipPath>
    <mask id="l">
        <g filter="url(#a)">
            <rect fill-opacity="0.25" height="16" width="16"/>
        </g>
    </mask>
    <clipPath id="m">
        <rect height="152" width="192"/>
    </clipPath>
    <mask id="n">
        <g filter="url(#a)">
            <rect fill-opacity="0.8" height="16" width="16"/>
        </g>
    </mask>
    <clipPath id="o">
        <rect height="152" width="192"/>
    </clipPath>
    <mask id="p">
        <g filter="url(#a)">
            <rect fill-opacity="0.05" height="16" width="16"/>
        </g>
    </mask>
    <clipPath id="q">
        <rect height="152" width="192"/>
    </clipPath>
    <mask id="r">
        <g filter="url(#a)">
            <rect fill-opacity="0.05" height="16" width="16"/>
        </g>
    </mask>
    <clipPath id="s">
        <rect height="152" width="192"/>
    </clipPath>
    <mask id="t">
        <g filter="url(#a)">
            <rect fill-opacity="0.05" height="16" width="16"/>
        </g>
    </mask>
    <clipPath id="u">
        <rect height="152" width="192"/>
    </clipPath>
    <mask id="v">
        <g filter="url(#a)">
            <rect fill-opacity="0.05" height="16" width="16"/>
        </g>
    </mask>
    <clipPath id="w">
        <rect height="152" width="192"/>
    </clipPath>
    <mask id="x">
        <g filter="url(#a)">
            <rect fill-opacity="0.2" height="16" width="16"/>
        </g>
    </mask>
    <clipPath id="y">
        <rect height="152" width="192"/>
    </clipPath>
    <mask id="z">
        <g filter="url(#a)">
            <rect fill-opacity="0.1" height="16" width="16"/>
        </g>
    </mask>
    <clipPath id="A">
        <rect height="152" width="192"/>
    </clipPath>
    <g fill="#2e3436">
        <path d="m 6.949219 4.023438 v 2 h 2.921875 c -0.054688 0 0.082031 0.160156 0.082031 0.082031 v 0.921875 h -1.941406 c -1.714844 0 -3.03125 1.128906 -3.054688 2.484375 c -0.011719 0.679687 0.304688 1.363281 0.859375 1.824219 c 0.558594 0.460937 1.316406 0.699218 2.195313 0.699218 h 3.941406 v -5.929687 c 0 -1.167969 -0.886719 -2.082031 -2.082031 -2.082031 z m 1.0625 5.003906 h 1.941406 v 1.007812 h -1.941406 c -0.519531 0 -0.792969 -0.136718 -0.917969 -0.242187 c -0.125 -0.101563 -0.136719 -0.171875 -0.136719 -0.242188 c 0.003907 -0.144531 0.085938 -0.523437 1.054688 -0.523437 z m 0 0"/>
        <path d="m 2.953125 4 v 11.003906 h 1 v -11.003906 z m 0 0"/>
        <path d="m 1.960938 13.027344 v 1 h 10.992187 v -1 z m 0 0"/>
    </g>
    <path d="m 12.976562 16.003906 l -0.03125 -4.949218 l 2.515626 2.484374 z m 0 0" fill="#241f31"/>
    <path d="m 5.925781 4.003906 l -4.949219 0.03125 l 2.488282 -2.511718 z m 0 0" fill="#241f31"/>
    <g clip-path="url(#c)" mask="url(#b)" transform="matrix(1 0 0 1 -168 -16)">
        <path d="m 32 86 h 28 v 2 h -28 z m 0 0"/>
    </g>
    <g clip-path="url(#e)" mask="url(#d)" transform="matrix(1 0 0 1 -168 -16)">
        <path d="m 60 86 h 28 v 2 h -28 z m 0 0"/>
    </g>
    <g clip-path="url(#g)" mask="url(#f)" transform="matrix(1 0 0 1 -168 -16)">
        <path d="m 60 84 h 28 v 2 h -28 z m 0 0"/>
    </g>
    <g clip-path="url(#i)" mask="url(#h)" transform="matrix(1 0 0 1 -168 -16)">
        <path d="m 32 84 h 28 v 2 h -28 z m 0 0"/>
    </g>
    <g clip-path="url(#k)" mask="url(#j)" transform="matrix(1 0 0 1 -168 -16)">
        <path d="m 51.359375 57.386719 l -1.183594 3.824219 l -18.175781 54.789062 v 8 l 8 -4 l 17.820312 -56.425781 l 1.183594 -3.824219 z m 0 0"/>
    </g>
    <g clip-path="url(#m)" mask="url(#l)" transform="matrix(1 0 0 1 -168 -16)">
        <path d="m 68.640625 57.386719 l 1.183594 3.824219 l 18.175781 54.789062 v 8 l -8 -4 l -17.824219 -56.425781 l -1.179687 -3.824219 z m 0 0"/>
    </g>
    <g clip-path="url(#o)" mask="url(#n)" transform="matrix(1 0 0 1 -168 -16)">
        <path d="m 68.640625 54.386719 l 1.183594 3.824219 l 18.175781 55.789062 v 8 l -4 -7 l -19.179688 -59.429688 z m 0 0" fill="#deddda"/>
    </g>
    <g clip-path="url(#q)" mask="url(#p)" transform="matrix(1 0 0 1 -168 -16)">
        <path d="m 32 122.160156 l 4 -7.160156 l 4 3 z m 0 0" fill-rule="evenodd"/>
    </g>
    <g clip-path="url(#s)" mask="url(#r)" transform="matrix(1 0 0 1 -168 -16)">
        <path d="m 88 122.160156 l -4 -7.160156 l -4 3 z m 0 0" fill-rule="evenodd"/>
    </g>
    <g clip-path="url(#u)" mask="url(#t)" transform="matrix(1 0 0 1 -168 -16)">
        <path d="m 32 122.160156 l 4 -7.160156 l -4 -1 z m 0 0" fill-rule="evenodd"/>
    </g>
    <g clip-path="url(#w)" mask="url(#v)" transform="matrix(1 0 0 1 -168 -16)">
        <path d="m 88 122.078125 l -4 -7.15625 l 4 -1 z m 0 0" fill-rule="evenodd"/>
    </g>
    <g clip-path="url(#y)" mask="url(#x)" transform="matrix(1 0 0 1 -168 -16)">
        <path d="m 56 86 v 6 c 0 1.109375 0.890625 2 2 2 h 4 c 1.109375 0 2 -0.890625 2 -2 v -6 z m 0 0"/>
    </g>
    <g clip-path="url(#A)" mask="url(#z)" transform="matrix(1 0 0 1 -168 -16)">
        <path d="m 56 84 v -6 c 0 -1.109375 0.890625 -2 2 -2 h 4 c 1.109375 0 2 0.890625 2 2 v 6 z m 0 0" fill="#ffffff"/>
    </g>
</svg>
