<?xml version="1.0" encoding="UTF-8"?>
<svg height="128px" viewBox="0 0 128 128" width="128px" xmlns="http://www.w3.org/2000/svg" xmlns:xlink="http://www.w3.org/1999/xlink">
    <linearGradient id="a" gradientTransform="matrix(-1 0 0 1 80 -172)" gradientUnits="userSpaceOnUse" x1="34.929741" x2="-32" y1="276" y2="276">
        <stop offset="0" stop-color="#981b29"/>
        <stop offset="0.0347295" stop-color="#871722"/>
        <stop offset="0.110258" stop-color="#a81b28"/>
        <stop offset="0.775258" stop-color="#a31822"/>
        <stop offset="1" stop-color="#dc131c"/>
    </linearGradient>
    <linearGradient id="b" gradientUnits="userSpaceOnUse" x1="108" x2="44" y1="88" y2="88">
        <stop offset="0" stop-color="#b6b4b2"/>
        <stop offset="0.11901" stop-color="#dcdbda"/>
        <stop offset="0.185185" stop-color="#deddda"/>
        <stop offset="0.861111" stop-color="#deddda"/>
        <stop offset="0.973215" stop-color="#b2b0ab"/>
        <stop offset="1" stop-color="#c0bfbc"/>
    </linearGradient>
    <linearGradient id="c" gradientTransform="matrix(0 6 -12 0 -64 37.996872)" gradientUnits="userSpaceOnUse" x1="30" x2="22" y1="276" y2="276">
        <stop offset="0" stop-color="#c01c27"/>
        <stop offset="1" stop-color="#ec1f28"/>
    </linearGradient>
    <filter id="d" height="100%" width="100%" x="0%" y="0%">
        <feColorMatrix in="SourceGraphic" type="matrix" values="0 0 0 0 1 0 0 0 0 1 0 0 0 0 1 0 0 0 1 0"/>
    </filter>
    <mask id="e">
        <g filter="url(#d)">
            <rect fill-opacity="0.385" height="128" width="128"/>
        </g>
    </mask>
    <linearGradient id="f" gradientUnits="userSpaceOnUse">
        <stop offset="0" stop-opacity="0"/>
        <stop offset="1"/>
    </linearGradient>
    <radialGradient id="g" cx="70.471695" cy="104.949509" gradientTransform="matrix(1.836532 0.0207321 -0.00777924 0.689117 -67.235039 42.216484)" r="32" xlink:href="#f"/>
    <clipPath id="h">
        <rect height="152" width="192"/>
    </clipPath>
    <mask id="i">
        <g filter="url(#d)">
            <rect fill-opacity="0.133" height="128" width="128"/>
        </g>
    </mask>
    <linearGradient id="j" gradientUnits="userSpaceOnUse" x1="78" x2="78" y1="100" y2="108">
        <stop offset="0"/>
        <stop offset="1" stop-opacity="0"/>
    </linearGradient>
    <clipPath id="k">
        <rect height="152" width="192"/>
    </clipPath>
    <linearGradient id="l" gradientUnits="userSpaceOnUse" x1="20" x2="36" y1="96" y2="96">
        <stop offset="0" stop-color="#9a9996"/>
        <stop offset="0.5" stop-color="#ebeae9"/>
        <stop offset="1" stop-color="#c0bfbc"/>
    </linearGradient>
    <mask id="m">
        <g filter="url(#d)">
            <rect fill-opacity="0.106" height="128" width="128"/>
        </g>
    </mask>
    <clipPath id="n">
        <rect height="152" width="192"/>
    </clipPath>
    <linearGradient id="o" gradientUnits="userSpaceOnUse" x1="20" x2="108" y1="61" y2="61">
        <stop offset="0" stop-color="#c01c28"/>
        <stop offset="0.0454546" stop-color="#f66151"/>
        <stop offset="0.0909091" stop-color="#ed333b"/>
        <stop offset="0.909091" stop-color="#ed333b"/>
        <stop offset="0.954545" stop-color="#e2200b"/>
        <stop offset="1" stop-color="#e8606a"/>
    </linearGradient>
    <mask id="p">
        <g filter="url(#d)">
            <rect fill-opacity="0.271" height="128" width="128"/>
        </g>
    </mask>
    <radialGradient id="q" cx="59.102005" cy="104.203217" gradientTransform="matrix(0.399032 0.0168258 -0.0290338 0.688549 19.938885 42.506531)" r="32" xlink:href="#f"/>
    <clipPath id="r">
        <rect height="152" width="192"/>
    </clipPath>
    <path d="m 124 36 h -66 l -8 8 v 64 c 0 8 8 8 8 8 h 66 l -8 -42 z m 0 0" fill="url(#a)" fill-rule="evenodd"/>
    <path d="m 108 92 v -56 h 4.199219 c -2.269531 17.550781 -2.191407 35.40625 0.234375 52.9375 c 0.277344 2.015625 0.589844 4.035156 0.519531 6.066406 s -0.542969 4.097656 -1.707031 5.765625 c -0.917969 1.316407 -2.230469 2.324219 -3.667969 3.03125 c -1.441406 0.707031 -3.007813 1.125 -4.59375 1.375 c -3.167969 0.503907 -6.394531 0.417969 -9.601563 0.417969 h -31.742187 c -1.257813 0 -2.527344 0.011719 -3.757813 0.277344 c -1.230468 0.261718 -2.421874 0.777344 -3.378906 1.59375 c -0.957031 0.8125 -1.671875 1.921875 -1.972656 3.144531 s -0.1875 2.542969 0.324219 3.691406 c -1.820313 -1.539062 -2.898438 -3.917969 -2.855469 -6.300781 c 0.023438 -1.253906 0.34375 -2.5 0.945312 -3.601562 c 0.601563 -1.097657 1.480469 -2.042969 2.523438 -2.734376 c 1.046875 -0.691406 2.246094 -1.125 3.480469 -1.351562 s 2.492187 -0.242188 3.746093 -0.25 l 37.363282 -0.171875 c 1.21875 -0.003906 2.445312 -0.019531 3.644531 -0.242187 c 1.199219 -0.222657 2.367187 -0.652344 3.371094 -1.34375 c 1.003906 -0.6875 1.835937 -1.636719 2.351562 -2.742188 c 0.519531 -1.101562 0.722657 -2.351562 0.574219 -3.5625 z m 0 0" fill="#821717" fill-opacity="0.315353"/>
    <path d="m 58 20 v 64 h -8 v 24 c 0 -4.417969 3.582031 -8 8 -8 h 42 s 8 0 8 -8 v -64 l -8 -8 z m 0 0" fill="url(#b)" fill-rule="evenodd"/>
    <path d="m 4 36 h 32 l 6 72 c 0 8 -8 8 -8 8 h -30 l 8 -42 z m 0 0" fill="url(#c)" fill-rule="evenodd"/>
    <g clip-path="url(#h)" mask="url(#e)" transform="matrix(1 0 0 1 -8 -16)">
        <path d="m 66 41.355469 h -8 v 82.644531 c 0 -4.417969 3.582031 -8 8 -8 h 42 s 8 0 8 -8 v -64 z m 0 0" fill="url(#g)" fill-rule="evenodd"/>
    </g>
    <g clip-path="url(#k)" mask="url(#i)" transform="matrix(1 0 0 1 -8 -16)">
        <path d="m 58 94 v 16.71875 s 4.035156 -6.71875 8.632812 -6.71875 h 41.367188 c 5.996094 0 8 2.847656 8 4.71875 v -6.71875 c 0 -4.433594 -3.566406 -8 -8 -8 z m 0 0" fill="url(#j)"/>
    </g>
    <path d="m 28 84 c -4.417969 0 -8 3.582031 -8 8 s 3.582031 8 8 8 h 6 c 5 0 8 3.921875 8 8 v -24 z m 0 0" fill="url(#l)"/>
    <g clip-path="url(#n)" mask="url(#m)" transform="matrix(1 0 0 1 -8 -16)">
        <path d="m 50 94 v 16.539062 s -7.988281 -6.539062 -14 -6.539062 c -5.996094 0 -8 2.847656 -8 4.71875 v -6.71875 c 0 -4.433594 3.566406 -8 8 -8 z m 0 0" fill="url(#j)"/>
    </g>
    <path d="m 28 16 c -4.433594 0 -8 3.566406 -8 8 v 68 c 0 -4.433594 3.566406 -8 8 -8 h 72 c 4.433594 0 8 3.566406 8 8 v -68 c 0 -4.433594 -3.566406 -8 -8 -8 z m 0 0" fill="url(#o)"/>
    <g clip-path="url(#r)" mask="url(#p)" transform="matrix(1 0 0 1 -8 -16)">
        <path d="m 36 100 c -4.417969 0 -8 3.582031 -8 8 s 3 11 12 11 h 4 c 3.554688 0 6 2.988281 6 5 v -24 z m 0 0" fill="url(#q)"/>
    </g>
    <g fill="#ffffff">
        <path d="m 71.859375 47.738281 c -1.296875 0.9375 -5.316406 -3.152343 -6.917969 -3.15625 c -1.601562 -0.007812 -5.660156 4.046875 -6.949218 3.097657 c -1.292969 -0.945313 1.351562 -6.03125 0.863281 -7.554688 c -0.488281 -1.527344 -5.597657 -4.132812 -5.097657 -5.652344 c 0.5 -1.519531 6.15625 -0.578125 7.457032 -1.511718 c 1.296875 -0.9375 2.199218 -6.601563 3.800781 -6.59375 c 1.597656 0.003906 2.449219 5.675781 3.742187 6.621093 c 1.289063 0.945313 6.953126 0.050781 7.445313 1.578125 c 0.488281 1.523438 -4.640625 4.085938 -5.144531 5.605469 c -0.5 1.519531 2.101562 6.628906 0.800781 7.566406 z m 0 0"/>
        <path d="m 57.136719 70.824219 c -1.300781 0.933593 -5.320313 -3.152344 -6.921875 -3.160157 c -1.601563 -0.007812 -5.65625 4.046876 -6.949219 3.101563 c -1.289063 -0.945313 1.355469 -6.035156 0.863281 -7.558594 c -0.488281 -1.523437 -5.59375 -4.128906 -5.09375 -5.652343 c 0.5 -1.519532 6.15625 -0.578126 7.453125 -1.511719 c 1.300781 -0.9375 2.199219 -6.601563 3.800781 -6.59375 c 1.601563 0.007812 2.453126 5.675781 3.742188 6.621093 c 1.292969 0.949219 6.957031 0.054688 7.445312 1.578126 c 0.488282 1.523437 -4.640624 4.085937 -5.140624 5.605468 c -0.5 1.523438 2.101562 6.632813 0.800781 7.570313 z m 0 0"/>
        <path d="m 86.675781 70.824219 c -1.296875 0.933593 -5.320312 -3.152344 -6.917969 -3.160157 c -1.601562 -0.007812 -5.660156 4.046876 -6.953124 3.101563 c -1.289063 -0.945313 1.355468 -6.035156 0.867187 -7.558594 c -0.488281 -1.523437 -5.597656 -4.128906 -5.097656 -5.652343 c 0.5 -1.519532 6.15625 -0.578126 7.457031 -1.511719 c 1.296875 -0.9375 2.195312 -6.601563 3.796875 -6.59375 c 1.601563 0.007812 2.453125 5.675781 3.746094 6.621093 c 1.289062 0.949219 6.953125 0.054688 7.441406 1.578126 c 0.492187 1.523437 -4.640625 4.085937 -5.140625 5.605468 c -0.5 1.523438 2.101562 6.632813 0.800781 7.570313 z m 0 0"/>
    </g>
</svg>
