<?xml version="1.0" encoding="UTF-8"?>
<svg xmlns="http://www.w3.org/2000/svg" xmlns:xlink="http://www.w3.org/1999/xlink" width="16px" height="16px" viewBox="0 0 16 16" version="1.1">
<defs>
<filter id="alpha" filterUnits="objectBoundingBox" x="0%" y="0%" width="100%" height="100%">
  <feColorMatrix type="matrix" in="SourceGraphic" values="0 0 0 0 1 0 0 0 0 1 0 0 0 0 1 0 0 0 1 0"/>
</filter>
<mask id="mask0">
  <g filter="url(#alpha)">
<rect x="0" y="0" width="16" height="16" style="fill:rgb(0%,0%,0%);fill-opacity:0.385;stroke:none;"/>
  </g>
</mask>
<radialGradient id="radial0" gradientUnits="userSpaceOnUse" cx="70.471695" cy="104.949509" fx="70.471695" fy="104.949509" r="32" gradientTransform="matrix(1.836532,0.0207321,-0.00777924,0.689117,-67.235039,42.216484)">
<stop offset="0" style="stop-color:rgb(0%,0%,0%);stop-opacity:0;"/>
<stop offset="1" style="stop-color:rgb(0%,0%,0%);stop-opacity:1;"/>
</radialGradient>
<clipPath id="clip1">
  <rect x="0" y="0" width="192" height="152"/>
</clipPath>
<g id="surface199587" clip-path="url(#clip1)">
<path style=" stroke:none;fill-rule:evenodd;fill:url(#radial0);" d="M 66 41.355469 L 58 41.355469 L 58 124 C 58 119.582031 61.582031 116 66 116 L 108 116 C 108 116 116 116 116 108 L 116 44 Z M 66 41.355469 "/>
</g>
<mask id="mask1">
  <g filter="url(#alpha)">
<rect x="0" y="0" width="16" height="16" style="fill:rgb(0%,0%,0%);fill-opacity:0.133;stroke:none;"/>
  </g>
</mask>
<linearGradient id="linear0" gradientUnits="userSpaceOnUse" x1="70" y1="256" x2="70" y2="264" gradientTransform="matrix(1,0,0,1,8,-156)">
<stop offset="0" style="stop-color:rgb(0%,0%,0%);stop-opacity:1;"/>
<stop offset="1" style="stop-color:rgb(0%,0%,0%);stop-opacity:0;"/>
</linearGradient>
<clipPath id="clip2">
  <rect x="0" y="0" width="192" height="152"/>
</clipPath>
<g id="surface199590" clip-path="url(#clip2)">
<path style=" stroke:none;fill-rule:nonzero;fill:url(#linear0);" d="M 58 94 L 58 110.71875 C 58 110.71875 62.035156 104 66.632812 104 L 108 104 C 113.996094 104 116 106.847656 116 108.71875 L 116 102 C 116 97.566406 112.433594 94 108 94 Z M 58 94 "/>
</g>
<mask id="mask2">
  <g filter="url(#alpha)">
<rect x="0" y="0" width="16" height="16" style="fill:rgb(0%,0%,0%);fill-opacity:0.106;stroke:none;"/>
  </g>
</mask>
<linearGradient id="linear1" gradientUnits="userSpaceOnUse" x1="70" y1="256" x2="70" y2="264" gradientTransform="matrix(1,0,0,1,8,-156)">
<stop offset="0" style="stop-color:rgb(0%,0%,0%);stop-opacity:1;"/>
<stop offset="1" style="stop-color:rgb(0%,0%,0%);stop-opacity:0;"/>
</linearGradient>
<clipPath id="clip3">
  <rect x="0" y="0" width="192" height="152"/>
</clipPath>
<g id="surface199593" clip-path="url(#clip3)">
<path style=" stroke:none;fill-rule:nonzero;fill:url(#linear1);" d="M 50 94 L 50 110.539062 C 50 110.539062 42.011719 104 36 104 C 30.003906 104 28 106.847656 28 108.71875 L 28 102 C 28 97.566406 31.566406 94 36 94 Z M 50 94 "/>
</g>
<mask id="mask3">
  <g filter="url(#alpha)">
<rect x="0" y="0" width="16" height="16" style="fill:rgb(0%,0%,0%);fill-opacity:0.271;stroke:none;"/>
  </g>
</mask>
<radialGradient id="radial1" gradientUnits="userSpaceOnUse" cx="59.102005" cy="104.203217" fx="59.102005" fy="104.203217" r="32" gradientTransform="matrix(0.399032,0.0168258,-0.0290338,0.688549,19.938885,42.506531)">
<stop offset="0" style="stop-color:rgb(0%,0%,0%);stop-opacity:0;"/>
<stop offset="1" style="stop-color:rgb(0%,0%,0%);stop-opacity:1;"/>
</radialGradient>
<clipPath id="clip4">
  <rect x="0" y="0" width="192" height="152"/>
</clipPath>
<g id="surface199596" clip-path="url(#clip4)">
<path style=" stroke:none;fill-rule:nonzero;fill:url(#radial1);" d="M 36 100 C 31.582031 100 28 103.582031 28 108 C 28 112.417969 31 119 40 119 L 44 119 C 47.554688 119 50 121.988281 50 124 L 50 100 Z M 36 100 "/>
</g>
</defs>
<g id="surface199583">
<use xlink:href="#surface199587" transform="matrix(1,0,0,1,-168,-16)" mask="url(#mask0)"/>
<use xlink:href="#surface199590" transform="matrix(1,0,0,1,-168,-16)" mask="url(#mask1)"/>
<use xlink:href="#surface199593" transform="matrix(1,0,0,1,-168,-16)" mask="url(#mask2)"/>
<use xlink:href="#surface199596" transform="matrix(1,0,0,1,-168,-16)" mask="url(#mask3)"/>
<path style=" stroke:none;fill-rule:nonzero;fill:rgb(14.117648%,12.156863%,19.215687%);fill-opacity:1;" d="M 10 0 C 8.347656 0 7 1.347656 7 3 L 7 4 L 6 4 C 6 2.507812 4.582031 1 3 1 L 0 1 L 2 7 L 0 13 L 1.964844 13 C 4 13 5 14.410156 5 16 L 14.90625 16 C 15.511719 16 16 15.511719 16 14.90625 L 16 5.09375 C 16 4.488281 15.511719 4 14.90625 4 L 13 4 L 13 3 C 13 1.347656 11.652344 0 10 0 Z M 10 1 C 11.117188 1 12 1.882812 12 3 L 12 4 L 8 4 L 8 3 C 8 1.882812 8.882812 1 10 1 Z M 7.46875 5 C 7.753906 5 8 5.222656 8 5.5 C 8 5.777344 7.753906 6 7.46875 6 C 7.183594 6 6.96875 5.777344 6.96875 5.5 C 6.96875 5.222656 7.183594 5 7.46875 5 Z M 12.46875 5 C 12.753906 5 13 5.222656 13 5.5 C 13 5.777344 12.753906 6 12.46875 6 C 12.183594 6 11.96875 5.777344 11.96875 5.5 C 11.96875 5.222656 12.183594 5 12.46875 5 Z M 12.46875 5 "/>
</g>
</svg>
