<?xml version="1.0" encoding="utf-8"?>
<svg xmlns="http://www.w3.org/2000/svg" xmlns:xlink="http://www.w3.org/1999/xlink">
    <symbol id="anchor" viewBox="0 0 16 16" xmlns="http://www.w3.org/2000/svg">
        <path d="m3.998 1.9941c-2.1981 0-4 1.8019-4 4a4.0033 4.0033 0 0 0 2.6836 3.7812l0.6543-1.8906c-0.77905-0.27002-1.3359-0.99957-1.3359-1.8906 0-1.1251 0.87393-2 2-2h3c1.1251 0 2 0.87493 2 2 0 0.84106-0.49889 1.5368-1.2109 1.8398l0.78711 1.8398a4.0043 4.0043 0 0 0 2.4238-3.6797c0-2.1981-1.8018-4-4.002-4h-3zm8.4375 4.2656-0.7168 1.8672c0.74905 0.28702 1.2812 0.99913 1.2812 1.8672 0 1.1251-0.87493 2-2 2h-3.002c-1.1251 0-2-0.87493-2-2a1.9831 1.9831 0 0 1 1.1836-1.8262l-0.81836-1.8281c-1.3981 0.62404-2.3652 2.0342-2.3652 3.6543 0 2.1991 1.8009 4 4 4h3.002c2.1991 0 4-1.8009 4-4a4.0033 4.0033 0 0 0-2.5645-3.7344z" fill="#2e3436"/>
    </symbol>
    <symbol id="link" viewBox="0 0 16 16" xmlns="http://www.w3.org/2000/svg">
        <path d="m8 2v1a1 1 0 0 0 1 1h1.5742l-2.7793 2.7598a1 1 0 0 0-0.0039063 1.4141 1 1 0 0 0 1.4141 0.0039063l2.7949-2.7754v1.5977a1 1 0 0 0 1 1h1v-1-3.998a1 1 0 0 0 0-0.0019531v-1h-1-4-1zm-6 1v11h11v-4h-2v2h-7v-7h2v-2h-4z" fill="#2e3436"/>
    </symbol>
</svg>