<?xml version="1.0" encoding="UTF-8" standalone="no"?>
<!-- Created with Inkscape (http://www.inkscape.org/) -->

<svg
   width="1920"
   height="1080"
   viewBox="0 0 1920 1080"
   version="1.1"
   id="svg5"
   inkscape:version="1.4 (e7c3feb100, 2024-10-09)"
   xml:space="preserve"
   sodipodi:docname="og-image.source.svg"
   xmlns:inkscape="http://www.inkscape.org/namespaces/inkscape"
   xmlns:sodipodi="http://sodipodi.sourceforge.net/DTD/sodipodi-0.dtd"
   xmlns:xlink="http://www.w3.org/1999/xlink"
   xmlns="http://www.w3.org/2000/svg"
   xmlns:svg="http://www.w3.org/2000/svg"><sodipodi:namedview
     id="namedview7"
     pagecolor="#ffffff"
     bordercolor="#000000"
     borderopacity="0.25"
     inkscape:showpageshadow="true"
     inkscape:pageopacity="0.0"
     inkscape:pagecheckerboard="false"
     inkscape:deskcolor="#181818"
     inkscape:document-units="px"
     showgrid="false"
     inkscape:zoom="0.38137935"
     inkscape:cx="896.74493"
     inkscape:cy="-246.47375"
     inkscape:current-layer="layer1" /><defs
     id="defs2"><linearGradient
       id="linearGradient1"
       inkscape:collect="always"><stop
         style="stop-color:#1a5fb4;stop-opacity:1;"
         offset="0"
         id="stop1" /><stop
         style="stop-color:#26a269;stop-opacity:1;"
         offset="1"
         id="stop2" /></linearGradient><linearGradient
       inkscape:collect="always"
       xlink:href="#linearGradient1"
       id="linearGradient2"
       x1="-7.6750202"
       y1="539.99994"
       x2="1927.6737"
       y2="539.99994"
       gradientUnits="userSpaceOnUse"
       gradientTransform="translate(0)" /><clipPath
       clipPathUnits="userSpaceOnUse"
       id="clipPath2"><rect
         style="fill:url(#linearGradient3);stroke-width:10"
         id="rect3"
         width="1920"
         height="1080"
         x="0"
         y="0" /></clipPath><linearGradient
       inkscape:collect="always"
       xlink:href="#linearGradient1"
       id="linearGradient3"
       gradientUnits="userSpaceOnUse"
       x1="-7.6750202"
       y1="539.99994"
       x2="1927.6737"
       y2="539.99994" /></defs><g
     inkscape:label="Layer 1"
     inkscape:groupmode="layer"
     id="layer1"><rect
       style="fill:url(#linearGradient2);stroke-width:10"
       id="rect1"
       width="1920"
       height="1080"
       x="0"
       y="0" /><text
       xml:space="preserve"
       style="font-style:normal;font-variant:normal;font-weight:900;font-stretch:normal;font-size:113.547px;line-height:1;font-family:'Inter Variable';-inkscape-font-specification:'Inter Variable Heavy';text-align:center;letter-spacing:0px;text-anchor:middle;white-space:pre;inline-size:834.81;fill:#ffffff;stroke-width:8.57832"
       x="652.46417"
       y="529.02228"
       id="text2"
       transform="matrix(1.3359909,0,0,1.3359909,86.75714,-1.9049633)"><tspan
         x="652.46417"
         y="529.02228"
         id="tspan2">This Week in<tspan
   y="529.02228"
   id="tspan5"> </tspan></tspan><tspan
         x="652.46417"
         y="642.56924"
         id="tspan6">GNOME</tspan></text><path
       d="m 823.14122,274.39081 v 153.958 c 0,37.62083 30.8053,68.42577 68.4258,68.42577 H 1045.525 v -0.60214 c 29.4025,-4.27662 51.9882,-30.20366 51.3193,-60.54074 v -92.8158 c 0,-28.33255 -22.9859,-51.31933 -51.3193,-51.31933 h -34.2129 v -17.10645 c 0,-28.33255 -22.98588,-51.31933 -51.31928,-51.31933 h -85.5323 c -28.3317,0 -51.3193,22.98678 -51.3193,51.31933 z m 51.3193,-17.10645 h 85.5323 c 9.4222,0 17.1064,7.68456 17.1064,17.10645 v 161.57567 c 0,9.55548 2.3384,18.50968 6.2815,26.59521 h -91.8137 c -19.1113,0 -34.2129,-15.10191 -34.2129,-34.21288 v -153.958 c 0,-9.42189 7.6842,-17.10645 17.1064,-17.10645 z m 0,17.10645 v 34.21289 h 85.5323 v -34.21289 z m 0,51.31933 v 17.10644 h 85.5323 v -17.10644 z m 136.85158,0 h 34.2129 c 9.4222,0 17.1064,7.68456 17.1064,17.10644 v 93.55087 c 0.3421,14.29979 -10.6248,25.72638 -24.9241,26.12736 -14.768,-0.13685 -26.3952,-11.6938 -26.3952,-26.52833 z m -136.85158,34.21289 v 17.10644 h 85.5323 v -17.10644 z m 0,34.21289 v 17.10644 h 85.5323 v -17.10644 z m 0,0"
       fill="#222222"
       id="path1"
       style="fill:#ffffff;fill-opacity:1;stroke-width:17.1064" /></g></svg>
