<?xml version="1.0" encoding="UTF-8" standalone="no"?>
<svg
   width="1024"
   height="160"
   version="1.1"
   id="svg91"
   sodipodi:docname="search-everywhere-large.svg"
   inkscape:version="1.3.2 (091e20ef0f, 2023-11-25)"
   xmlns:inkscape="http://www.inkscape.org/namespaces/inkscape"
   xmlns:sodipodi="http://sodipodi.sourceforge.net/DTD/sodipodi-0.dtd"
   xmlns="http://www.w3.org/2000/svg"
   xmlns:svg="http://www.w3.org/2000/svg">
  <sodipodi:namedview
     id="namedview91"
     pagecolor="#505050"
     bordercolor="#ffffff"
     borderopacity="1"
     inkscape:showpageshadow="0"
     inkscape:pageopacity="0"
     inkscape:pagecheckerboard="1"
     inkscape:deskcolor="#d1d1d1"
     inkscape:current-layer="svg91"
     showgrid="false">
    <inkscape:grid
       id="grid1"
       units="px"
       originx="0"
       originy="0"
       spacingx="1"
       spacingy="1"
       empcolor="#3f3fff"
       empopacity="0.25098039"
       color="#3f3fff"
       opacity="0.1254902"
       empspacing="5"
       dotted="false"
       gridanglex="30"
       gridanglez="30"
       visible="false" />
  </sodipodi:namedview>
  <defs
     id="defs18">
    <marker
       id="d"
       orient="auto"
       overflow="visible"
       refX="0"
       refY="0">
      <path
         fill="#ffffff"
         fill-rule="evenodd"
         stroke="#ffffff"
         stroke-width="0.4pt"
         d="m -2.308,0 3.46,-2 v 4 z"
         id="path1" />
    </marker>
    <marker
       id="e"
       orient="auto"
       overflow="visible"
       refX="0"
       refY="0">
      <path
         fill="#ffffff"
         fill-rule="evenodd"
         stroke="#ffffff"
         stroke-width="0.4pt"
         d="m 2.308,0 -3.46,2 v -4 z"
         id="path2" />
    </marker>
    <marker
       id="f"
       orient="auto"
       overflow="visible"
       refX="0"
       refY="0">
      <path
         fill="#ffffff"
         fill-rule="evenodd"
         stroke="#ffffff"
         stroke-width="0.4pt"
         d="m 2.308,0 -3.46,2 v -4 z"
         id="path3" />
    </marker>
    <marker
       id="g"
       orient="auto"
       overflow="visible"
       refX="0"
       refY="0">
      <path
         fill="#ffffff"
         fill-rule="evenodd"
         stroke="#ffffff"
         stroke-width="0.4pt"
         d="m 2.308,0 -3.46,2 v -4 z"
         id="path4" />
    </marker>
    <marker
       id="h"
       orient="auto"
       overflow="visible"
       refX="0"
       refY="0">
      <path
         fill="#ffffff"
         fill-rule="evenodd"
         stroke="#ffffff"
         stroke-width="0.4pt"
         d="m 2.308,0 -3.46,2 v -4 z"
         id="path5" />
    </marker>
    <marker
       id="i"
       orient="auto"
       overflow="visible"
       refX="0"
       refY="0"
       viewBox="0 0 4.2595265 4.9243081"
       markerWidth="4.2595267"
       markerHeight="4.9243083"
       preserveAspectRatio="xMidYMid">
      <path
         fill="#ffffff"
         fill-rule="evenodd"
         stroke="#ffffff"
         stroke-width="0.4pt"
         d="m 2.308,0 -3.46,2 v -4 z"
         id="path6" />
    </marker>
    <marker
       id="j"
       orient="auto"
       overflow="visible"
       refX="0"
       refY="0">
      <path
         fill="#ffffff"
         fill-rule="evenodd"
         stroke="#ffffff"
         stroke-width="0.4pt"
         d="m -2.308,0 3.46,-2 v 4 z"
         id="path7" />
    </marker>
    <marker
       id="k"
       orient="auto"
       overflow="visible"
       refX="0"
       refY="0">
      <path
         fill="#ffffff"
         fill-rule="evenodd"
         stroke="#ffffff"
         stroke-width="0.4pt"
         d="m 2.308,0 -3.46,2 v -4 z"
         id="path8" />
    </marker>
    <marker
       id="l"
       orient="auto"
       overflow="visible"
       refX="0"
       refY="0">
      <path
         fill="#ffffff"
         fill-rule="evenodd"
         stroke="#ffffff"
         stroke-width="0.4pt"
         d="m -2.308,0 3.46,-2 v 4 z"
         id="path9" />
    </marker>
    <marker
       id="m"
       orient="auto"
       overflow="visible"
       refX="0"
       refY="0">
      <path
         fill="#ffffff"
         fill-rule="evenodd"
         stroke="#ffffff"
         stroke-width="0.4pt"
         d="m 2.308,0 -3.46,2 v -4 z"
         id="path10" />
    </marker>
    <marker
       id="n"
       orient="auto"
       overflow="visible"
       refX="0"
       refY="0">
      <path
         fill="#ffffff"
         fill-rule="evenodd"
         stroke="#ffffff"
         stroke-width="0.4pt"
         d="m -2.308,0 3.46,-2 v 4 z"
         id="path11" />
    </marker>
    <marker
       id="o"
       orient="auto"
       overflow="visible"
       refX="0"
       refY="0">
      <path
         fill="#ffffff"
         fill-rule="evenodd"
         stroke="#ffffff"
         stroke-width="0.4pt"
         d="m 2.308,0 -3.46,2 v -4 z"
         id="path12" />
    </marker>
    <marker
       id="c"
       orient="auto"
       overflow="visible"
       refX="0"
       refY="0">
      <path
         fill="#ffffff"
         fill-rule="evenodd"
         stroke="#ffffff"
         stroke-width="0.4pt"
         d="m -2.308,0 3.46,-2 v 4 z"
         id="path13" />
    </marker>
    <marker
       id="p"
       orient="auto"
       overflow="visible"
       refX="0"
       refY="0"
       viewBox="0 0 4.2595265 4.9243081"
       markerWidth="4.2595267"
       markerHeight="4.9243083"
       preserveAspectRatio="xMidYMid">
      <path
         fill="#ffffff"
         fill-rule="evenodd"
         stroke="#ffffff"
         stroke-width="0.4pt"
         d="m 2.308,0 -3.46,2 v -4 z"
         id="path14" />
    </marker>
    <linearGradient
       id="b">
      <stop
         offset="0"
         style="stop-color:#3584e4;stop-opacity:1"
         id="stop14" />
      <stop
         offset="1"
         style="stop-color:#8ff0a4;stop-opacity:1"
         id="stop15" />
    </linearGradient>
    <linearGradient
       id="a">
      <stop
         offset="0"
         style="stop-color:#fff;stop-opacity:1"
         id="stop16" />
      <stop
         offset=".4"
         style="stop-color:#fff;stop-opacity:1"
         id="stop17" />
      <stop
         offset="1"
         style="stop-color:#f6f5f4;stop-opacity:1"
         id="stop18" />
    </linearGradient>
    <marker
       id="c-3"
       orient="auto"
       overflow="visible"
       refX="0"
       refY="0">
      <path
         fill="#ffffff"
         fill-rule="evenodd"
         stroke="#ffffff"
         stroke-width="0.4pt"
         d="m -2.308,0 3.46,-2 v 4 z"
         id="path13-6" />
    </marker>
    <marker
       id="i-7"
       orient="auto"
       overflow="visible"
       refX="0"
       refY="0"
       viewBox="0 0 4.2595265 4.9243081"
       markerWidth="4.2595267"
       markerHeight="4.9243083"
       preserveAspectRatio="xMidYMid">
      <path
         fill="#ffffff"
         fill-rule="evenodd"
         stroke="#ffffff"
         stroke-width="0.4pt"
         d="m 2.308,0 -3.46,2 v -4 z"
         id="path6-5" />
    </marker>
    <rect
       x="-32.15834"
       y="1078.1389"
       width="373.42297"
       height="148.50603"
       id="rect1" />
    <rect
       x="-32.15834"
       y="1078.1389"
       width="121.55578"
       height="171.61559"
       id="rect78" />
    <rect
       x="-32.15834"
       y="1078.1389"
       width="121.55578"
       height="171.61559"
       id="rect79" />
    <rect
       x="-32.15834"
       y="1078.1389"
       width="121.55578"
       height="171.61559"
       id="rect80" />
    <rect
       x="-32.15834"
       y="1078.1389"
       width="121.55578"
       height="171.61559"
       id="rect81" />
    <rect
       x="-32.15834"
       y="1078.1389"
       width="121.55578"
       height="171.61559"
       id="rect82" />
    <rect
       x="-32.15834"
       y="1078.1389"
       width="121.55578"
       height="171.61559"
       id="rect83" />
    <inkscape:path-effect
       effect="fillet_chamfer"
       id="path-effect84"
       is_visible="true"
       lpeversion="1"
       nodesatellites_param="F,0,0,1,0,2,0,1 @ F,0,0,1,0,2,0,1 @ F,0,1,1,0,0.99999,0,1 @ F,0,1,1,0,0.99999,0,1 @ F,0,0,1,0,0.99999,0,1"
       unit="px"
       method="auto"
       mode="F"
       radius="2"
       chamfer_steps="1"
       flexible="false"
       use_knot_distance="true"
       apply_no_radius="true"
       apply_with_radius="true"
       only_selected="false"
       hide_knots="false" />
    <inkscape:path-effect
       effect="join_type"
       id="path-effect86"
       is_visible="true"
       lpeversion="1"
       linecap_type="butt"
       line_width="2"
       linejoin_type="extrp_arc"
       miter_limit="100"
       attempt_force_join="true" />
    <inkscape:path-effect
       effect="join_type"
       id="path-effect88"
       is_visible="true"
       lpeversion="1"
       linecap_type="round"
       line_width="2.00001"
       linejoin_type="round"
       miter_limit="100"
       attempt_force_join="true" />
  </defs>
  <path
     d="m -8.809,-10.34 h 1050.87 V 206.74 H -8.809 Z"
     style="font-variation-settings:'wght' 300;fill:#3584e4;fill-opacity:0.326092;stroke:none;stroke-width:1.12447px;-inkscape-stroke:none;stop-color:#000000"
     id="path18" />
  <g
     id="g1"
     transform="matrix(0.99932643,0,0,0.99416828,-0.27827333,-0.66265872)"
     style="stroke-width:1.00327">
    <rect
       style="color:#000000;display:inline;overflow:visible;visibility:visible;fill:#df9c9d;fill-opacity:0;fill-rule:nonzero;stroke:#df9c9d;stroke-width:1.00327;stroke-linecap:butt;stroke-linejoin:miter;stroke-miterlimit:4;stroke-dasharray:none;stroke-dashoffset:0;stroke-opacity:0;marker:none;enable-background:accumulate"
       id="rect692806"
       width="26.90563"
       height="26.905624"
       x="659.4032"
       y="75.287323"
       rx="4.891932"
       ry="4.891932"
       inkscape:export-filename="/home/lapo.fedora/SparkleShare/gnome-mockups/content selection/content-selection.png"
       inkscape:export-xdpi="90"
       inkscape:export-ydpi="90" />
    <rect
       style="color:#000000;display:inline;overflow:visible;visibility:visible;fill:#df9c9d;fill-opacity:0;fill-rule:nonzero;stroke:#df9c9d;stroke-width:1.00327;stroke-linecap:butt;stroke-linejoin:miter;stroke-miterlimit:4;stroke-dasharray:none;stroke-dashoffset:0;stroke-opacity:0;marker:none;enable-background:accumulate"
       id="rect692808"
       width="26.90563"
       height="26.905624"
       x="659.4032"
       y="75.287323"
       rx="4.891932"
       ry="4.891932"
       inkscape:export-filename="/home/lapo.fedora/SparkleShare/gnome-mockups/content selection/content-selection.png"
       inkscape:export-xdpi="90"
       inkscape:export-ydpi="90" />
    <g
       inkscape:label="go next following arrow right back"
       id="g692816"
       transform="matrix(0,0.81532199,0.81532199,0,508.99299,-50.79276)"
       style="stroke-width:1.23051">
      <title
         id="title692810">go-next</title>
      <path
         d="m 165.13672,199.00391 a 1,1 0 0 0 -0.70899,0.29296 1,1 0 0 0 0,1.41407 l 6,6 a 1.0001,1.0001 0 0 0 1.41602,0 l 6,-6 a 1,1 0 0 0 0,-1.41407 1,1 0 0 0 -1.41602,0 l -5.29101,5.29297 -5.29297,-5.29297 a 1,1 0 0 0 -0.70703,-0.29296 z"
         id="path692812"
         style="fill:#2e3436;fill-opacity:1;stroke-width:1.23051" />
      <rect
         y="195.00317"
         x="163.1358"
         height="16"
         width="16"
         id="rect692814"
         style="fill:none;fill-opacity:1;stroke-width:1.23051" />
    </g>
    <g
       inkscape:label="go previous arrow left back"
       id="g692824"
       transform="matrix(0,0.81532199,-0.81532199,0,810.66728,-50.79276)"
       style="stroke-width:1.23051">
      <title
         id="title692818">go-previous</title>
      <path
         d="m 165.13672,199.00391 a 1,1 0 0 0 -0.70899,0.29296 1,1 0 0 0 0,1.41407 l 6,6 a 1.0001,1.0001 0 0 0 1.41602,0 l 6,-6 a 1,1 0 0 0 0,-1.41407 1,1 0 0 0 -1.41602,0 l -5.29101,5.29297 -5.29297,-5.29297 a 1,1 0 0 0 -0.70703,-0.29296 z"
         id="path692820"
         style="fill:#2e3436;fill-opacity:1;stroke-width:1.23051" />
      <rect
         y="195.00317"
         x="163.1358"
         height="16"
         width="16"
         id="rect692822"
         style="fill:none;fill-opacity:1;stroke-width:1.23051" />
    </g>
    <rect
       inkscape:export-ydpi="90"
       inkscape:export-xdpi="90"
       style="display:inline;fill:#000000;fill-opacity:0.283919;stroke:#fafafa;stroke-width:0;stroke-miterlimit:4;stroke-dasharray:none;stroke-opacity:1"
       id="rect692562"
       width="717.48328"
       height="123.7215"
       x="444.57773"
       y="61.018501"
       rx="15.539727"
       ry="15.539727" />
    <rect
       inkscape:export-ydpi="90"
       inkscape:export-xdpi="90"
       style="display:inline;fill:#ffffff;fill-opacity:1;stroke:#fafafa;stroke-width:0;stroke-miterlimit:4;stroke-dasharray:none;stroke-opacity:1"
       id="rect692564"
       width="701.01178"
       height="115.56835"
       x="452.89542"
       y="69.171654"
       rx="7.3378973"
       ry="7.3378973" />
    <rect
       style="color:#000000;display:inline;overflow:visible;visibility:visible;fill:#e01b24;fill-opacity:0;fill-rule:nonzero;stroke:#e01b24;stroke-width:1.00327;stroke-linecap:butt;stroke-linejoin:miter;stroke-miterlimit:4;stroke-dasharray:none;stroke-dashoffset:0;stroke-opacity:0;marker:none;enable-background:accumulate"
       id="rect692790"
       width="26.90563"
       height="26.905624"
       x="1120.876"
       y="75.287323"
       rx="4.891932"
       ry="4.891932"
       inkscape:export-filename="/home/lapo.fedora/SparkleShare/gnome-mockups/content selection/content-selection.png"
       inkscape:export-xdpi="90"
       inkscape:export-ydpi="90" />
    <circle
       style="fill:#000000;fill-opacity:0.0769432;stroke:#646464;stroke-width:0;stroke-linecap:round;stroke-dasharray:none;stroke-opacity:0.621392"
       id="circle692792"
       cx="1134.3291"
       cy="88.739883"
       r="8.9685402" />
    <g
       inkscape:label="window controls close quit"
       id="g692800"
       transform="matrix(0.81532199,0,0,0.81532199,1127.8236,82.21476)"
       style="stroke-width:1.23051">
      <title
         id="title692794">window-close</title>
      <rect
         id="rect692796"
         y="0"
         x="0"
         height="16"
         width="16"
         style="fill:none;stroke-width:1.23051" />
      <path
         id="path692798"
         d="m 4,4 h 1 c 0.01037,-1.2e-4 0.02079,-4.6e-4 0.03125,0 0.254951,0.0112 0.50987,0.12858 0.6875,0.3125 L 8,6.59375 10.3125,4.3125 C 10.578125,4.082 10.759172,4.007 11,4 h 1 v 1 c 0,0.28647 -0.03434,0.55065 -0.25,0.75 l -2.28125,2.28125 2.25,2.25 C 11.906938,10.46942 11.999992,10.7347 12,11 v 1 h -1 c -0.265301,-10e-6 -0.530586,-0.0931 -0.71875,-0.28125 L 8,9.4375 5.71875,11.71875 C 5.530586,11.90694 5.26529,12 5,12 H 4 v -1 c -3e-6,-0.26529 0.09306,-0.53058 0.28125,-0.71875 L 6.5625,8.03125 4.28125,5.75 C 4.070508,5.55537 3.97809,5.28075 4,5 Z"
         style="fill:#2e3436;fill-opacity:1;stroke-width:1.23051" />
    </g>
    <rect
       style="color:#000000;display:inline;overflow:visible;visibility:visible;fill:#df9c9d;fill-opacity:0;fill-rule:nonzero;stroke:#df9c9d;stroke-width:1.00327;stroke-linecap:butt;stroke-linejoin:miter;stroke-miterlimit:4;stroke-dasharray:none;stroke-dashoffset:0;stroke-opacity:0;marker:none;enable-background:accumulate"
       id="rect692802"
       width="26.90563"
       height="26.905624"
       x="631.67993"
       y="75.287323"
       rx="4.891932"
       ry="4.891932"
       inkscape:export-filename="/home/lapo.fedora/SparkleShare/gnome-mockups/content selection/content-selection.png"
       inkscape:export-xdpi="90"
       inkscape:export-ydpi="90" />
    <rect
       style="color:#000000;display:inline;overflow:visible;visibility:visible;fill:#df9c9d;fill-opacity:0;fill-rule:nonzero;stroke:#df9c9d;stroke-width:1.00327;stroke-linecap:butt;stroke-linejoin:miter;stroke-miterlimit:4;stroke-dasharray:none;stroke-dashoffset:0;stroke-opacity:0;marker:none;enable-background:accumulate"
       id="rect692804"
       width="26.90563"
       height="26.905624"
       x="631.67993"
       y="75.287323"
       rx="4.891932"
       ry="4.891932"
       inkscape:export-filename="/home/lapo.fedora/SparkleShare/gnome-mockups/content selection/content-selection.png"
       inkscape:export-xdpi="90"
       inkscape:export-ydpi="90" />
    <path
       id="path692832"
       style="display:inline;fill:#ebebeb;fill-opacity:1;stroke:#fafafa;stroke-width:0"
       d="m 460.08753,69.168689 h 164.69585 v 7.3379 102.444831 H 452.74978 V 76.506589 c 0,-4.06521 3.27259,-7.3379 7.33775,-7.3379 z"
       sodipodi:nodetypes="sccccss" />
    <g
       id="g692850"
       transform="matrix(3.081532,0,0,3.081532,-8645.4389,3056.0864)"
       style="stroke-width:1.23051">
      <g
         id="g692836"
         transform="translate(28.57538,55.032559)"
         style="fill:#9a9996;fill-opacity:0;stroke-width:1.23051">
        <rect
           style="display:inline;fill:#9a9996;fill-opacity:0;stroke:#4a90d9;stroke-width:0;stroke-linecap:square;stroke-miterlimit:4;stroke-dasharray:none;stroke-dashoffset:0;stroke-opacity:1"
           id="rect692834"
           width="8.9958324"
           height="8.9958324"
           x="2968.8896"
           y="-1022.4769"
           rx="1.5875"
           ry="1.5875" />
      </g>
      <g
         inkscape:label="open menu primary three lines"
         id="g692848"
         transform="matrix(0,0.26458333,-0.26458333,0,3055.6742,-1008.2256)"
         style="stroke-width:1.23051">
        <title
           id="title692838">open-menu</title>
        <rect
           style="fill:#2e3436;fill-opacity:1;stroke-width:1.23051;stroke-dasharray:9.84413, 9.84413"
           id="rect692840"
           width="14.000002"
           height="2"
           x="-210.00314"
           y="165.13576"
           transform="rotate(-90)" />
        <rect
           style="fill:#2e3436;fill-opacity:1;stroke-width:1.23051;stroke-dasharray:9.84413, 9.84413"
           id="rect692842"
           width="14"
           height="2"
           x="-210.00314"
           y="170.13576"
           transform="rotate(-90)" />
        <rect
           style="fill:#2e3436;fill-opacity:1;stroke-width:1.23051;stroke-dasharray:9.84413, 9.84413"
           id="rect692844"
           width="14.000002"
           height="2"
           x="-210.00314"
           y="175.13576"
           transform="rotate(-90)" />
        <rect
           y="195.00317"
           x="163.1358"
           height="16"
           width="16"
           id="rect692846"
           style="fill:none;fill-opacity:1;stroke-width:1.23051" />
      </g>
    </g>
    <path
       style="fill:none;stroke:#c8c5c5;stroke-width:1.00327px;stroke-linecap:butt;stroke-linejoin:miter;stroke-opacity:0.360784"
       d="M 625.19169,69.171129 V 184.74001"
       id="path692852"
       sodipodi:nodetypes="cc" />
    <rect
       style="fill:#000000;fill-opacity:0.06;stroke:#99c1f1;stroke-width:2.00654;stroke-linecap:round;stroke-dasharray:none;stroke-dashoffset:0;stroke-opacity:1"
       id="rect692854"
       width="273.95419"
       height="26.09029"
       x="752.776"
       y="75.689827"
       rx="4.1184387"
       ry="4.1184392" />
    <g
       id="g692864"
       transform="matrix(0.81532199,0,0,0.81532199,669.60029,-462.4393)"
       inkscape:label="find search lookup"
       style="stroke-width:1.23051">
      <title
         id="title692856">folder-saved-search</title>
      <rect
         y="668"
         x="112.00605"
         height="16"
         width="16.000002"
         id="rect692858"
         style="fill:none;stroke-width:1.23051" />
      <path
         id="path692860"
         d="m 118.57827,668.06361 c -3.5779,0 -6.5,2.9221 -6.5,6.5 0,3.5779 2.9221,6.49805 6.5,6.49805 1.43002,0 2.75427,-0.4654 3.83007,-1.25391 l 2.97266,2.97266 c 0.95834,0.93804 2.36459,-0.49946 1.40625,-1.4375 l -2.95898,-2.95898 c 0.78481,-1.07378 1.25,-2.39436 1.25,-3.82032 0,-3.5779 -2.9221,-6.5 -6.5,-6.5 z m 0,2 c 2.497,0 4.5,2.003 4.5,4.5 0,2.497 -2.003,4.49805 -4.5,4.49805 -2.497,0 -4.5,-2.00105 -4.5,-4.49805 0,-2.497 2.003,-4.5 4.5,-4.5 z"
         style="fill:#2e3436;fill-opacity:1;stroke-width:1.23051" />
      <rect
         style="opacity:0.706383;fill:none;stroke-width:1.23051"
         id="rect692862"
         width="16.000002"
         height="16"
         x="112.00605"
         y="668" />
    </g>
    <path
       style="fill:none;stroke:#2e3436;stroke-width:1.00327px;stroke-linecap:butt;stroke-linejoin:miter;stroke-opacity:1"
       d="M 780.10491,79.74827 V 97.68528"
       id="path692866" />
    <rect
       style="display:inline;fill:#000000;fill-opacity:0;stroke:#4a90d9;stroke-width:0;stroke-linecap:square;stroke-miterlimit:4;stroke-dasharray:none;stroke-dashoffset:0;stroke-opacity:1"
       id="rect692868"
       width="22.828922"
       height="22.828922"
       x="999.82971"
       y="77.318985"
       rx="4.891932"
       ry="4.891932" />
    <path
       style="font-size:14.6667px;line-height:1.25;font-family:Cantarell;-inkscape-font-specification:Cantarell;letter-spacing:0px;word-spacing:0px;fill-opacity:0.363302;stroke-width:1.00327"
       d="m 784.87203,93.21336 c 1.8535,0 3.06127,-0.94468 3.06127,-2.40357 0,-2.94169 -4.6517,-1.7698 -4.6517,-3.91029 0,-0.87294 0.70553,-1.35127 1.97309,-1.35127 0.70552,0 1.47084,0.1435 2.06874,0.39462 l 0.29896,-0.77728 c -0.70554,-0.31091 -1.50673,-0.47832 -2.29596,-0.47832 -1.8535,0 -3.06127,0.92077 -3.06127,2.3677 0,2.84603 4.63974,1.78176 4.63974,3.89834 0,0.83706 -0.71748,1.37518 -1.97309,1.37518 -0.75334,0 -1.68609,-0.20329 -2.49923,-0.53812 l -0.29896,0.77728 c 0.92078,0.41853 1.85351,0.64573 2.73841,0.64573 z m 7.05526,0 c 0.65769,0 1.37518,-0.15545 1.88937,-0.43049 l -0.21523,-0.69357 c -0.44246,0.21525 -1.00448,0.34679 -1.50673,0.34679 -1.35126,0 -2.15245,-0.89686 -2.15245,-2.39162 0,-1.30343 0.58595,-2.02091 1.63826,-2.02091 0.98057,0 1.55455,0.63377 1.55455,1.73392 h -3.36023 v 0.71748 h 4.20925 c 0.0238,-0.17937 0.0479,-0.5979 0.0479,-0.82511 0,-1.44692 -0.95666,-2.43944 -2.37966,-2.43944 -1.60238,0 -2.69057,1.2556 -2.69057,3.02539 0,1.84155 1.13602,2.97756 2.96561,2.97756 z m 7.28247,-0.11958 h 0.66966 V 89.3509 c 0,-1.37518 -0.81315,-2.14049 -2.31987,-2.14049 -0.75336,0 -1.56651,0.20328 -2.18833,0.55007 l 0.23916,0.70553 c 0.5979,-0.26308 1.19581,-0.39462 1.75783,-0.39462 1.0284,0 1.55456,0.43049 1.55456,1.27951 v 3.07323 z m -2.04484,0.11958 c 1.37519,0 2.41554,-0.86098 2.58296,-2.14049 l -0.34679,-0.16742 c -0.17937,0.8849 -0.96861,1.47085 -1.96112,1.47085 -0.76532,0 -1.26756,-0.38266 -1.26756,-0.95665 0,-0.72944 0.84902,-1.02839 2.89386,-1.02839 v -0.6577 c -2.69057,0 -3.85051,0.53812 -3.85051,1.79371 0,1.0284 0.76532,1.68609 1.94916,1.68609 z m 4.60386,-0.11958 h 0.95665 v -4.42449 l -0.16742,-1.3393 h -0.78923 z m 0.7414,-3.74288 c 0.33483,-0.72944 1.02839,-1.17189 1.81763,-1.17189 0.2272,0 0.44245,0.0359 0.63378,0.10762 l 0.23917,-0.8849 c -0.25113,-0.0837 -0.50225,-0.13153 -0.76532,-0.13153 -0.77729,0 -1.49476,0.41853 -1.92526,1.1121 z m 6.02689,3.86246 c 0.69356,0 1.41105,-0.16741 1.88937,-0.4544 l -0.21525,-0.69357 c -0.47831,0.2272 -1.00447,0.35874 -1.44692,0.35874 -1.19581,0 -1.87742,-0.83706 -1.87742,-2.23616 0,-1.38714 0.66966,-2.1405 1.86546,-2.1405 0.45441,0 0.96861,0.10763 1.44693,0.32287 l 0.2272,-0.77728 c -0.52615,-0.25111 -1.08818,-0.38265 -1.66217,-0.38265 -1.71,0 -2.85798,1.26755 -2.85798,3.16889 0,1.78175 0.98056,2.83406 2.63078,2.83406 z m 7.25857,-0.11958 h 0.95664 v -3.77875 c 0,-1.27952 -0.84902,-2.10462 -2.1405,-2.10462 -0.83707,0 -1.66217,0.35874 -2.27204,1.06427 l 0.22721,0.60986 c 0.47832,-0.56203 1.1121,-0.83707 1.78176,-0.83707 0.93273,0 1.44693,0.52616 1.44693,1.45889 z m -3.93422,0 h 0.95665 v -8.83702 h -0.95665 z m 12.0059,0.11958 c 0.6577,0 1.37518,-0.15545 1.88938,-0.43049 l -0.21524,-0.69357 c -0.44246,0.21525 -1.00448,0.34679 -1.50673,0.34679 -1.35126,0 -2.15244,-0.89686 -2.15244,-2.39162 0,-1.30343 0.58594,-2.02091 1.63826,-2.02091 0.98055,0 1.55454,0.63377 1.55454,1.73392 h -3.36023 v 0.71748 h 4.20925 c 0.0238,-0.17937 0.0479,-0.5979 0.0479,-0.82511 0,-1.44692 -0.95665,-2.43944 -2.37965,-2.43944 -1.60239,0 -2.69058,1.2556 -2.69058,3.02539 0,1.84155 1.13603,2.97756 2.96561,2.97756 z m 5.14198,-0.11958 h 0.93273 l 2.24812,-5.76379 h -0.95665 l -1.997,5.57246 h 0.52615 l -1.96112,-5.57246 h -1.06426 z m 6.91177,0.11958 c 0.65769,0 1.37517,-0.15545 1.88937,-0.43049 l -0.21523,-0.69357 c -0.44246,0.21525 -1.0045,0.34679 -1.50673,0.34679 -1.35127,0 -2.15245,-0.89686 -2.15245,-2.39162 0,-1.30343 0.58593,-2.02091 1.63825,-2.02091 0.98056,0 1.55455,0.63377 1.55455,1.73392 h -3.36022 v 0.71748 h 4.20924 c 0.0239,-0.17937 0.0479,-0.5979 0.0479,-0.82511 0,-1.44692 -0.95666,-2.43944 -2.37967,-2.43944 -1.60238,0 -2.69056,1.2556 -2.69056,3.02539 0,1.84155 1.13601,2.97756 2.96559,2.97756 z m 3.71896,-0.11958 h 0.95664 v -4.42449 l -0.16741,-1.3393 h -0.78923 z m 0.7414,-3.74288 c 0.33482,-0.72944 1.0284,-1.17189 1.81762,-1.17189 0.22721,0 0.44246,0.0359 0.63379,0.10762 l 0.23915,-0.8849 c -0.25111,-0.0837 -0.50223,-0.13153 -0.76531,-0.13153 -0.77727,0 -1.49477,0.41853 -1.92525,1.1121 z m 4.14946,6.33779 h 1.01644 l 0.95665,-2.59491 2.24812,-5.76379 h -0.95666 l -1.86545,5.1898 h 0.25112 l -1.81763,-5.1898 h -1.06427 l 2.27203,5.76379 z m 6.51715,-2.59491 h 0.94469 l 1.78176,-5.26155 h -0.4305 l 1.87742,5.26155 h 0.96862 l 1.90132,-5.76379 h -0.95664 l -1.62631,5.34526 h 0.4305 l -1.79372,-5.32135 h -1.0523 l -1.73393,5.32135 h 0.37071 l -1.57847,-5.34526 H 849.063 Z m 12.13747,0 h 0.95664 v -3.77875 c 0,-1.27952 -0.84902,-2.10462 -2.14049,-2.10462 -0.83706,0 -1.66218,0.35874 -2.27204,1.06427 l 0.22721,0.60986 c 0.47832,-0.56203 1.11209,-0.83707 1.78175,-0.83707 0.93273,0 1.44693,0.52616 1.44693,1.45889 z m -3.93421,0 h 0.95664 v -8.83702 h -0.95664 z m 9.37513,0.11958 c 0.6577,0 1.37518,-0.15545 1.88938,-0.43049 l -0.21525,-0.69357 c -0.44245,0.21525 -1.00448,0.34679 -1.50672,0.34679 -1.35127,0 -2.15245,-0.89686 -2.15245,-2.39162 0,-1.30343 0.58594,-2.02091 1.63826,-2.02091 0.98055,0 1.55454,0.63377 1.55454,1.73392 h -3.36022 v 0.71748 h 4.20924 c 0.0239,-0.17937 0.0479,-0.5979 0.0479,-0.82511 0,-1.44692 -0.95665,-2.43944 -2.37966,-2.43944 -1.60239,0 -2.69057,1.2556 -2.69057,3.02539 0,1.84155 1.13602,2.97756 2.96561,2.97756 z m 3.71896,-0.11958 h 0.95665 v -4.42449 l -0.16742,-1.3393 h -0.78923 z m 0.74141,-3.74288 c 0.33482,-0.72944 1.02838,-1.17189 1.81763,-1.17189 0.22719,0 0.44244,0.0359 0.63377,0.10762 l 0.23917,-0.8849 c -0.25113,-0.0837 -0.50225,-0.13153 -0.76532,-0.13153 -0.77729,0 -1.49477,0.41853 -1.92525,1.1121 z m 6.3617,3.86246 c 0.6577,0 1.37518,-0.15545 1.88938,-0.43049 l -0.21525,-0.69357 c -0.44245,0.21525 -1.00447,0.34679 -1.50671,0.34679 -1.35127,0 -2.15246,-0.89686 -2.15246,-2.39162 0,-1.30343 0.58595,-2.02091 1.63826,-2.02091 0.98056,0 1.55455,0.63377 1.55455,1.73392 h -3.36022 v 0.71748 h 4.20924 c 0.0238,-0.17937 0.0479,-0.5979 0.0479,-0.82511 0,-1.44692 -0.95664,-2.43944 -2.37966,-2.43944 -1.60239,0 -2.69057,1.2556 -2.69057,3.02539 0,1.84155 1.13602,2.97756 2.96561,2.97756 z"
       id="text692894"
       aria-label="Search everywhere" />
    <rect
       style="display:inline;fill:#000000;fill-opacity:0.0969558;stroke:#4a90d9;stroke-width:0;stroke-linecap:square;stroke-miterlimit:4;stroke-dasharray:none;stroke-dashoffset:0;stroke-opacity:1"
       id="rect88"
       width="27.720943"
       height="27.720943"
       x="458.45364"
       y="74.87487"
       rx="4.891932"
       ry="4.891932" />
    <g
       id="g693218"
       transform="matrix(0.81532199,0,0,0.81532199,374.47056,-462.42235)"
       inkscape:label="find search lookup"
       style="stroke-width:1.23051">
      <title
         id="title693210">folder-saved-search</title>
      <path
         id="path693212"
         style="fill:none;stroke-width:1.23051"
         d="m 112.00605,668 h 16 v 16 h -16 z" />
      <path
         id="path693214"
         d="m 118.57827,668.06361 c -3.5779,0 -6.5,2.9221 -6.5,6.5 0,3.5779 2.9221,6.49805 6.5,6.49805 1.43002,0 2.75427,-0.4654 3.83007,-1.25391 l 2.97266,2.97266 c 0.95834,0.93804 2.36459,-0.49946 1.40625,-1.4375 l -2.95898,-2.95898 c 0.78481,-1.07378 1.25,-2.39436 1.25,-3.82032 0,-3.5779 -2.9221,-6.5 -6.5,-6.5 z m 0,2 c 2.497,0 4.5,2.003 4.5,4.5 0,2.497 -2.003,4.49805 -4.5,4.49805 -2.497,0 -4.5,-2.00105 -4.5,-4.49805 0,-2.497 2.003,-4.5 4.5,-4.5 z"
         style="fill:#2e3436;fill-opacity:1;stroke-width:1.23051" />
      <path
         id="path693216"
         style="opacity:0.706383;fill:none;stroke-width:1.23051"
         d="m 112.00605,668 h 16 v 16 h -16 z" />
    </g>
    <path
       style="font-weight:bold;font-size:14.6667px;line-height:1.25;font-family:Cantarell;-inkscape-font-specification:Cantarell;text-align:center;letter-spacing:0px;word-spacing:0px;text-anchor:middle;fill:#2e3436;stroke-width:1.00327"
       d="m 526.47731,92.14153 h 1.55455 V 88.6976 h 3.59939 v -1.35127 h -3.59939 v -2.15245 h 3.98204 v -1.35127 h -5.53659 z m 6.81612,0 h 1.51867 V 86.3299 h -1.51867 z m 0.76532,-6.8759 c 0.57398,0 0.94469,-0.3707 0.94469,-0.94469 0,-0.57399 -0.37071,-0.94469 -0.94469,-0.94469 -0.56203,0 -0.93274,0.3707 -0.93274,0.94469 0,0.57399 0.37071,0.94469 0.93274,0.94469 z m 4.11357,6.97156 c 0.3707,0 0.80119,-0.0837 1.11211,-0.21525 l -0.31092,-1.02839 c -0.13154,0.0478 -0.26308,0.0717 -0.37071,0.0717 -0.35874,0 -0.55006,-0.22721 -0.55006,-0.63378 v -7.12702 h -1.50672 v 7.31835 c 0,1.00448 0.60986,1.61434 1.6263,1.61434 z m 4.85499,0.0239 c 0.69356,0 1.423,-0.13154 2.05678,-0.39462 l -0.33482,-1.06427 c -0.46637,0.19133 -0.98057,0.29895 -1.47085,0.29895 -1.2556,0 -1.92524,-0.69357 -1.92524,-2.04483 0,-1.08818 0.45439,-1.66217 1.26755,-1.66217 0.75335,0 1.18385,0.47832 1.18385,1.3393 h -2.65469 v 0.93273 h 4.02987 c 0.0358,-0.23916 0.0598,-0.5979 0.0598,-0.87294 0,-1.57846 -0.96861,-2.58294 -2.51121,-2.58294 -1.73391,0 -2.89385,1.24364 -2.89385,3.04931 0,1.86546 1.20776,3.00148 3.19281,3.00148 z m 5.48876,0 c 1.60238,0 2.54707,-0.69357 2.54707,-1.86546 0,-2.17637 -3.28846,-1.43497 -3.28846,-2.41554 0,-0.35874 0.40656,-0.57399 1.12405,-0.57399 0.47832,0 1.05231,0.0957 1.59043,0.25113 l 0.3109,-1.14798 c -0.53811,-0.19133 -1.21972,-0.29895 -1.87741,-0.29895 -1.66218,0 -2.63079,0.68161 -2.63079,1.86546 0,2.16441 3.25261,1.3393 3.25261,2.40357 0,0.3707 -0.39462,0.59791 -1.05232,0.59791 -0.56203,0 -1.32734,-0.15546 -1.93721,-0.39462 l -0.34677,1.13602 c 0.66964,0.27503 1.51866,0.44245 2.3079,0.44245 z"
       id="text693222"
       aria-label="Files" />
    <g
       id="g207995"
       transform="matrix(0.81532199,0,0,0.81532199,374.47056,-462.42235)"
       inkscape:label="find search lookup"
       style="stroke-width:1.23051">
      <title
         id="title207987">folder-saved-search</title>
      <path
         id="path207989"
         style="fill:none;stroke-width:1.23051"
         d="m 112.00605,668 h 16 v 16 h -16 z" />
      <path
         id="path207991"
         d="m 118.57827,668.06361 c -3.5779,0 -6.5,2.9221 -6.5,6.5 0,3.5779 2.9221,6.49805 6.5,6.49805 1.43002,0 2.75427,-0.4654 3.83007,-1.25391 l 2.97266,2.97266 c 0.95834,0.93804 2.36459,-0.49946 1.40625,-1.4375 l -2.95898,-2.95898 c 0.78481,-1.07378 1.25,-2.39436 1.25,-3.82032 0,-3.5779 -2.9221,-6.5 -6.5,-6.5 z m 0,2 c 2.497,0 4.5,2.003 4.5,4.5 0,2.497 -2.003,4.49805 -4.5,4.49805 -2.497,0 -4.5,-2.00105 -4.5,-4.49805 0,-2.497 2.003,-4.5 4.5,-4.5 z"
         style="fill:#2e3436;fill-opacity:1;stroke-width:1.23051" />
      <path
         id="path207993"
         style="opacity:0.706383;fill:none;stroke-width:1.23051"
         d="m 112.00605,668 h 16 v 16 h -16 z" />
    </g>
    <g
       id="g88"
       transform="matrix(3.081532,0,0,3.081532,-8932.0189,2940.2824)"
       style="stroke-width:1.23051">
      <path
         id="path14-7"
         style="display:inline;fill:#fafafa;stroke:#4a90d9;stroke-width:0;stroke-linecap:square"
         d="m 3048.6547,-907.63688 h 49.2125 c 0.8794,0 1.5876,0.70803 1.5876,1.5875 v 6.35 c 0,0.87948 -0.7081,1.5875 -1.5876,1.5875 h -49.2125 c -0.8793,0 -1.5875,-0.70802 -1.5875,-1.5875 v -6.35 c 0,-0.87947 0.7081,-1.5875 1.5875,-1.5875 z" />
      <path
         id="path25"
         style="display:inline;fill:#ebebeb;stroke:#4a90d9;stroke-width:0;stroke-linecap:square"
         d="m 3048.6547,-907.63682 h 49.2125 c 0.8794,0 1.5876,0.70803 1.5876,1.5875 v 6.35 c 0,0.87948 -0.7081,1.5875 -1.5876,1.5875 h -49.2125 c -0.8793,0 -1.5875,-0.70802 -1.5875,-1.5875 v -6.35 c 0,-0.87947 0.7081,-1.5875 1.5875,-1.5875 z" />
      <g
         id="g35"
         transform="matrix(0.26458333,0,0,0.26458333,3019.8177,-958.17345)"
         style="display:inline;fill:#2e3436;stroke-width:1.23051">
        <path
           id="path26"
           style="display:inline;overflow:visible;opacity:0.6;fill-opacity:0;stroke-width:1.23051;marker:none;enable-background:accumulate"
           d="m 114,201 h 16 v 16 h -16 z" />
        <g
           id="g34"
           transform="translate(114.01339,202.01339)"
           style="display:inline;fill:#2e3436;fill-opacity:1;stroke-width:1.23051">
          <g
             style="display:inline;fill:#2e3436;fill-opacity:1;stroke-width:1.23051"
             id="g26"
             transform="translate(-40,-688)"
             inkscape:label="status" />
          <g
             id="g27"
             transform="translate(-40,-688)"
             inkscape:label="devices"
             style="fill:#2e3436;fill-opacity:1;stroke-width:1.23051" />
          <g
             id="g28"
             transform="translate(-40,-688)"
             inkscape:label="apps"
             style="fill:#2e3436;fill-opacity:1;stroke-width:1.23051" />
          <g
             id="g29"
             transform="translate(-40,-688)"
             inkscape:label="actions"
             style="fill:#2e3436;fill-opacity:1;stroke-width:1.23051">
            <path
               style="color:#000000;font-style:normal;font-variant:normal;font-weight:normal;font-stretch:normal;font-size:medium;line-height:normal;font-family:Sans;-inkscape-font-specification:Sans;text-indent:0;text-align:start;text-decoration:none;text-decoration-line:none;letter-spacing:normal;word-spacing:normal;text-transform:none;writing-mode:lr-tb;direction:ltr;baseline-shift:baseline;text-anchor:start;display:inline;overflow:visible;visibility:visible;fill:#2e3436;fill-opacity:1;stroke:none;stroke-width:2.65034;marker:none;enable-background:accumulate"
               id="path28"
               d="m 47.5,688.0134 c -4.130291,0 -7.486607,3.35631 -7.486607,7.48661 0,4.13029 3.356316,7.4866 7.486607,7.4866 4.130291,0 7.486607,-3.35631 7.486607,-7.4866 0,-4.1303 -3.356316,-7.48661 -7.486607,-7.48661 z m 0,1.97321 c 3.049411,0 5.513393,2.46399 5.513393,5.5134 0,3.04941 -2.463982,5.51339 -5.513393,5.51339 -3.049411,0 -5.513393,-2.46398 -5.513393,-5.51339 0,-3.04941 2.463982,-5.5134 5.513393,-5.5134 z"
               inkscape:connector-curvature="0" />
            <path
               style="color:#000000;font-style:normal;font-variant:normal;font-weight:normal;font-stretch:normal;font-size:medium;line-height:normal;font-family:Sans;-inkscape-font-specification:Sans;text-indent:0;text-align:start;text-decoration:none;text-decoration-line:none;letter-spacing:normal;word-spacing:normal;text-transform:none;writing-mode:lr-tb;direction:ltr;baseline-shift:baseline;text-anchor:start;display:inline;overflow:visible;visibility:visible;fill:#2e3436;fill-opacity:1;stroke:none;stroke-width:1.23051;marker:none;enable-background:accumulate"
               id="path29"
               d="m 50.40625,692 a 0.50005,0.50005 0 0 0 -0.25,0.15625 L 47.5,694.8125 45.84375,693.15625 a 0.50005,0.50005 0 1 0 -0.6875,0.6875 l 2,2 a 0.50005,0.50005 0 0 0 0.6875,0 l 3,-3 A 0.50005,0.50005 0 0 0 50.40625,692 Z"
               inkscape:connector-curvature="0" />
          </g>
          <g
             id="g30"
             transform="translate(-40,-688)"
             inkscape:label="places"
             style="fill:#2e3436;fill-opacity:1;stroke-width:1.23051" />
          <g
             id="g31"
             transform="translate(-40,-688)"
             inkscape:label="mimetypes"
             style="fill:#2e3436;fill-opacity:1;stroke-width:1.23051" />
          <g
             style="display:inline;fill:#2e3436;fill-opacity:1;stroke-width:1.23051"
             id="g32"
             transform="translate(-40,-688)"
             inkscape:label="emblems" />
          <g
             style="display:inline;fill:#2e3436;fill-opacity:1;stroke-width:1.23051"
             id="g33"
             transform="translate(-40,-688)"
             inkscape:label="categories" />
        </g>
      </g>
      <path
         id="path35"
         style="display:inline;fill:#dedede;fill-opacity:0;stroke:#4a90d9;stroke-width:0;stroke-linecap:square"
         d="m 3048.6547,-917.96676 h 49.2125 c 0.8794,0 1.5876,0.70802 1.5876,1.5875 v 6.35 c 0,0.87947 -0.7081,1.5875 -1.5876,1.5875 h -49.2125 c -0.8793,0 -1.5875,-0.70803 -1.5875,-1.5875 v -6.35 c 0,-0.87948 0.7081,-1.5875 1.5875,-1.5875 z" />
      <path
         style="font-size:3.88056px;line-height:1.25;font-family:Cantarell;-inkscape-font-specification:Cantarell;letter-spacing:0px;word-spacing:0px;fill:#2e3436;stroke-width:0.325574"
         d="m 3056.8194,-901.5473 h 0.3221 v -2.41371 h 0.5316 c 0.3842,0 0.6093,0.19791 0.6093,0.53164 0,0.32984 -0.2018,0.51999 -0.5705,0.51999 h -0.6868 v 0.27164 h 0.648 c 0.5588,0 0.9391,-0.35313 0.9391,-0.84984 0,-0.47343 -0.3492,-0.75283 -0.9003,-0.75283 h -0.8925 z m 1.5639,0 h 0.3842 l -0.7451,-1.27283 h -0.3687 z m 1.6492,0.0388 c 0.2135,0 0.4463,-0.0504 0.6131,-0.1397 l -0.07,-0.22507 c -0.1436,0.0699 -0.326,0.11254 -0.489,0.11254 -0.4385,0 -0.6985,-0.29105 -0.6985,-0.77612 0,-0.42298 0.1902,-0.65581 0.5317,-0.65581 0.3182,0 0.5045,0.20567 0.5045,0.56268 h -1.0905 v 0.23284 h 1.366 c 0.01,-0.0582 0.015,-0.19403 0.015,-0.26776 0,-0.46955 -0.3104,-0.79164 -0.7722,-0.79164 -0.52,0 -0.8732,0.40746 -0.8732,0.98178 0,0.59761 0.3687,0.96626 0.9624,0.96626 z m 1.9403,0 c 0.2251,0 0.4579,-0.0543 0.6131,-0.14746 l -0.07,-0.22507 c -0.1552,0.0737 -0.326,0.11642 -0.4696,0.11642 -0.388,0 -0.6092,-0.27164 -0.6092,-0.72567 0,-0.45014 0.2173,-0.69462 0.6054,-0.69462 0.1474,0 0.3143,0.0349 0.4695,0.10478 l 0.074,-0.25224 c -0.1707,-0.0815 -0.3531,-0.12418 -0.5394,-0.12418 -0.5549,0 -0.9274,0.41134 -0.9274,1.02835 0,0.5782 0.3182,0.91969 0.8537,0.91969 z m 1.9209,0 c 0.2134,0 0.4462,-0.0504 0.6131,-0.1397 l -0.07,-0.22507 c -0.1436,0.0699 -0.326,0.11254 -0.489,0.11254 -0.4385,0 -0.6985,-0.29105 -0.6985,-0.77612 0,-0.42298 0.1902,-0.65581 0.5316,-0.65581 0.3183,0 0.5045,0.20567 0.5045,0.56268 h -1.0904 v 0.23284 h 1.3659 c 0.01,-0.0582 0.016,-0.19403 0.016,-0.26776 0,-0.46955 -0.3105,-0.79164 -0.7723,-0.79164 -0.52,0 -0.8731,0.40746 -0.8731,0.98178 0,0.59761 0.3687,0.96626 0.9624,0.96626 z m 2.4835,-0.0388 h 0.3105 v -1.22626 c 0,-0.41522 -0.2755,-0.68298 -0.6946,-0.68298 -0.2717,0 -0.5394,0.11642 -0.7373,0.32209 l 0.074,0.19791 c 0.1552,-0.15911 0.3609,-0.24836 0.5782,-0.24836 0.3027,0 0.4695,0.17075 0.4695,0.47343 z m -1.2767,0 h 0.3105 v -1.65312 l -0.093,-0.21731 h -0.2173 z m 2.8406,0.0194 c 0.1281,0 0.2561,-0.031 0.3454,-0.0698 l -0.07,-0.22507 c -0.058,0.0272 -0.1436,0.0427 -0.2095,0.0427 -0.1941,0 -0.3221,-0.12417 -0.3221,-0.31044 v -1.87431 h -0.3105 v 1.917 c 0,0.31044 0.2251,0.51999 0.5666,0.51999 z m -0.8188,-1.62983 h 1.0749 v -0.26 h -1.0749 z"
         id="text68"
         aria-label="Recent" />
      <text
         xml:space="preserve"
         style="font-style:normal;font-variant:normal;font-weight:normal;font-stretch:normal;font-size:3.88056px;line-height:0%;font-family:Cantarell;-inkscape-font-specification:Cantarell;text-align:start;letter-spacing:0px;word-spacing:0px;text-anchor:start;display:inline;fill:#2e3436;fill-opacity:1;stroke:none;stroke-width:0.325574"
         x="3056.4624"
         y="-911.8772"
         id="text69"><tspan
           sodipodi:role="line"
           id="tspan69"
           x="3056.4624"
           y="-911.8772"
           style="font-weight:normal;font-size:3.88056px;line-height:1.25;text-align:start;text-anchor:start;fill:#2e3436;fill-opacity:1;stroke-width:0.325574">Home</tspan></text>
      <g
         transform="matrix(0.26458334,0,0,0.26458334,2718.4572,-763.18615)"
         id="g73"
         inkscape:label="home directory personal"
         style="stroke-width:1.23051">
        <title
           id="title72">user-home</title>
        <path
           style="fill:#2e3436;fill-rule:nonzero;stroke:none;stroke-width:2.46105;stroke-linecap:round;stroke-linejoin:round;stroke-opacity:1"
           d="m 1264.9729,-558.99512 c 1.6619,0 3,-1.3381 3,-3 v -6.00001 c 0,-0.93091 -0.4129,-1.81244 -1.128,-2.40839 l -4.4636,-3.71964 c -0.8166,-0.6805 -2.0002,-0.6805 -2.8168,0 l -4.4636,3.71964 c -0.7151,0.59595 -1.128,1.47748 -1.128,2.40839 v 6.00001 c 0,1.6619 1.3381,3 3,3 z m -9,-3 v -6.00001 c 0,-0.33636 0.15,-0.65662 0.4084,-0.87195 l 4.4636,-3.71964 c 0.073,-0.0612 0.1826,-0.0612 0.256,0 l 4.4636,3.71964 c 0.2584,0.21533 0.4084,0.53559 0.4084,0.87195 v 6.00001 c 0,0.54724 -0.4528,1 -1,1 h -8 c -0.5472,0 -1,-0.45276 -1,-1 z"
           id="path72-3"
           sodipodi:nodetypes="cccccc"
           inkscape:original-d="m 1254.9729,-559.99512 h 12 v -9 l -6,-5 -6,5 z"
           inkscape:path-effect="#path-effect84;#path-effect86" />
        <rect
           style="fill:#2e3436;fill-opacity:1;stroke:none;stroke-width:2.46103;stroke-linecap:round;stroke-linejoin:round;stroke-opacity:0"
           id="rect72"
           width="4"
           height="6.9999995"
           x="1258.9729"
           y="-566.995"
           rx="1"
           ry="1" />
        <rect
           y="-575"
           x="1253.0002"
           height="16"
           width="16"
           id="rect73"
           style="fill:none;stroke-width:1.23051" />
      </g>
    </g>
    <path
       id="rect2"
       style="fill:#3584e4;stroke:#ffffff;stroke-width:0;stroke-linecap:round"
       d="m 482.07007,98.54379 h 213.52438 c 10.38883,0 18.7524,8.35011 18.7524,18.7222 0,10.37211 -8.36357,18.72221 -18.7524,18.72221 H 501.03506 c -10.38884,0 -18.38694,-8.35654 -18.7524,-18.72221 z"
       sodipodi:nodetypes="csssssc" />
    <path
       d="m 521.58107,123.39462 c 3.18371,0 4.94857,-1.52265 4.94857,-3.92773 0,-4.41217 -5.93482,-3.07983 -5.93482,-4.86201 0,-0.60558 0.67481,-0.93435 1.85143,-0.93435 0.96892,0 2.04165,0.17306 2.88951,0.46718 l 0.83052,-2.38777 c -1.00357,-0.44991 -2.33585,-0.70944 -3.56431,-0.70944 -3.0453,0 -5.12162,1.59187 -5.12162,4.01422 0,4.08346 5.90024,2.92417 5.90024,4.77552 0,0.55373 -0.51908,0.86518 -1.67837,0.86518 -1.09007,0 -2.40509,-0.20763 -3.59897,-0.70946 l -0.83052,2.457 c 1.22853,0.55366 2.82034,0.95166 4.30834,0.95166 z m 10.96988,0 c 1.03814,0 2.12822,-0.19037 3.20101,-0.55373 l -0.65753,-2.0244 c -0.70939,0.24228 -1.3842,0.36336 -2.07632,0.36336 -1.6783,0 -2.45692,-0.72672 -2.45692,-2.47425 0,-1.28038 0.44984,-1.93792 1.2977,-1.93792 0.77861,0 1.22846,0.50181 1.22846,1.40151 h -2.88952 v 1.64379 h 5.58872 c 0.0692,-0.43259 0.12114,-0.86517 0.12114,-1.31502 0,-2.47426 -1.41884,-3.92767 -3.84117,-3.92767 -2.68195,0 -4.46408,1.76487 -4.46408,4.42942 0,2.73387 1.86868,4.39491 4.94851,4.39491 z m 10.39888,-0.17304 h 2.1628 v -4.7063 c 0,-2.5608 -1.41877,-3.94499 -4.18721,-3.94499 -1.31502,0 -2.69921,0.31145 -3.77194,0.83053 l 0.69206,2.0244 c 0.88244,-0.31144 1.6957,-0.46717 2.43967,-0.46717 1.2112,0 1.90333,0.41526 1.90333,1.21114 v 2.82034 z m -2.90685,0.17304 c 1.71297,0 2.88953,-0.88243 3.46051,-2.68195 l -0.91701,-0.39793 c -0.31146,0.51907 -0.88243,0.84784 -1.50533,0.84784 -0.60558,0 -1.02083,-0.31144 -1.02083,-0.76135 0,-0.58825 0.72671,-0.8132 2.66456,-0.8132 v -1.48801 c -3.91035,0 -5.67521,0.84779 -5.67521,2.73379 0,1.53991 1.15923,2.56081 2.99331,2.56081 z m 7.02489,-0.17304 h 2.99333 v -5.17346 l -0.65748,-3.30485 h -2.33585 z m 2.45692,-4.18721 c 0.46718,-0.98625 1.28044,-1.55725 2.21478,-1.55725 0.38061,0 0.86511,0.0865 1.21114,0.20764 l 0.6748,-2.73385 c -0.34603,-0.17299 -0.8651,-0.2768 -1.38419,-0.2768 -1.09006,0 -2.09363,0.58824 -2.71653,1.59181 z m 9.27424,4.36025 c 1.03816,0 1.92059,-0.20763 2.80302,-0.65755 l -0.65747,-2.0244 c -0.50182,0.20763 -1.0209,0.29418 -1.50533,0.29418 -1.40151,0 -2.19745,-0.74402 -2.19745,-2.0763 0,-1.19388 0.64021,-1.86869 1.92059,-1.86869 0.57098,0 1.26311,0.12108 1.78219,0.29413 l 0.60557,-2.31853 c -0.69213,-0.29419 -1.64373,-0.46717 -2.54349,-0.46717 -2.94148,0 -4.81017,1.76487 -4.81017,4.56789 0,2.68188 1.71297,4.25644 4.60254,4.25644 z m 9.60294,-0.17304 h 2.99334 v -5.08697 c 0,-2.19746 -1.15923,-3.49515 -3.09715,-3.49515 -1.2112,0 -2.24936,0.5364 -2.94142,1.6957 l 0.32871,1.78212 c 0.43258,-0.64016 0.89975,-0.88242 1.48806,-0.88242 0.8651,0 1.22846,0.4499 1.22846,1.4015 z m -5.34651,0 h 2.94143 v -12.78665 h -2.94143 z m 13.9113,0 h 8.6167 v -2.62998 h -5.6233 v -2.14555 h 5.13887 v -2.62997 h -5.13887 v -1.97249 h 5.6233 v -2.63005 h -8.6167 z m 12.64825,0 h 2.99333 l 3.28752,-8.47831 h -3.01066 l -1.92059,6.33276 h 0.39794 l -1.71296,-6.33276 h -3.28751 z m 11.71384,0.17304 c 1.03815,0 2.12822,-0.19037 3.20102,-0.55373 l -0.65754,-2.0244 c -0.70939,0.24228 -1.38419,0.36336 -2.07631,0.36336 -1.67831,0 -2.45693,-0.72672 -2.45693,-2.47425 0,-1.28038 0.44985,-1.93792 1.2977,-1.93792 0.77862,0 1.22846,0.50181 1.22846,1.40151 h -2.88952 v 1.64379 h 5.58873 c 0.0692,-0.43259 0.12114,-0.86517 0.12114,-1.31502 0,-2.47426 -1.41884,-3.92767 -3.84118,-3.92767 -2.68194,0 -4.46407,1.76487 -4.46407,4.42942 0,2.73387 1.86868,4.39491 4.9485,4.39491 z m 5.00047,-0.17304 h 2.99333 v -5.17346 l -0.65747,-3.30485 h -2.33586 z m 2.457,-4.18721 c 0.46716,-0.98625 1.28036,-1.55725 2.21471,-1.55725 0.38068,0 0.8651,0.0865 1.21119,0.20764 l 0.67481,-2.73385 c -0.3461,-0.17299 -0.86518,-0.2768 -1.38425,-0.2768 -1.09007,0 -2.09358,0.58824 -2.71646,1.59181 z m 5.72711,7.94188 h 3.25294 l 1.315,-3.75467 3.20097,-8.47831 h -2.97607 l -2.05898,6.95565 0.72671,0.0175 -1.86869,-6.97297 h -3.30484 l 3.25294,8.4783 z m 10.5546,-3.75467 h 2.82035 l 1.93792,-6.60962 h -0.89976 l 2.18013,6.60962 h 2.97607 l 2.85492,-8.47831 h -2.90683 l -1.85143,6.99031 h 1.0209 l -2.11096,-6.95566 h -2.85493 l -2.05898,7.12863 h 0.91701 l -1.73021,-7.16328 h -3.23561 z m 18.21971,0 h 2.99333 v -5.08697 c 0,-2.19746 -1.1593,-3.49515 -3.09714,-3.49515 -1.21121,0 -2.24937,0.5364 -2.94149,1.6957 l 0.32877,1.78212 c 0.43258,-0.64016 0.89975,-0.88242 1.48801,-0.88242 0.86516,0 1.22852,0.4499 1.22852,1.4015 z m -5.34651,0 h 2.94143 v -12.78665 h -2.94143 z m 14.74182,0.17304 c 1.03816,0 2.12823,-0.19037 3.20096,-0.55373 l -0.65748,-2.0244 c -0.70944,0.24228 -1.38424,0.36336 -2.0763,0.36336 -1.67837,0 -2.457,-0.72672 -2.457,-2.47425 0,-1.28038 0.44985,-1.93792 1.2977,-1.93792 0.77862,0 1.22847,0.50181 1.22847,1.40151 h -2.88952 v 1.64379 h 5.58871 c 0.0692,-0.43259 0.12115,-0.86517 0.12115,-1.31502 0,-2.47426 -1.41884,-3.92767 -3.84118,-3.92767 -2.68188,0 -4.46407,1.76487 -4.46407,4.42942 0,2.73387 1.86868,4.39491 4.94856,4.39491 z m 5.00042,-0.17304 h 2.99338 v -5.17346 l -0.65753,-3.30485 h -2.33585 z m 2.45698,-4.18721 c 0.46717,-0.98625 1.28037,-1.55725 2.21471,-1.55725 0.38069,0 0.86518,0.0865 1.2112,0.20764 l 0.67482,-2.73385 c -0.34604,-0.17299 -0.86512,-0.2768 -1.3842,-0.2768 -1.09006,0 -2.09363,0.58824 -2.71653,1.59181 z m 9.62028,4.36025 c 1.03815,0 2.12821,-0.19037 3.20095,-0.55373 l -0.65748,-2.0244 c -0.70938,0.24228 -1.38419,0.36336 -2.07631,0.36336 -1.67838,0 -2.45699,-0.72672 -2.45699,-2.47425 0,-1.28038 0.44985,-1.93792 1.2977,-1.93792 0.77861,0 1.22853,0.50181 1.22853,1.40151 h -2.88959 v 1.64379 h 5.58879 c 0.0691,-0.43259 0.12107,-0.86517 0.12107,-1.31502 0,-2.47426 -1.41877,-3.92767 -3.84117,-3.92767 -2.68188,0 -4.46408,1.76487 -4.46408,4.42942 0,2.73387 1.86869,4.39491 4.94858,4.39491 z"
       id="flowRoot227460"
       style="font-weight:800;font-size:26.6667px;line-height:145%;font-family:Cantarell;-inkscape-font-specification:'Cantarell Ultra-Bold';text-align:center;letter-spacing:0px;word-spacing:0px;text-anchor:middle;fill:#ffffff;stroke-width:1.00327"
       aria-label="Search Everywhere" />
    <g
       id="g96"
       inkscape:label="permissions"
       transform="matrix(0.81532199,0,0,0.81532199,6.76736,-67.809684)"
       style="stroke-width:1.23051">
      <title
         id="title93">permissions-generic</title>
      <rect
         style="fill:none;stroke-width:1.23051"
         id="rect94"
         width="16"
         height="16"
         x="1224"
         y="184.00031" />
      <path
         style="color:#000000;fill:#222222;fill-opacity:1;stroke-width:1.23051;stroke-linecap:square;stroke-linejoin:round;stroke-dashoffset:2;-inkscape-stroke:none"
         d="m 1235.5,185 c -1.9212,0 -3.5,1.57885 -3.5,3.5 0,1.92115 1.5788,3.5 3.5,3.5 1.9212,0 3.5,-1.57885 3.5,-3.5 0,-1.92115 -1.5788,-3.5 -3.5,-3.5 z m 0,2 c 0.8403,0 1.5,0.65973 1.5,1.5 0,0.84027 -0.6597,1.5 -1.5,1.5 -0.8403,0 -1.5,-0.65973 -1.5,-1.5 0,-0.84027 0.6597,-1.5 1.5,-1.5 z"
         id="path94" />
      <path
         id="path95"
         style="color:#000000;fill:#222222;fill-opacity:1;stroke-width:1.23051;stroke-linecap:square;stroke-linejoin:round;stroke-dashoffset:2;-inkscape-stroke:none"
         d="m 1228.5,192 c -1.9212,0 -3.5,1.57885 -3.5,3.5 0,1.92115 1.5788,3.5 3.5,3.5 1.3855,0 2.5926,-0.82154 3.1582,-2 h 5.8418 c 0.831,0 1.5,-0.669 1.5,-1.5 0,-0.831 -0.669,-1.5 -1.5,-1.5 h -5.8418 c -0.5656,-1.17846 -1.7727,-2 -3.1582,-2 z m 0,2 c 0.8403,0 1.5,0.65973 1.5,1.5 0,0.84027 -0.6597,1.5 -1.5,1.5 -0.8403,0 -1.5,-0.65973 -1.5,-1.5 0,-0.84027 0.6597,-1.5 1.5,-1.5 z"
         sodipodi:nodetypes="ssscssscssssss" />
      <path
         id="path96"
         style="fill:#222222;fill-opacity:0.35;stroke:none;stroke-width:2.46105;stroke-linecap:square;stroke-linejoin:round;stroke-dasharray:none;stroke-dashoffset:2;stroke-opacity:1"
         d="m 1226.5,187 c -0.831,0 -1.5,0.669 -1.5,1.5 0,0.831 0.669,1.5 1.5,1.5 h 4.7676 c -0.1738,-0.48115 -0.2643,-0.98842 -0.2676,-1.5 0,-0.51158 0.094,-1.01885 0.2676,-1.5 z"
         sodipodi:nodetypes="ssscccs" />
    </g>
    <g
       id="g99"
       transform="matrix(3.081532,0,0,3.081532,-8931.6379,2940.3141)"
       style="stroke-width:1.23051">
      <path
         d="m 3248.8135,-927.22823 c -0.1468,0 -0.2646,0.11779 -0.2646,0.26459 v 0.5292 c 0,0.1467 0.1178,0.2645 0.2646,0.2645 h 0.5291 c 0.1468,0 0.2646,-0.1178 0.2646,-0.2645 v -0.5292 c 0,-0.1468 -0.1178,-0.26459 -0.2646,-0.26459 z m 1.3229,0.26459 v 0.5292 h 2.1167 v -0.5292 z m -1.3229,1.0625 c -0.1468,0 -0.2646,0.1178 -0.2646,0.2645 v 0.52401 c 0,0.1458 0.1178,0.2646 0.2646,0.2646 h 0.5291 c 0.1468,0 0.2646,-0.1188 0.2646,-0.2646 v -0.52401 c 0,-0.1467 -0.1178,-0.2645 -0.2646,-0.2645 z m 1.3229,0.26041 v 0.5292 h 2.1167 v -0.5292 z m -1.3229,1.0583 c -0.1468,0 -0.2646,0.11789 -0.2646,0.26459 v 0.52401 c 0,0.1458 0.1178,0.2646 0.2646,0.2646 h 0.5291 c 0.1468,0 0.2646,-0.1188 0.2646,-0.2646 v -0.52401 c 0,-0.1467 -0.1178,-0.26459 -0.2646,-0.26459 z m 1.3229,0.2605 v 0.5292 h 2.1167 v -0.5292 z m 0,0"
         fill="#2e3436"
         id="path97"
         style="stroke-width:0.325574" />
      <path
         d="m 3259.4025,-926.17249 -1.5864,1.58751 -1.5886,-1.58751 z m 0,0"
         fill="#2e3436"
         id="path98"
         style="stroke:none;stroke-width:0.325574;stroke-opacity:1" />
      <rect
         style="color:#000000;display:inline;overflow:visible;visibility:visible;fill:#000000;fill-opacity:0;fill-rule:nonzero;stroke:none;stroke-width:0.325574;stroke-linecap:butt;stroke-linejoin:miter;stroke-miterlimit:4;stroke-dasharray:none;stroke-dashoffset:0;stroke-opacity:0;marker:none;enable-background:accumulate"
         id="rect98"
         width="8.9958334"
         height="8.9958334"
         x="3245.9031"
         y="-929.875"
         rx="1.5875001"
         ry="1.5875"
         inkscape:export-filename="/home/lapo.fedora/SparkleShare/gnome-mockups/content selection/content-selection.png"
         inkscape:export-xdpi="90"
         inkscape:export-ydpi="90" />
      <path
         style="fill:none;stroke:#323232;stroke-width:0.325574px;stroke-linecap:butt;stroke-linejoin:miter;stroke-opacity:0.303293"
         d="m 3255.0312,-928.29379 v 5.82081"
         id="path99" />
      <rect
         style="color:#000000;display:inline;overflow:visible;visibility:visible;fill:#000000;fill-opacity:0;fill-rule:nonzero;stroke:none;stroke-width:0.325574;stroke-linecap:butt;stroke-linejoin:miter;stroke-miterlimit:4;stroke-dasharray:none;stroke-dashoffset:0;stroke-opacity:0;marker:none;enable-background:accumulate"
         id="rect99"
         width="5.291667"
         height="8.9958334"
         x="3255.1692"
         y="-929.875"
         rx="1.5875"
         ry="1.5875"
         inkscape:export-filename="/home/lapo.fedora/SparkleShare/gnome-mockups/content selection/content-selection.png"
         inkscape:export-xdpi="90"
         inkscape:export-ydpi="90" />
    </g>
  </g>
</svg>
