<svg
   version="1.1"
   viewBox="0 0 59.999998 60"
   xml:space="preserve">
<path
   d="m 30.000873,8.994939 c 0,0 -18.780858,8.79e-5 -23.4758621,1.235673 C 4.0044287,10.922546 1.9279732,12.9988 1.2360734,15.568785 4.840194e-4,20.264042 4e-4,29.999958 4e-4,29.999958 c 0,0 8.78843e-5,9.78658 1.2356734,14.432854 0.6919334,2.569985 2.7189519,4.595357 5.2889375,5.287341 4.7446601,1.284992 23.4758621,1.284908 23.4758621,1.284908 0,0 18.780857,-8.8e-5 23.475862,-1.235673 2.569985,-0.691933 4.595357,-2.717272 5.287341,-5.287341 1.235589,-4.695256 1.235673,-14.432853 1.235673,-14.432853 0,0 0.04934,-9.7849 -1.235673,-14.479905 C 58.072142,12.999304 56.046804,10.972252 53.476735,10.280352 48.781478,8.9953591 30.000873,8.9954431 30.000873,8.9954431 Z m -5.981426,12.010574 15.619208,8.994277 -15.619208,8.995958 z"></path>
</svg>
