<?xml version="1.0" encoding="UTF-8" standalone="no"?>
<svg
   width="1200"
   height="800"
   version="1.1"
   id="svg69"
   sodipodi:docname="card.svg"
   inkscape:version="1.4 (e7c3feb100, 2024-10-09)"
   inkscape:export-filename="/var/home/jimmac/src/git/gnome/GNOME-Release-40/assets/card.png"
   inkscape:export-xdpi="96"
   inkscape:export-ydpi="96"
   xml:space="preserve"
   xmlns:inkscape="http://www.inkscape.org/namespaces/inkscape"
   xmlns:sodipodi="http://sodipodi.sourceforge.net/DTD/sodipodi-0.dtd"
   xmlns="http://www.w3.org/2000/svg"
   xmlns:svg="http://www.w3.org/2000/svg"
   xmlns:rdf="http://www.w3.org/1999/02/22-rdf-syntax-ns#"
   xmlns:cc="http://creativecommons.org/ns#"
   xmlns:dc="http://purl.org/dc/elements/1.1/"><metadata
     id="metadata75"><rdf:RDF><cc:Work
         rdf:about=""><dc:format>image/svg+xml</dc:format><dc:type
           rdf:resource="http://purl.org/dc/dcmitype/StillImage" /><dc:title /></cc:Work></rdf:RDF></metadata><defs
     id="defs73"><inkscape:path-effect
       effect="fillet_chamfer"
       id="path-effect49"
       is_visible="true"
       lpeversion="1"
       nodesatellites_param="F,0,0,1,0,20.212214,0,1 @ F,0,1,1,0,10.838929,0,1 @ F,0,0,1,0,20.212214,0,1"
       radius="0"
       unit="px"
       method="auto"
       mode="F"
       chamfer_steps="1"
       flexible="false"
       use_knot_distance="true"
       apply_no_radius="true"
       apply_with_radius="true"
       only_selected="false"
       hide_knots="false" /><inkscape:path-effect
       effect="fillet_chamfer"
       id="path-effect44"
       is_visible="true"
       lpeversion="1"
       nodesatellites_param="F,0,0,1,0,19.681136,0,1 @ F,0,1,1,0,10.627084,0,1 @ F,0,0,1,0,19.681136,0,1"
       radius="0"
       unit="px"
       method="auto"
       mode="F"
       chamfer_steps="1"
       flexible="false"
       use_knot_distance="true"
       apply_no_radius="true"
       apply_with_radius="true"
       only_selected="false"
       hide_knots="false" /><inkscape:path-effect
       effect="fillet_chamfer"
       id="path-effect40"
       is_visible="true"
       lpeversion="1"
       nodesatellites_param="F,0,0,1,0,20.212214,0,1 @ F,0,1,1,0,10.838929,0,1 @ F,0,0,1,0,20.212214,0,1"
       radius="0"
       unit="px"
       method="auto"
       mode="F"
       chamfer_steps="1"
       flexible="false"
       use_knot_distance="true"
       apply_no_radius="true"
       apply_with_radius="true"
       only_selected="false"
       hide_knots="false" /><inkscape:path-effect
       effect="fillet_chamfer"
       id="path-effect36"
       is_visible="true"
       lpeversion="1"
       nodesatellites_param="F,0,0,1,0,20.212214,0,1 @ F,0,1,1,0,10.838929,0,1 @ F,0,0,1,0,20.212214,0,1"
       radius="0"
       unit="px"
       method="auto"
       mode="F"
       chamfer_steps="1"
       flexible="false"
       use_knot_distance="true"
       apply_no_radius="true"
       apply_with_radius="true"
       only_selected="false"
       hide_knots="false" /><inkscape:path-effect
       effect="fillet_chamfer"
       id="path-effect30"
       is_visible="true"
       lpeversion="1"
       nodesatellites_param="F,0,0,1,0,20.212214,0,1 @ F,0,1,1,0,10.838929,0,1 @ F,0,0,1,0,20.212214,0,1"
       radius="0"
       unit="px"
       method="auto"
       mode="F"
       chamfer_steps="1"
       flexible="false"
       use_knot_distance="true"
       apply_no_radius="true"
       apply_with_radius="true"
       only_selected="false"
       hide_knots="false" /><inkscape:path-effect
       effect="fillet_chamfer"
       id="path-effect26"
       is_visible="true"
       lpeversion="1"
       nodesatellites_param="F,0,0,1,0,20.212214,0,1 @ F,0,1,1,0,10.838929,0,1 @ F,0,0,1,0,20.212214,0,1"
       radius="0"
       unit="px"
       method="auto"
       mode="F"
       chamfer_steps="1"
       flexible="false"
       use_knot_distance="true"
       apply_no_radius="true"
       apply_with_radius="true"
       only_selected="false"
       hide_knots="false" /><inkscape:path-effect
       effect="fillet_chamfer"
       id="path-effect11"
       is_visible="true"
       lpeversion="1"
       nodesatellites_param="F,0,0,1,0,20.212214,0,1 @ F,0,1,1,0,10.838929,0,1 @ F,0,0,1,0,20.212214,0,1"
       radius="0"
       unit="px"
       method="auto"
       mode="F"
       chamfer_steps="1"
       flexible="false"
       use_knot_distance="true"
       apply_no_radius="true"
       apply_with_radius="true"
       only_selected="false"
       hide_knots="false" /><inkscape:path-effect
       effect="fillet_chamfer"
       id="path-effect8"
       is_visible="true"
       lpeversion="1"
       nodesatellites_param="F,0,0,1,0,20.212214,0,1 @ F,0,1,1,0,10.838929,0,1 @ F,0,0,1,0,20.212214,0,1"
       radius="0"
       unit="px"
       method="auto"
       mode="F"
       chamfer_steps="1"
       flexible="false"
       use_knot_distance="true"
       apply_no_radius="true"
       apply_with_radius="true"
       only_selected="false"
       hide_knots="false" /><inkscape:path-effect
       effect="fillet_chamfer"
       id="path-effect6"
       is_visible="true"
       lpeversion="1"
       nodesatellites_param="F,0,0,1,0,20.212214,0,1 @ F,0,1,1,0,10.838929,0,1 @ F,0,0,1,0,20.212214,0,1"
       radius="0"
       unit="px"
       method="auto"
       mode="F"
       chamfer_steps="1"
       flexible="false"
       use_knot_distance="true"
       apply_no_radius="true"
       apply_with_radius="true"
       only_selected="false"
       hide_knots="false" /><inkscape:path-effect
       effect="fillet_chamfer"
       id="path-effect4"
       is_visible="true"
       lpeversion="1"
       nodesatellites_param="F,0,0,1,0,20.212214,0,1 @ F,0,1,1,0,10.838929,0,1 @ F,0,0,1,0,20.212214,0,1"
       radius="0"
       unit="px"
       method="auto"
       mode="F"
       chamfer_steps="1"
       flexible="false"
       use_knot_distance="true"
       apply_no_radius="true"
       apply_with_radius="true"
       only_selected="false"
       hide_knots="false" /><inkscape:path-effect
       effect="fillet_chamfer"
       id="path-effect2"
       is_visible="true"
       lpeversion="1"
       nodesatellites_param="F,0,0,1,0,20.212214,0,1 @ F,0,1,1,0,10.838929,0,1 @ F,0,0,1,0,20.212214,0,1"
       radius="0"
       unit="px"
       method="auto"
       mode="F"
       chamfer_steps="1"
       flexible="false"
       use_knot_distance="true"
       apply_no_radius="true"
       apply_with_radius="true"
       only_selected="false"
       hide_knots="false" /><inkscape:path-effect
       effect="fillet_chamfer"
       id="path-effect48"
       is_visible="true"
       lpeversion="1"
       nodesatellites_param="F,0,0,1,0,18.408566,0,1 @ F,0,1,1,0,7.1144611,0,1 @ F,0,0,1,0,18.408566,0,1 @ F,0,1,1,0,7.1144611,0,1"
       radius="0"
       unit="px"
       method="auto"
       mode="F"
       chamfer_steps="1"
       flexible="false"
       use_knot_distance="true"
       apply_no_radius="true"
       apply_with_radius="true"
       only_selected="false"
       hide_knots="false" /><inkscape:path-effect
       effect="fillet_chamfer"
       id="path-effect47"
       is_visible="true"
       lpeversion="1"
       nodesatellites_param="F,0,0,1,0,21.188113,0,1 @ F,0,0,1,0,9.7099123,0,1 @ F,0,0,1,0,21.188113,0,1"
       radius="0"
       unit="px"
       method="auto"
       mode="F"
       chamfer_steps="1"
       flexible="false"
       use_knot_distance="true"
       apply_no_radius="true"
       apply_with_radius="true"
       only_selected="false"
       hide_knots="false" /><inkscape:path-effect
       effect="fillet_chamfer"
       id="path-effect45"
       is_visible="true"
       lpeversion="1"
       nodesatellites_param="F,0,0,1,0,21.188113,0,1 @ F,0,0,1,0,9.7099123,0,1 @ F,0,0,1,0,21.188113,0,1"
       radius="0"
       unit="px"
       method="auto"
       mode="F"
       chamfer_steps="1"
       flexible="false"
       use_knot_distance="true"
       apply_no_radius="true"
       apply_with_radius="true"
       only_selected="false"
       hide_knots="false" /><inkscape:path-effect
       effect="fillet_chamfer"
       id="path-effect43"
       is_visible="true"
       lpeversion="1"
       nodesatellites_param="F,0,0,1,0,21.188113,0,1 @ F,0,0,1,0,9.7099123,0,1 @ F,0,0,1,0,21.188113,0,1"
       radius="0"
       unit="px"
       method="auto"
       mode="F"
       chamfer_steps="1"
       flexible="false"
       use_knot_distance="true"
       apply_no_radius="true"
       apply_with_radius="true"
       only_selected="false"
       hide_knots="false" /><inkscape:path-effect
       effect="fillet_chamfer"
       id="path-effect41"
       is_visible="true"
       lpeversion="1"
       nodesatellites_param="F,0,0,1,0,21.188113,0,1 @ F,0,0,1,0,9.7099123,0,1 @ F,0,0,1,0,21.188113,0,1"
       radius="0"
       unit="px"
       method="auto"
       mode="F"
       chamfer_steps="1"
       flexible="false"
       use_knot_distance="true"
       apply_no_radius="true"
       apply_with_radius="true"
       only_selected="false"
       hide_knots="false" /><inkscape:path-effect
       effect="fillet_chamfer"
       id="path-effect39"
       is_visible="true"
       lpeversion="1"
       nodesatellites_param="F,0,0,1,0,21.188113,0,1 @ F,0,0,1,0,9.7099123,0,1 @ F,0,0,1,0,21.188113,0,1"
       radius="0"
       unit="px"
       method="auto"
       mode="F"
       chamfer_steps="1"
       flexible="false"
       use_knot_distance="true"
       apply_no_radius="true"
       apply_with_radius="true"
       only_selected="false"
       hide_knots="false" /><inkscape:path-effect
       effect="fillet_chamfer"
       id="path-effect37"
       is_visible="true"
       lpeversion="1"
       nodesatellites_param="F,0,0,1,0,21.188113,0,1 @ F,0,0,1,0,9.7099123,0,1 @ F,0,0,1,0,21.188113,0,1"
       radius="0"
       unit="px"
       method="auto"
       mode="F"
       chamfer_steps="1"
       flexible="false"
       use_knot_distance="true"
       apply_no_radius="true"
       apply_with_radius="true"
       only_selected="false"
       hide_knots="false" /><inkscape:path-effect
       effect="fillet_chamfer"
       id="path-effect35"
       is_visible="true"
       lpeversion="1"
       nodesatellites_param="F,0,0,1,0,24.630253,0,1 @ F,0,0,1,0,24.630253,0,1 @ F,0,1,1,0,14.641595,0,1"
       radius="0"
       unit="px"
       method="auto"
       mode="F"
       chamfer_steps="1"
       flexible="false"
       use_knot_distance="true"
       apply_no_radius="true"
       apply_with_radius="true"
       only_selected="false"
       hide_knots="false" /><inkscape:path-effect
       effect="fillet_chamfer"
       id="path-effect33"
       is_visible="true"
       lpeversion="1"
       nodesatellites_param="F,0,0,1,0,24.630253,0,1 @ F,0,0,1,0,24.630253,0,1 @ F,0,1,1,0,14.641595,0,1"
       radius="0"
       unit="px"
       method="auto"
       mode="F"
       chamfer_steps="1"
       flexible="false"
       use_knot_distance="true"
       apply_no_radius="true"
       apply_with_radius="true"
       only_selected="false"
       hide_knots="false" /><inkscape:path-effect
       effect="fillet_chamfer"
       id="path-effect32"
       is_visible="true"
       lpeversion="1"
       nodesatellites_param="F,0,1,1,0,25.6199,0,1 @ F,0,0,1,0,25.6199,0,1"
       radius="0"
       unit="px"
       method="auto"
       mode="F"
       chamfer_steps="1"
       flexible="false"
       use_knot_distance="true"
       apply_no_radius="true"
       apply_with_radius="true"
       only_selected="false"
       hide_knots="false" /><inkscape:path-effect
       effect="fillet_chamfer"
       id="path-effect31"
       is_visible="true"
       lpeversion="1"
       nodesatellites_param="F,0,0,1,0,21.188113,0,1 @ F,0,0,1,0,9.7099123,0,1 @ F,0,0,1,0,21.188113,0,1"
       radius="0"
       unit="px"
       method="auto"
       mode="F"
       chamfer_steps="1"
       flexible="false"
       use_knot_distance="true"
       apply_no_radius="true"
       apply_with_radius="true"
       only_selected="false"
       hide_knots="false" /><inkscape:path-effect
       effect="fillet_chamfer"
       id="path-effect29"
       is_visible="true"
       lpeversion="1"
       nodesatellites_param="F,0,0,1,0,21.188113,0,1 @ F,0,0,1,0,9.7099123,0,1 @ F,0,0,1,0,21.188113,0,1"
       radius="0"
       unit="px"
       method="auto"
       mode="F"
       chamfer_steps="1"
       flexible="false"
       use_knot_distance="true"
       apply_no_radius="true"
       apply_with_radius="true"
       only_selected="false"
       hide_knots="false" /><inkscape:path-effect
       effect="fillet_chamfer"
       id="path-effect27"
       is_visible="true"
       lpeversion="1"
       nodesatellites_param="F,0,0,1,0,21.188113,0,1 @ F,0,0,1,0,9.7099123,0,1 @ F,0,0,1,0,21.188113,0,1"
       radius="0"
       unit="px"
       method="auto"
       mode="F"
       chamfer_steps="1"
       flexible="false"
       use_knot_distance="true"
       apply_no_radius="true"
       apply_with_radius="true"
       only_selected="false"
       hide_knots="false" /><inkscape:path-effect
       effect="fillet_chamfer"
       id="path-effect25"
       is_visible="true"
       lpeversion="1"
       nodesatellites_param="F,0,0,1,0,0,0,1 @ F,0,0,1,0,0,0,1 @ F,0,0,1,0,0,0,1"
       radius="0"
       unit="px"
       method="auto"
       mode="F"
       chamfer_steps="1"
       flexible="false"
       use_knot_distance="true"
       apply_no_radius="true"
       apply_with_radius="true"
       only_selected="false"
       hide_knots="false" /><inkscape:path-effect
       effect="fillet_chamfer"
       id="path-effect24"
       is_visible="true"
       lpeversion="1"
       nodesatellites_param="F,0,0,1,0,0,0,1 @ F,0,0,1,0,0,0,1 @ F,0,0,1,0,0,0,1 @ F,0,0,1,0,0,0,1 @ F,0,0,1,0,0,0,1 @ F,0,0,1,0,0,0,1 @ F,0,0,1,0,0,0,1 @ F,0,0,1,0,0,0,1"
       radius="0"
       unit="px"
       method="auto"
       mode="F"
       chamfer_steps="1"
       flexible="false"
       use_knot_distance="true"
       apply_no_radius="true"
       apply_with_radius="true"
       only_selected="false"
       hide_knots="false" /><inkscape:path-effect
       effect="fillet_chamfer"
       id="path-effect23"
       is_visible="true"
       lpeversion="1"
       nodesatellites_param="F,0,0,1,0,0,0,1 @ F,0,0,1,0,0,0,1 @ F,0,0,1,0,0,0,1"
       radius="0"
       unit="px"
       method="auto"
       mode="F"
       chamfer_steps="1"
       flexible="false"
       use_knot_distance="true"
       apply_no_radius="true"
       apply_with_radius="true"
       only_selected="false"
       hide_knots="false" /><inkscape:path-effect
       effect="fillet_chamfer"
       id="path-effect22"
       is_visible="true"
       lpeversion="1"
       nodesatellites_param="F,0,0,1,0,0,0,1 @ F,0,0,1,0,0,0,1 @ F,0,0,1,0,0,0,1 | F,0,0,1,0,0,0,1 @ F,0,0,1,0,0,0,1 @ F,0,0,1,0,0,0,1 | F,0,0,1,0,0,0,1 @ F,0,0,1,0,0,0,1 @ F,0,0,1,0,0,0,1"
       radius="0"
       unit="px"
       method="auto"
       mode="F"
       chamfer_steps="1"
       flexible="false"
       use_knot_distance="true"
       apply_no_radius="true"
       apply_with_radius="true"
       only_selected="false"
       hide_knots="false" /><inkscape:path-effect
       effect="fillet_chamfer"
       id="path-effect21"
       is_visible="true"
       lpeversion="1"
       nodesatellites_param="F,0,0,1,0,0,0,1 @ F,0,0,1,0,0,0,1 @ F,0,0,1,0,0,0,1 | F,0,0,1,0,0,0,1 @ F,0,0,1,0,0,0,1 @ F,0,0,1,0,0,0,1"
       radius="0"
       unit="px"
       method="auto"
       mode="F"
       chamfer_steps="1"
       flexible="false"
       use_knot_distance="true"
       apply_no_radius="true"
       apply_with_radius="true"
       only_selected="false"
       hide_knots="false" /><inkscape:path-effect
       effect="fillet_chamfer"
       id="path-effect20"
       is_visible="true"
       lpeversion="1"
       nodesatellites_param="F,0,0,1,0,19.681136,0,1 @ F,0,1,1,0,10.627084,0,1 @ F,0,0,1,0,19.681136,0,1"
       radius="0"
       unit="px"
       method="auto"
       mode="F"
       chamfer_steps="1"
       flexible="false"
       use_knot_distance="true"
       apply_no_radius="true"
       apply_with_radius="true"
       only_selected="false"
       hide_knots="false" /><inkscape:path-effect
       effect="fillet_chamfer"
       id="path-effect19"
       is_visible="true"
       lpeversion="1"
       nodesatellites_param="F,0,0,1,0,21.188113,0,1 @ F,0,0,1,0,9.7099123,0,1 @ F,0,0,1,0,21.188113,0,1"
       radius="0"
       unit="px"
       method="auto"
       mode="F"
       chamfer_steps="1"
       flexible="false"
       use_knot_distance="true"
       apply_no_radius="true"
       apply_with_radius="true"
       only_selected="false"
       hide_knots="false" /><inkscape:path-effect
       effect="fillet_chamfer"
       id="path-effect18"
       is_visible="true"
       lpeversion="1"
       nodesatellites_param="F,0,0,1,0,20.212214,0,1 @ F,0,1,1,0,10.838929,0,1 @ F,0,0,1,0,20.212214,0,1"
       radius="0"
       unit="px"
       method="auto"
       mode="F"
       chamfer_steps="1"
       flexible="false"
       use_knot_distance="true"
       apply_no_radius="true"
       apply_with_radius="true"
       only_selected="false"
       hide_knots="false" /><inkscape:path-effect
       effect="fillet_chamfer"
       id="path-effect17"
       is_visible="true"
       lpeversion="1"
       nodesatellites_param="F,0,0,1,0,0,0,1 @ F,0,0,1,0,0,0,1 @ F,0,0,1,0,0,0,1"
       radius="0"
       unit="px"
       method="auto"
       mode="F"
       chamfer_steps="1"
       flexible="false"
       use_knot_distance="true"
       apply_no_radius="true"
       apply_with_radius="true"
       only_selected="false"
       hide_knots="false" /><inkscape:path-effect
       effect="fillet_chamfer"
       id="path-effect16"
       is_visible="true"
       lpeversion="1"
       nodesatellites_param="F,0,0,1,0,0,0,1 @ F,0,0,1,0,0,0,1 @ F,0,0,1,0,0,0,1"
       radius="0"
       unit="px"
       method="auto"
       mode="F"
       chamfer_steps="1"
       flexible="false"
       use_knot_distance="true"
       apply_no_radius="true"
       apply_with_radius="true"
       only_selected="false"
       hide_knots="false" /><inkscape:path-effect
       effect="fillet_chamfer"
       id="path-effect15"
       is_visible="true"
       lpeversion="1"
       nodesatellites_param="F,0,0,1,0,0,0,1 @ F,0,0,1,0,0,0,1 @ F,0,0,1,0,0,0,1"
       radius="0"
       unit="px"
       method="auto"
       mode="F"
       chamfer_steps="1"
       flexible="false"
       use_knot_distance="true"
       apply_no_radius="true"
       apply_with_radius="true"
       only_selected="false"
       hide_knots="false" /><inkscape:path-effect
       effect="fillet_chamfer"
       id="path-effect14"
       is_visible="true"
       lpeversion="1"
       nodesatellites_param="F,0,0,1,0,0,0,1 @ F,0,0,1,0,0,0,1 @ F,0,0,1,0,0,0,1 @ F,0,0,1,0,0,0,1 @ F,0,0,1,0,0,0,1 @ F,0,0,1,0,0,0,1"
       radius="0"
       unit="px"
       method="auto"
       mode="F"
       chamfer_steps="1"
       flexible="false"
       use_knot_distance="true"
       apply_no_radius="true"
       apply_with_radius="true"
       only_selected="false"
       hide_knots="false" /><inkscape:path-effect
       effect="fillet_chamfer"
       id="path-effect13"
       is_visible="true"
       lpeversion="1"
       nodesatellites_param="F,0,0,1,0,20.784918,0,1 @ F,0,0,1,0,20.784918,0,1 @ F,0,1,1,0,9.266159,0,1"
       radius="0"
       unit="px"
       method="auto"
       mode="F"
       chamfer_steps="1"
       flexible="false"
       use_knot_distance="true"
       apply_no_radius="true"
       apply_with_radius="true"
       only_selected="false"
       hide_knots="false" /></defs><sodipodi:namedview
     pagecolor="#ffffff"
     bordercolor="#666666"
     borderopacity="1"
     objecttolerance="10"
     gridtolerance="10"
     guidetolerance="10"
     inkscape:pageopacity="0"
     inkscape:pageshadow="2"
     inkscape:window-width="2505"
     inkscape:window-height="1190"
     id="namedview71"
     showgrid="false"
     inkscape:current-layer="svg69"
     inkscape:document-rotation="0"
     inkscape:showpageshadow="2"
     inkscape:pagecheckerboard="0"
     inkscape:deskcolor="#d1d1d1"
     inkscape:zoom="0.94916667"
     inkscape:cx="599.47322"
     inkscape:cy="399.82441"
     inkscape:window-x="26"
     inkscape:window-y="23"
     inkscape:window-maximized="0"><inkscape:grid
       type="xygrid"
       id="grid111"
       originx="0"
       originy="0"
       spacingy="1"
       spacingx="1"
       units="px" /></sodipodi:namedview><rect
     style="fill:#4a86cf;stroke:none;stroke-width:1.39999;stop-color:#000000;fill-opacity:1"
     id="rect77"
     width="1223.0835"
     height="830.08807"
     x="-6.0443931"
     y="-12.899659" /><g
     id="g7232"
     transform="matrix(2.874308,0,0,2.874308,-427.68135,-188.61133)"
     inkscape:export-xdpi="90"
     inkscape:export-ydpi="90"><path
       inkscape:export-ydpi="90"
       inkscape:export-xdpi="90"
       inkscape:export-filename="/home/andreasn/SparkleShare/gnome-marketing/guadec/sponsor-2014.png"
       inkscape:connector-curvature="0"
       d="m 301.82534,161.99996 c -18.13111,0 -21.53226,25.82442 -11.3325,25.82442 10.1983,0 29.46434,-25.82442 11.3325,-25.82442 z"
       style="fill:#ffffff;fill-opacity:1;fill-rule:nonzero;stroke:none"
       id="path15047-7" /><path
       inkscape:export-ydpi="90"
       inkscape:export-xdpi="90"
       inkscape:export-filename="/home/andreasn/SparkleShare/gnome-marketing/guadec/sponsor-2014.png"
       inkscape:connector-curvature="0"
       d="m 271.71909,184.62441 c 5.43079,0.33165 11.38925,-20.72525 1.18213,-19.40089 -10.20345,1.32432 -6.61513,19.06927 -1.18213,19.40089 z"
       style="fill:#ffffff;fill-opacity:1;fill-rule:nonzero;stroke:none"
       id="path15049-2" /><path
       inkscape:export-ydpi="90"
       inkscape:export-xdpi="90"
       inkscape:export-filename="/home/andreasn/SparkleShare/gnome-marketing/guadec/sponsor-2014.png"
       inkscape:connector-curvature="0"
       d="m 246.82991,197.7087 c 3.86251,-1.70019 0.49746,-18.33007 -6.07047,-13.79473 -6.56498,4.53611 2.20799,15.49422 6.07047,13.79473 z"
       style="fill:#ffffff;fill-opacity:1;fill-rule:nonzero;stroke:none"
       id="path15051-0" /><path
       inkscape:export-ydpi="90"
       inkscape:export-xdpi="90"
       inkscape:export-filename="/home/andreasn/SparkleShare/gnome-marketing/guadec/sponsor-2014.png"
       inkscape:connector-curvature="0"
       d="m 257.71287,189.00427 c 4.598,-0.93744 4.85005,-19.79815 -3.34957,-16.41468 -8.20107,3.38421 -1.24476,17.35358 3.34957,16.41468 z"
       style="fill:#ffffff;fill-opacity:1;fill-rule:nonzero;stroke:none"
       id="path15053-9" /><path
       inkscape:export-ydpi="90"
       inkscape:export-xdpi="90"
       inkscape:export-filename="/home/andreasn/SparkleShare/gnome-marketing/guadec/sponsor-2014.png"
       inkscape:connector-curvature="0"
       d="m 281.72284,231.21168 c 0.81582,6.2304 -4.57074,9.30727 -9.84602,5.29077 -16.7935,-12.78583 27.8054,-19.16436 24.8656,-36.63218 -2.44014,-14.4993 -46.92775,-10.03541 -51.99373,12.65168 -3.42915,15.34457 14.11534,36.63291 32.42184,36.63291 9.00586,0 19.39353,-8.13181 21.33695,-18.43328 1.48427,-7.85542 -17.46561,-4.7078 -16.78464,0.4901 z"
       style="fill:#ffffff;fill-opacity:1;fill-rule:nonzero;stroke:none"
       id="path15055-1" /><path
       inkscape:export-ydpi="90"
       inkscape:export-xdpi="90"
       inkscape:export-filename="/home/andreasn/SparkleShare/gnome-marketing/guadec/sponsor-2014.png"
       id="path15059-8"
       style="font-style:normal;font-variant:normal;font-weight:bold;font-stretch:normal;font-size:148.7px;line-height:125%;font-family:'Bitstream Vera Sans';text-align:start;writing-mode:lr-tb;text-anchor:start;fill:#ffffff;fill-opacity:1;stroke:none"
       d="m 394.44212,192.52036 c -4.56579,0.12298 -8.17147,1.76395 -10.82308,4.91102 -2.74597,3.27506 -4.12712,7.80028 -4.12712,13.57134 0,5.75512 1.38123,10.26795 4.12712,13.54297 2.75936,3.27508 6.5479,4.91098 11.38029,4.91098 4.84571,0 8.64375,-1.6359 11.38971,-4.91098 2.74589,-3.27502 4.11769,-7.78785 4.11768,-13.54297 -2e-5,-5.77106 -1.37179,-10.29628 -4.11768,-13.57134 -2.74596,-3.275 -6.54405,-4.91096 -11.38971,-4.91102 -0.18865,0 -0.37161,-0.004 -0.55721,0 z m 0.34,6.64874 c 0.0729,-0.002 0.14318,0 0.21721,0 2.38245,4e-5 4.22855,1.03097 5.5343,3.0977 1.30565,2.0668 1.96437,4.98393 1.96439,8.73592 0,3.73606 -0.65878,6.6314 -1.96439,8.69809 -1.30569,2.06684 -3.1519,3.10714 -5.5343,3.10714 -2.36911,0 -4.20027,-1.0403 -5.50596,-3.10714 -1.30569,-2.06669 -1.96437,-4.96203 -1.96441,-8.69809 0,-3.75197 0.65878,-6.66912 1.96441,-8.73592 1.26482,-2.00213 3.02585,-3.03508 5.28875,-3.0977 z"
       inkscape:connector-curvature="0" /><path
       inkscape:export-ydpi="90"
       inkscape:export-xdpi="90"
       inkscape:export-filename="/home/andreasn/SparkleShare/gnome-marketing/guadec/sponsor-2014.png"
       id="path15061-7"
       style="font-style:normal;font-variant:normal;font-weight:bold;font-stretch:normal;font-size:148.7px;line-height:125%;font-family:'Bitstream Vera Sans';text-align:start;writing-mode:lr-tb;text-anchor:start;fill:#ffffff;fill-opacity:1;stroke:none"
       d="m 342.86404,226.11817 c -4.02177,3.37747 -10.00534,3.33863 -12.49809,3.33863 -5.02078,0 -8.99834,-1.6534 -11.9327,-4.96024 -2.93442,-3.32274 -4.40156,-7.82191 -4.40156,-13.49759 0,-5.73925 1.49409,-10.2543 4.48232,-13.54525 2.98824,-3.29091 7.08019,-4.93637 12.27597,-4.93639 2.00558,2e-5 3.9237,0.22259 5.75433,0.66772 1.84409,0.44516 3.58051,1.10494 5.20922,1.97931 l -2.09161,6.18357 c -0.91567,-0.50126 -1.96401,-0.99527 -2.93588,-1.34257 -1.65566,-0.55639 -3.318,-0.83463 -4.98708,-0.83465 -3.09595,2e-5 -5.4852,1.02548 -7.16773,3.07631 -1.66912,2.03498 -2.50365,4.9523 -2.50365,8.75195 0,3.7679 0.8076,6.67729 2.42291,8.72815 1.6152,2.05085 4.04266,3.07626 6.88501,3.07626 2.88757,0 4.6761,-0.72785 5.62996,-1.49477 v -6.1602 h -6.25585 v -6.1526 h 12.11443"
       inkscape:connector-curvature="0" /><path
       inkscape:export-ydpi="90"
       inkscape:export-xdpi="90"
       inkscape:export-filename="/home/andreasn/SparkleShare/gnome-marketing/guadec/sponsor-2014.png"
       id="path15063-3"
       style="font-style:normal;font-variant:normal;font-weight:bold;font-stretch:normal;font-size:148.7px;line-height:125%;font-family:'Bitstream Vera Sans';text-align:start;writing-mode:lr-tb;text-anchor:start;fill:#ffffff;fill-opacity:1;stroke:none"
       d="m 348.17742,193.16119 h 4.90431 l 15.49682,21.39746 v -21.39746 h 6.61406 v 35.60402 h -4.90431 l -15.49678,-21.39747 v 21.39747 h -6.6141 v -35.60402"
       inkscape:connector-curvature="0" /><path
       inkscape:export-ydpi="90"
       inkscape:export-xdpi="90"
       inkscape:export-filename="/home/andreasn/SparkleShare/gnome-marketing/guadec/sponsor-2014.png"
       id="path15065-5"
       style="font-style:normal;font-variant:normal;font-weight:bold;font-stretch:normal;font-size:148.7px;line-height:125%;font-family:'Bitstream Vera Sans';text-align:start;writing-mode:lr-tb;text-anchor:start;fill:#ffffff;fill-opacity:1;stroke:none"
       d="m 415.60926,193.16119 h 9.89333 l 6.865,22.22727 6.90519,-22.22727 h 8.36227 l 3.77769,35.60402 h -7.34956 l -2.26652,-22.26355 -6.94559,22.37033 h -4.92658 l -6.94558,-23.12588 -2.26674,23.0191 h -7.3696 l 3.77764,-35.60402"
       inkscape:connector-curvature="0" /><path
       inkscape:export-ydpi="90"
       inkscape:export-xdpi="90"
       inkscape:export-filename="/home/andreasn/SparkleShare/gnome-marketing/guadec/sponsor-2014.png"
       id="path15067-8"
       style="font-style:normal;font-variant:normal;font-weight:bold;font-stretch:normal;font-size:148.7px;line-height:125%;font-family:'Bitstream Vera Sans';text-align:start;writing-mode:lr-tb;text-anchor:start;fill:#ffffff;fill-opacity:1;stroke:none"
       d="m 456.71765,193.16119 h 20.97804 v 6.93958 h -13.20484 v 7.38506 h 10.15088 v 6.18403 h -10.15088 v 8.1558 h 13.649 v 6.93955 h -21.4222 v -35.60402"
       inkscape:connector-curvature="0" /><path
       inkscape:export-ydpi="90"
       inkscape:export-xdpi="90"
       inkscape:export-filename="/home/andreasn/SparkleShare/gnome-marketing/guadec/sponsor-2014.png"
       d="m 484.57223,186.15274 h 5.71976 v 0.76989 h -2.40011 v 5.99149 h -0.91932 v -5.99149 h -2.40033 v -0.76989"
       style="font-style:normal;font-weight:normal;font-size:30.6896px;font-family:'Bitstream Vera Sans';letter-spacing:0.252382;fill:#eeeeec;fill-opacity:1;stroke:none"
       id="path9048"
       inkscape:connector-curvature="0" /><path
       inkscape:export-ydpi="90"
       inkscape:export-xdpi="90"
       inkscape:export-filename="/home/andreasn/SparkleShare/gnome-marketing/guadec/sponsor-2014.png"
       d="m 491.25598,186.15274 h 1.36304 l 1.72556,4.60118 1.73452,-4.60118 h 1.36304 v 6.76138 h -0.89215 v -5.93713 l -1.74352,4.6374 h -0.91931 l -1.74349,-4.6374 v 5.93713 h -0.88769 v -6.76138"
       style="font-style:normal;font-weight:normal;font-size:30.6896px;font-family:'Bitstream Vera Sans';letter-spacing:0.252382;fill:#ffffff;fill-opacity:1;stroke:none"
       id="path9050"
       inkscape:connector-curvature="0" /></g><g
     id="g1"
     transform="matrix(1.7189672,0,0,1.7189672,-10.285131,20.868281)"
     style="stroke-width:0.581745"><path
       style="color:#000000;display:inline;overflow:visible;visibility:visible;opacity:0.108;fill:#f7f7f7;fill-opacity:1;fill-rule:nonzero;stroke:none;stroke-width:0.62053;marker:none;enable-background:accumulate"
       d="m 606.91717,13.388076 -59.0205,58.392521 a 17.046748,17.046748 112.65322 0 0 -5.05752,12.118167 v 51.568676 a 7.6450258,7.6450258 22.552975 0 0 13.04087,5.41584 l 59.08,-58.861907 a 17.132092,17.132092 112.55425 0 0 5.0403,-12.135834 l 0.002,-51.035914 a 7.6823333,7.6823333 22.6545 0 0 -13.08543,-5.461549 z"
       id="path13"
       sodipodi:nodetypes="ccccc"
       inkscape:path-effect="#path-effect48"
       inkscape:original-d="M 620.00342,0.44105861 542.83915,76.784303 V 153.87601 L 620,77 Z" /><path
       d="M 230.46638,444.75804 V 397.9759 A 10.627084,10.627084 45 0 0 219.8393,387.34882 l -46.85672,0 a 8.14662,8.14662 112.48615 0 0 -5.75775,13.90993 l 49.31816,49.2705 a 8.1577681,8.1577681 157.48615 0 0 13.92339,-5.77121 z"
       style="color:#000000;display:inline;overflow:visible;visibility:visible;opacity:0.108;fill:#f7f7f7;fill-opacity:1;fill-rule:nonzero;stroke:none;stroke-width:0.62053;marker:none;enable-background:accumulate"
       id="path6"
       inkscape:path-effect="#path-effect20"
       inkscape:original-d="M 230.46638,464.43918 V 387.34882 H 153.30144 Z"
       transform="translate(24.78644,-7.444604)" /><path
       style="color:#000000;display:inline;overflow:visible;visibility:visible;opacity:0.108;fill:#f7f7f7;fill-opacity:1;fill-rule:nonzero;stroke:none;stroke-width:0.62053;marker:none;enable-background:accumulate"
       d="M 0.0018498,258.82765 V 363.0021 a 10.155536,10.155536 22.407314 0 0 17.3597802,7.15777 l 48.172112,-48.48483 a 14.808574,14.808574 90.139485 0 0 0.05069,-20.82335 l -48.308084,-49.0975 a 10.085451,10.085451 157.73217 0 0 -17.2745022,7.07346 z"
       id="path8"
       sodipodi:nodetypes="cccc"
       inkscape:path-effect="#path-effect33"
       inkscape:original-d="M 0.0018498,234.1974 V 387.63235 L 75.853363,311.28843 Z"
       transform="translate(20,-20)" /><path
       d="m 77.166795,407.56103 v 46.03922 A 10.838929,10.838929 135 0 1 66.327866,464.43918 H 20.214064 A 8.3664489,8.3664489 67.513852 0 1 14.300952,450.1539 l 48.566741,-48.5198 a 8.3778986,8.3778986 22.513852 0 1 14.299102,5.92693 z"
       style="color:#000000;display:inline;overflow:visible;visibility:visible;opacity:0.108;fill:#ecedea;fill-opacity:1;fill-rule:nonzero;stroke:none;stroke-width:0.62053;marker:none;enable-background:accumulate"
       id="path9"
       inkscape:path-effect="#path-effect18"
       inkscape:original-d="m 77.166795,387.34882 v 77.09036 H 0.0018498 Z"
       transform="translate(17.833205,-20)" /><path
       style="color:#000000;display:inline;overflow:visible;visibility:visible;opacity:0.108;fill:#f7f7f7;fill-opacity:1;fill-rule:nonzero;stroke:none;stroke-width:0.62053;marker:none;enable-background:accumulate"
       d="M 0.0018498,258.82765 V 363.0021 a 10.155536,10.155536 22.407314 0 0 17.3597802,7.15777 l 48.172112,-48.48483 a 14.808574,14.808574 90.139485 0 0 0.05069,-20.82335 l -48.308084,-49.0975 a 10.085451,10.085451 157.73217 0 0 -17.2745022,7.07346 z"
       id="path33"
       sodipodi:nodetypes="cccc"
       inkscape:path-effect="#path-effect35"
       inkscape:original-d="M 0.0018498,234.1974 V 387.63235 L 75.853363,311.28843 Z"
       transform="matrix(0,-0.96633227,0.96633227,0,29.405739,365.50327)" /><path
       d="m 77.166795,407.56103 v 46.03922 A 10.838929,10.838929 135 0 1 66.327866,464.43918 H 20.214064 A 8.3664489,8.3664489 67.513852 0 1 14.300952,450.1539 l 48.566741,-48.5198 a 8.3778986,8.3778986 22.513852 0 1 14.299102,5.92693 z"
       style="color:#000000;display:inline;overflow:visible;visibility:visible;opacity:0.108;fill:#ecedea;fill-opacity:1;fill-rule:nonzero;stroke:none;stroke-width:0.62053;marker:none;enable-background:accumulate"
       id="path1"
       inkscape:path-effect="#path-effect2"
       inkscape:original-d="m 77.166795,387.34882 v 77.09036 H 0.0018498 Z"
       transform="translate(97.833205,-20)" /><path
       d="m 77.166795,407.56103 v 46.03922 A 10.838929,10.838929 135 0 1 66.327866,464.43918 H 20.214064 A 8.3664489,8.3664489 67.513852 0 1 14.300952,450.1539 l 48.566741,-48.5198 a 8.3778986,8.3778986 22.513852 0 1 14.299102,5.92693 z"
       style="color:#000000;display:inline;overflow:visible;visibility:visible;opacity:0.108;fill:#ecedea;fill-opacity:1;fill-rule:nonzero;stroke:none;stroke-width:0.62053;marker:none;enable-background:accumulate"
       id="path36"
       inkscape:path-effect="#path-effect40"
       inkscape:original-d="m 77.166795,387.34882 v 77.09036 H 0.0018498 Z"
       transform="translate(417.83321,-99.21356)" /><path
       d="M 230.46638,444.75804 V 397.9759 A 10.627084,10.627084 45 0 0 219.8393,387.34882 l -46.85672,0 a 8.14662,8.14662 112.48615 0 0 -5.75775,13.90993 l 49.31816,49.2705 a 8.1577681,8.1577681 157.48615 0 0 13.92339,-5.77121 z"
       style="color:#000000;display:inline;overflow:visible;visibility:visible;opacity:0.108;fill:#f7f7f7;fill-opacity:1;fill-rule:nonzero;stroke:none;stroke-width:0.62053;marker:none;enable-background:accumulate"
       id="path40"
       inkscape:path-effect="#path-effect44"
       inkscape:original-d="M 230.46638,464.43918 V 387.34882 H 153.30144 Z"
       transform="rotate(180,210.04439,376.01679)" /><path
       d="m 77.166795,407.56103 v 46.03922 A 10.838929,10.838929 135 0 1 66.327866,464.43918 H 20.214064 A 8.3664489,8.3664489 67.513852 0 1 14.300952,450.1539 l 48.566741,-48.5198 a 8.3778986,8.3778986 22.513852 0 1 14.299102,5.92693 z"
       style="color:#000000;display:inline;overflow:visible;visibility:visible;opacity:0.108;fill:#ecedea;fill-opacity:1;fill-rule:nonzero;stroke:none;stroke-width:0.62053;marker:none;enable-background:accumulate"
       id="path44"
       inkscape:path-effect="#path-effect49"
       inkscape:original-d="m 77.166795,387.34882 v 77.09036 H 0.0018498 Z"
       transform="translate(257.83321,-20)" /></g></svg>
