<?xml version="1.0" encoding="UTF-8" standalone="no"?>
<svg
   inkscape:version="1.4 (e7c3feb100, 2024-10-09)"
   id="svg8"
   version="1.1"
   viewBox="0 0 1920 450"
   sodipodi:docname="platform-dark.svg"
   inkscape:export-filename="/var/home/jimmac/SparkleShare/app-illustrations/assets/hig/hig-splash.png"
   inkscape:export-xdpi="48"
   inkscape:export-ydpi="48"
   width="1920"
   height="450"
   xmlns:inkscape="http://www.inkscape.org/namespaces/inkscape"
   xmlns:sodipodi="http://sodipodi.sourceforge.net/DTD/sodipodi-0.dtd"
   xmlns:xlink="http://www.w3.org/1999/xlink"
   xmlns="http://www.w3.org/2000/svg"
   xmlns:svg="http://www.w3.org/2000/svg"
   xmlns:rdf="http://www.w3.org/1999/02/22-rdf-syntax-ns#"
   xmlns:cc="http://creativecommons.org/ns#"
   xmlns:dc="http://purl.org/dc/elements/1.1/">
  <defs
     id="defs2">
    <inkscape:perspective
       sodipodi:type="inkscape:persp3d"
       inkscape:vp_x="0 : -149.9 : 1"
       inkscape:vp_y="0 : 1.6666667 : 0"
       inkscape:vp_z="1 : -149.9 : 1"
       inkscape:persp3d-origin="0.5 : -150.2 : 1"
       id="perspective33865" />
    <marker
       style="overflow:visible"
       id="TriangleInM"
       refX="0"
       refY="0"
       orient="auto"
       inkscape:stockid="TriangleInM"
       inkscape:isstock="true">
      <path
         transform="scale(-0.4)"
         style="fill:#1a5fb4;fill-opacity:1;fill-rule:evenodd;stroke:#1a5fb4;stroke-width:1pt;stroke-opacity:1"
         d="M 5.77,0 -2.88,5 V -5 Z"
         id="path4327" />
    </marker>
    <marker
       style="overflow:visible"
       id="TriangleOutM"
       refX="0"
       refY="0"
       orient="auto"
       inkscape:stockid="TriangleOutM"
       inkscape:isstock="true">
      <path
         transform="scale(0.4)"
         style="fill:#1a5fb4;fill-opacity:1;fill-rule:evenodd;stroke:#1a5fb4;stroke-width:1pt;stroke-opacity:1"
         d="M 5.77,0 -2.88,5 V -5 Z"
         id="path4336" />
    </marker>
    <inkscape:path-effect
       effect="powerclip"
       id="path-effect988"
       is_visible="true"
       lpeversion="1"
       inverse="true"
       flatten="false"
       hide_clip="false"
       message="" />
    <inkscape:path-effect
       effect="fillet_chamfer"
       id="path-effect259"
       is_visible="true"
       lpeversion="1"
       satellites_param="F,0,0,1,0,8,0,1 @ F,0,0,1,0,8,0,1 @ F,0,0,1,0,8,0,1 @ F,0,0,1,0,8,0,1"
       unit="px"
       method="auto"
       mode="F"
       radius="8"
       chamfer_steps="1"
       flexible="false"
       use_knot_distance="true"
       apply_no_radius="true"
       apply_with_radius="true"
       only_selected="false"
       hide_knots="false"
       nodesatellites_param="F,0,0,1,0,8,0,1 @ F,0,0,1,0,8,0,1 @ F,0,0,1,0,8,0,1 @ F,0,0,1,0,8,0,1" />
    <marker
       id="o"
       refX="0"
       refY="0"
       orient="auto"
       overflow="visible">
      <path
         d="m -2.308,0 3.46,-2 v 4 z"
         fill="#ffffff"
         fill-rule="evenodd"
         stroke="#ffffff"
         stroke-width="0.4pt"
         id="path44" />
    </marker>
    <marker
       id="p"
       refX="0"
       refY="0"
       orient="auto"
       overflow="visible">
      <path
         d="m 2.308,0 -3.46,2 v -4 z"
         fill="#ffffff"
         fill-rule="evenodd"
         stroke="#ffffff"
         stroke-width="0.4pt"
         id="path47" />
    </marker>
    <marker
       id="q"
       refX="0"
       refY="0"
       orient="auto"
       overflow="visible">
      <path
         d="m 2.308,0 -3.46,2 v -4 z"
         fill="#ffffff"
         fill-rule="evenodd"
         stroke="#ffffff"
         stroke-width="0.4pt"
         id="path50" />
    </marker>
    <marker
       id="r"
       refX="0"
       refY="0"
       orient="auto"
       overflow="visible">
      <path
         d="m 2.308,0 -3.46,2 v -4 z"
         fill="#ffffff"
         fill-rule="evenodd"
         stroke="#ffffff"
         stroke-width="0.4pt"
         id="path53" />
    </marker>
    <marker
       id="s"
       refX="0"
       refY="0"
       orient="auto"
       overflow="visible">
      <path
         d="m 2.308,0 -3.46,2 v -4 z"
         fill="#ffffff"
         fill-rule="evenodd"
         stroke="#ffffff"
         stroke-width="0.4pt"
         id="path56" />
    </marker>
    <marker
       id="t"
       refX="0"
       refY="0"
       orient="auto"
       overflow="visible">
      <path
         d="m 2.308,0 -3.46,2 v -4 z"
         fill="#ffffff"
         fill-rule="evenodd"
         stroke="#ffffff"
         stroke-width="0.4pt"
         id="path59" />
    </marker>
    <marker
       id="u"
       refX="0"
       refY="0"
       orient="auto"
       overflow="visible">
      <path
         d="m -2.308,0 3.46,-2 v 4 z"
         fill="#ffffff"
         fill-rule="evenodd"
         stroke="#ffffff"
         stroke-width="0.4pt"
         id="path62" />
    </marker>
    <marker
       id="v"
       refX="0"
       refY="0"
       orient="auto"
       overflow="visible">
      <path
         d="m 2.308,0 -3.46,2 v -4 z"
         fill="#ffffff"
         fill-rule="evenodd"
         stroke="#ffffff"
         stroke-width="0.4pt"
         id="path65" />
    </marker>
    <marker
       id="w"
       refX="0"
       refY="0"
       orient="auto"
       overflow="visible">
      <path
         d="m -2.308,0 3.46,-2 v 4 z"
         fill="#ffffff"
         fill-rule="evenodd"
         stroke="#ffffff"
         stroke-width="0.4pt"
         id="path68" />
    </marker>
    <marker
       id="x"
       refX="0"
       refY="0"
       orient="auto"
       overflow="visible">
      <path
         d="m 2.308,0 -3.46,2 v -4 z"
         fill="#ffffff"
         fill-rule="evenodd"
         stroke="#ffffff"
         stroke-width="0.4pt"
         id="path71" />
    </marker>
    <marker
       id="y"
       refX="0"
       refY="0"
       orient="auto"
       overflow="visible">
      <path
         d="m -2.308,0 3.46,-2 v 4 z"
         fill="#ffffff"
         fill-rule="evenodd"
         stroke="#ffffff"
         stroke-width="0.4pt"
         id="path74" />
    </marker>
    <marker
       id="z"
       refX="0"
       refY="0"
       orient="auto"
       overflow="visible">
      <path
         d="m 2.308,0 -3.46,2 v -4 z"
         fill="#ffffff"
         fill-rule="evenodd"
         stroke="#ffffff"
         stroke-width="0.4pt"
         id="path77" />
    </marker>
    <inkscape:path-effect
       effect="fillet_chamfer"
       id="path-effect259-3"
       is_visible="true"
       lpeversion="1"
       satellites_param="F,0,0,1,0,8,0,1 @ F,0,0,1,0,8,0,1 @ F,0,0,1,0,8,0,1 @ F,0,0,1,0,8,0,1"
       unit="px"
       method="auto"
       mode="F"
       radius="8"
       chamfer_steps="1"
       flexible="false"
       use_knot_distance="true"
       apply_no_radius="true"
       apply_with_radius="true"
       only_selected="false"
       hide_knots="false"
       nodesatellites_param="F,0,0,1,0,8,0,1 @ F,0,0,1,0,8,0,1 @ F,0,0,1,0,8,0,1 @ F,0,0,1,0,8,0,1" />
    <marker
       id="o-6"
       refX="0"
       refY="0"
       orient="auto"
       overflow="visible">
      <path
         d="m -2.308,0 3.46,-2 v 4 z"
         fill="#ffffff"
         fill-rule="evenodd"
         stroke="#ffffff"
         stroke-width="0.4pt"
         id="path44-7" />
    </marker>
    <marker
       id="p-5"
       refX="0"
       refY="0"
       orient="auto"
       overflow="visible">
      <path
         d="m 2.308,0 -3.46,2 v -4 z"
         fill="#ffffff"
         fill-rule="evenodd"
         stroke="#ffffff"
         stroke-width="0.4pt"
         id="path47-3" />
    </marker>
    <marker
       id="q-5"
       refX="0"
       refY="0"
       orient="auto"
       overflow="visible">
      <path
         d="m 2.308,0 -3.46,2 v -4 z"
         fill="#ffffff"
         fill-rule="evenodd"
         stroke="#ffffff"
         stroke-width="0.4pt"
         id="path50-6" />
    </marker>
    <marker
       id="r-2"
       refX="0"
       refY="0"
       orient="auto"
       overflow="visible">
      <path
         d="m 2.308,0 -3.46,2 v -4 z"
         fill="#ffffff"
         fill-rule="evenodd"
         stroke="#ffffff"
         stroke-width="0.4pt"
         id="path53-9" />
    </marker>
    <marker
       id="s-1"
       refX="0"
       refY="0"
       orient="auto"
       overflow="visible">
      <path
         d="m 2.308,0 -3.46,2 v -4 z"
         fill="#ffffff"
         fill-rule="evenodd"
         stroke="#ffffff"
         stroke-width="0.4pt"
         id="path56-2" />
    </marker>
    <marker
       id="t-7"
       refX="0"
       refY="0"
       orient="auto"
       overflow="visible">
      <path
         d="m 2.308,0 -3.46,2 v -4 z"
         fill="#ffffff"
         fill-rule="evenodd"
         stroke="#ffffff"
         stroke-width="0.4pt"
         id="path59-0" />
    </marker>
    <marker
       id="u-9"
       refX="0"
       refY="0"
       orient="auto"
       overflow="visible">
      <path
         d="m -2.308,0 3.46,-2 v 4 z"
         fill="#ffffff"
         fill-rule="evenodd"
         stroke="#ffffff"
         stroke-width="0.4pt"
         id="path62-3" />
    </marker>
    <marker
       id="v-6"
       refX="0"
       refY="0"
       orient="auto"
       overflow="visible">
      <path
         d="m 2.308,0 -3.46,2 v -4 z"
         fill="#ffffff"
         fill-rule="evenodd"
         stroke="#ffffff"
         stroke-width="0.4pt"
         id="path65-0" />
    </marker>
    <marker
       id="w-6"
       refX="0"
       refY="0"
       orient="auto"
       overflow="visible">
      <path
         d="m -2.308,0 3.46,-2 v 4 z"
         fill="#ffffff"
         fill-rule="evenodd"
         stroke="#ffffff"
         stroke-width="0.4pt"
         id="path68-2" />
    </marker>
    <marker
       id="x-6"
       refX="0"
       refY="0"
       orient="auto"
       overflow="visible">
      <path
         d="m 2.308,0 -3.46,2 v -4 z"
         fill="#ffffff"
         fill-rule="evenodd"
         stroke="#ffffff"
         stroke-width="0.4pt"
         id="path71-1" />
    </marker>
    <marker
       id="y-8"
       refX="0"
       refY="0"
       orient="auto"
       overflow="visible">
      <path
         d="m -2.308,0 3.46,-2 v 4 z"
         fill="#ffffff"
         fill-rule="evenodd"
         stroke="#ffffff"
         stroke-width="0.4pt"
         id="path74-7" />
    </marker>
    <marker
       id="z-9"
       refX="0"
       refY="0"
       orient="auto"
       overflow="visible">
      <path
         d="m 2.308,0 -3.46,2 v -4 z"
         fill="#ffffff"
         fill-rule="evenodd"
         stroke="#ffffff"
         stroke-width="0.4pt"
         id="path77-2" />
    </marker>
    <marker
       id="marker1"
       refX="0"
       refY="0"
       orient="auto"
       overflow="visible">
      <path
         d="m -2.308,0 3.46,-2 v 4 z"
         fill="#ffffff"
         fill-rule="evenodd"
         stroke="#ffffff"
         stroke-width="0.4pt"
         id="path1" />
    </marker>
    <marker
       id="marker2"
       refX="0"
       refY="0"
       orient="auto"
       overflow="visible">
      <path
         d="m 2.308,0 -3.46,2 v -4 z"
         fill="#ffffff"
         fill-rule="evenodd"
         stroke="#ffffff"
         stroke-width="0.4pt"
         id="path2" />
    </marker>
    <marker
       id="marker3"
       refX="0"
       refY="0"
       orient="auto"
       overflow="visible">
      <path
         d="m 2.308,0 -3.46,2 v -4 z"
         fill="#ffffff"
         fill-rule="evenodd"
         stroke="#ffffff"
         stroke-width="0.4pt"
         id="path3" />
    </marker>
    <marker
       id="marker4"
       refX="0"
       refY="0"
       orient="auto"
       overflow="visible">
      <path
         d="m 2.308,0 -3.46,2 v -4 z"
         fill="#ffffff"
         fill-rule="evenodd"
         stroke="#ffffff"
         stroke-width="0.4pt"
         id="path4" />
    </marker>
    <inkscape:path-effect
       effect="fillet_chamfer"
       id="path-effect259-5"
       is_visible="true"
       lpeversion="1"
       satellites_param="F,0,0,1,0,8,0,1 @ F,0,0,1,0,8,0,1 @ F,0,0,1,0,8,0,1 @ F,0,0,1,0,8,0,1"
       unit="px"
       method="auto"
       mode="F"
       radius="8"
       chamfer_steps="1"
       flexible="false"
       use_knot_distance="true"
       apply_no_radius="true"
       apply_with_radius="true"
       only_selected="false"
       hide_knots="false"
       nodesatellites_param="F,0,0,1,0,8,0,1 @ F,0,0,1,0,8,0,1 @ F,0,0,1,0,8,0,1 @ F,0,0,1,0,8,0,1" />
    <marker
       id="o-61"
       refX="0"
       refY="0"
       orient="auto"
       overflow="visible">
      <path
         d="m -2.308,0 3.46,-2 v 4 z"
         fill="#ffffff"
         fill-rule="evenodd"
         stroke="#ffffff"
         stroke-width="0.4pt"
         id="path44-1" />
    </marker>
    <marker
       id="p-59"
       refX="0"
       refY="0"
       orient="auto"
       overflow="visible">
      <path
         d="m 2.308,0 -3.46,2 v -4 z"
         fill="#ffffff"
         fill-rule="evenodd"
         stroke="#ffffff"
         stroke-width="0.4pt"
         id="path47-8" />
    </marker>
    <marker
       id="q-4"
       refX="0"
       refY="0"
       orient="auto"
       overflow="visible">
      <path
         d="m 2.308,0 -3.46,2 v -4 z"
         fill="#ffffff"
         fill-rule="evenodd"
         stroke="#ffffff"
         stroke-width="0.4pt"
         id="path50-8" />
    </marker>
    <marker
       id="r-1"
       refX="0"
       refY="0"
       orient="auto"
       overflow="visible">
      <path
         d="m 2.308,0 -3.46,2 v -4 z"
         fill="#ffffff"
         fill-rule="evenodd"
         stroke="#ffffff"
         stroke-width="0.4pt"
         id="path53-0" />
    </marker>
    <marker
       id="s-3"
       refX="0"
       refY="0"
       orient="auto"
       overflow="visible">
      <path
         d="m 2.308,0 -3.46,2 v -4 z"
         fill="#ffffff"
         fill-rule="evenodd"
         stroke="#ffffff"
         stroke-width="0.4pt"
         id="path56-0" />
    </marker>
    <marker
       id="t-4"
       refX="0"
       refY="0"
       orient="auto"
       overflow="visible">
      <path
         d="m 2.308,0 -3.46,2 v -4 z"
         fill="#ffffff"
         fill-rule="evenodd"
         stroke="#ffffff"
         stroke-width="0.4pt"
         id="path59-4" />
    </marker>
    <marker
       id="u-4"
       refX="0"
       refY="0"
       orient="auto"
       overflow="visible">
      <path
         d="m -2.308,0 3.46,-2 v 4 z"
         fill="#ffffff"
         fill-rule="evenodd"
         stroke="#ffffff"
         stroke-width="0.4pt"
         id="path62-4" />
    </marker>
    <marker
       id="v-7"
       refX="0"
       refY="0"
       orient="auto"
       overflow="visible">
      <path
         d="m 2.308,0 -3.46,2 v -4 z"
         fill="#ffffff"
         fill-rule="evenodd"
         stroke="#ffffff"
         stroke-width="0.4pt"
         id="path65-6" />
    </marker>
    <marker
       id="w-3"
       refX="0"
       refY="0"
       orient="auto"
       overflow="visible">
      <path
         d="m -2.308,0 3.46,-2 v 4 z"
         fill="#ffffff"
         fill-rule="evenodd"
         stroke="#ffffff"
         stroke-width="0.4pt"
         id="path68-1" />
    </marker>
    <marker
       id="x-7"
       refX="0"
       refY="0"
       orient="auto"
       overflow="visible">
      <path
         d="m 2.308,0 -3.46,2 v -4 z"
         fill="#ffffff"
         fill-rule="evenodd"
         stroke="#ffffff"
         stroke-width="0.4pt"
         id="path71-5" />
    </marker>
    <marker
       id="y-9"
       refX="0"
       refY="0"
       orient="auto"
       overflow="visible">
      <path
         d="m -2.308,0 3.46,-2 v 4 z"
         fill="#ffffff"
         fill-rule="evenodd"
         stroke="#ffffff"
         stroke-width="0.4pt"
         id="path74-6" />
    </marker>
    <marker
       id="z-2"
       refX="0"
       refY="0"
       orient="auto"
       overflow="visible">
      <path
         d="m 2.308,0 -3.46,2 v -4 z"
         fill="#ffffff"
         fill-rule="evenodd"
         stroke="#ffffff"
         stroke-width="0.4pt"
         id="path77-1" />
    </marker>
    <marker
       id="marker1-7"
       refX="0"
       refY="0"
       orient="auto"
       overflow="visible">
      <path
         d="m -2.308,0 3.46,-2 v 4 z"
         fill="#ffffff"
         fill-rule="evenodd"
         stroke="#ffffff"
         stroke-width="0.4pt"
         id="path1-8" />
    </marker>
    <marker
       id="marker2-5"
       refX="0"
       refY="0"
       orient="auto"
       overflow="visible">
      <path
         d="m 2.308,0 -3.46,2 v -4 z"
         fill="#ffffff"
         fill-rule="evenodd"
         stroke="#ffffff"
         stroke-width="0.4pt"
         id="path2-7" />
    </marker>
    <marker
       id="marker3-4"
       refX="0"
       refY="0"
       orient="auto"
       overflow="visible">
      <path
         d="m 2.308,0 -3.46,2 v -4 z"
         fill="#ffffff"
         fill-rule="evenodd"
         stroke="#ffffff"
         stroke-width="0.4pt"
         id="path3-1" />
    </marker>
    <marker
       id="marker4-8"
       refX="0"
       refY="0"
       orient="auto"
       overflow="visible">
      <path
         d="m 2.308,0 -3.46,2 v -4 z"
         fill="#ffffff"
         fill-rule="evenodd"
         stroke="#ffffff"
         stroke-width="0.4pt"
         id="path4-5" />
    </marker>
  </defs>
  <sodipodi:namedview
     units="px"
     borderlayer="true"
     inkscape:showpageshadow="false"
     showgrid="false"
     inkscape:document-rotation="0"
     inkscape:current-layer="g1"
     inkscape:document-units="px"
     inkscape:cy="268.70058"
     inkscape:cx="931.96674"
     inkscape:zoom="0.70710678"
     inkscape:pageshadow="2"
     inkscape:pageopacity="0"
     borderopacity="1"
     bordercolor="#383838"
     pagecolor="#ffffff"
     id="base"
     showguides="true"
     inkscape:guide-bbox="true"
     inkscape:snap-global="true"
     inkscape:object-nodes="false"
     inkscape:snap-bbox="true"
     inkscape:snap-bbox-midpoints="true"
     inkscape:bbox-nodes="true"
     inkscape:bbox-paths="true"
     inkscape:pagecheckerboard="1"
     inkscape:deskcolor="#d1d1d1"
     inkscape:window-width="2560"
     inkscape:window-height="1371"
     inkscape:window-x="20"
     inkscape:window-y="20"
     inkscape:window-maximized="0">
    <sodipodi:guide
       position="466,-284"
       orientation="0,-1"
       id="guide3203"
       inkscape:locked="false" />
    <sodipodi:guide
       position="110,72"
       orientation="1,0"
       id="guide3205"
       inkscape:locked="false" />
    <sodipodi:guide
       position="1232,594"
       orientation="0,-1"
       id="guide3209"
       inkscape:locked="false" />
    <inkscape:grid
       type="xygrid"
       id="grid3335"
       originx="0"
       originy="0"
       spacingy="1"
       spacingx="1"
       units="px"
       visible="false" />
  </sodipodi:namedview>
  <metadata
     id="metadata5">
    <rdf:RDF>
      <cc:Work
         rdf:about="">
        <dc:format>image/svg+xml</dc:format>
        <dc:type
           rdf:resource="http://purl.org/dc/dcmitype/StillImage" />
        <cc:license
           rdf:resource="http://creativecommons.org/licenses/by-sa/4.0/" />
      </cc:Work>
      <cc:License
         rdf:about="http://creativecommons.org/licenses/by-sa/4.0/">
        <cc:permits
           rdf:resource="http://creativecommons.org/ns#Reproduction" />
        <cc:permits
           rdf:resource="http://creativecommons.org/ns#Distribution" />
        <cc:requires
           rdf:resource="http://creativecommons.org/ns#Notice" />
        <cc:requires
           rdf:resource="http://creativecommons.org/ns#Attribution" />
        <cc:permits
           rdf:resource="http://creativecommons.org/ns#DerivativeWorks" />
        <cc:requires
           rdf:resource="http://creativecommons.org/ns#ShareAlike" />
      </cc:License>
    </rdf:RDF>
  </metadata>
  <g
     id="layer1"
     inkscape:groupmode="layer"
     inkscape:label="Layer 1">
    <g
       id="g1110"
       transform="matrix(-1,0,0,1,-263.94081,-10)">
      <path
         d="M 584.32654,754.48609 H 439.4"
         stroke-width="11.4267"
         id="path3884-2"
         sodipodi:nodetypes="cc"
         style="font-variation-settings:normal;opacity:0.4;vector-effect:none;fill:none;fill-opacity:1;stroke:#1a5fb4;stroke-width:2.934;stroke-linecap:butt;stroke-linejoin:miter;stroke-miterlimit:4;stroke-dasharray:none;stroke-dashoffset:0;stroke-opacity:1;stop-color:#000000" />
      <path
         d="M 584.32654,982.54431 H 459.4"
         stroke-width="11.4267"
         id="path3882-0"
         sodipodi:nodetypes="cc"
         style="font-variation-settings:normal;opacity:0.4;vector-effect:none;fill:none;fill-opacity:1;stroke:#1a5fb4;stroke-width:2.934;stroke-linecap:butt;stroke-linejoin:miter;stroke-miterlimit:4;stroke-dasharray:none;stroke-dashoffset:0;stroke-opacity:1;stop-color:#000000" />
      <path
         d="M 577.10321,761.68993 V 975.95827"
         opacity="0.4"
         marker-start="url(#o-1)"
         marker-end="url(#p-7)"
         id="path3255-2"
         style="fill:none;stroke:#1a5fb4;stroke-width:2.93375;marker-start:url(#TriangleInM);marker-end:url(#TriangleOutM)"
         sodipodi:nodetypes="cc" />
    </g>
    <g
       id="g595"
       transform="translate(-3234.6674,6821.9139)">
      <path
         style="opacity:1;vector-effect:none;fill:#99c1f1;fill-opacity:1;stroke:none;stroke-width:15.2436;stroke-linecap:butt;stroke-linejoin:miter;stroke-miterlimit:4;stroke-dasharray:none;stroke-dashoffset:0;stroke-opacity:1;marker:none;marker-start:none;marker-mid:none;marker-end:none;paint-order:normal"
         d="m 2488.4781,-6039.9134 h 126.6357 c 3.2835,0 6.2438,3.8096 5.927,8.4926 l -11.9388,176.4786 c -0.2621,3.8754 -2.1877,7.0281 -4.9051,7.0281 H 2499.395 c -2.7175,0 -4.643,-3.1527 -4.9052,-7.0281 l -11.9388,-176.4786 c -0.3168,-4.683 2.6435,-8.4926 5.9271,-8.4926 z"
         id="path24476"
         inkscape:connector-curvature="0"
         sodipodi:nodetypes="sssssssss" />
      <path
         inkscape:connector-curvature="0"
         id="path24508"
         d="m 2488.4785,-6039.9139 c -3.2836,0 -6.2445,3.8092 -5.9277,8.4922 l 1.0117,14.9414 h 136.4668 l 1.0117,-14.9414 c 0.3168,-4.683 -2.6442,-8.4922 -5.9277,-8.4922 z"
         style="opacity:0.23;vector-effect:none;fill:#3584e4;fill-opacity:1;stroke:none;stroke-width:15.2436;stroke-linecap:butt;stroke-linejoin:miter;stroke-miterlimit:4;stroke-dasharray:none;stroke-dashoffset:0;stroke-opacity:1;marker:none;marker-start:none;marker-mid:none;marker-end:none;paint-order:normal" />
      <path
         sodipodi:nodetypes="cssccsscc"
         inkscape:connector-curvature="0"
         id="path24502"
         d="m 2494.4902,-5854.9412 c 0.2622,3.8754 2.1868,7.0273 4.9043,7.0273 h 104.8028 c 2.7174,0 4.6422,-3.1519 4.9043,-7.0273 l 0.8839,-13.303 c -0.2621,3.8754 -3.0708,6.8948 -5.7882,6.8948 h -104.8028 c -2.7175,0 -5.6144,-3.1078 -5.8766,-6.9832 z"
         style="opacity:1;vector-effect:none;fill:#62a0ea;fill-opacity:1;stroke:none;stroke-width:15.2436;stroke-linecap:butt;stroke-linejoin:miter;stroke-miterlimit:4;stroke-dasharray:none;stroke-dashoffset:0;stroke-opacity:1;marker:none;marker-start:none;marker-mid:none;marker-end:none;paint-order:normal" />
      <path
         inkscape:connector-curvature="0"
         id="path24490"
         d="m 2592.8839,-5991.4803 a 37,37 0 0 0 -37,37 37,37 0 0 0 37,37 37,37 0 0 0 21.0352,-6.6133 l 3.9023,-57.6601 a 37,37 0 0 0 -24.9375,-9.7266 z"
         style="opacity:1;vector-effect:none;fill:#3584e4;fill-opacity:1;stroke:none;stroke-width:16;stroke-linecap:butt;stroke-linejoin:miter;stroke-miterlimit:4;stroke-dasharray:none;stroke-dashoffset:0;stroke-opacity:1;marker:none;marker-start:none;marker-mid:none;marker-end:none;paint-order:normal" />
      <path
         inkscape:connector-curvature="0"
         id="path24495"
         d="m 2592.7843,-6011.3885 c -20.2764,0 -39.0435,10.8346 -49.1816,28.3945 l 13.8554,8 c 7.2929,-12.6317 20.7404,-20.3945 35.3262,-20.3945 9.3699,0 18.2594,3.2175 25.3594,8.8574 l 1.2343,-18.2383 c -8.061,-4.2737 -17.1635,-6.6191 -26.5937,-6.6191 z"
         style="color:#000000;font-style:normal;font-variant:normal;font-weight:normal;font-stretch:normal;font-size:medium;line-height:normal;font-family:sans-serif;font-variant-ligatures:normal;font-variant-position:normal;font-variant-caps:normal;font-variant-numeric:normal;font-variant-alternates:normal;font-feature-settings:normal;text-indent:0;text-align:start;text-decoration:none;text-decoration-line:none;text-decoration-style:solid;text-decoration-color:#000000;letter-spacing:normal;word-spacing:normal;text-transform:none;writing-mode:lr-tb;direction:ltr;text-orientation:mixed;dominant-baseline:auto;baseline-shift:baseline;text-anchor:start;white-space:normal;shape-padding:0;clip-rule:nonzero;display:inline;overflow:visible;visibility:visible;opacity:1;isolation:auto;mix-blend-mode:normal;color-interpolation:sRGB;color-interpolation-filters:linearRGB;solid-color:#000000;solid-opacity:1;vector-effect:none;fill:#3584e4;fill-opacity:1;fill-rule:nonzero;stroke:none;stroke-width:16;stroke-linecap:butt;stroke-linejoin:miter;stroke-miterlimit:4;stroke-dasharray:none;stroke-dashoffset:0;stroke-opacity:1;marker:none;paint-order:normal;color-rendering:auto;image-rendering:auto;shape-rendering:auto;text-rendering:auto;enable-background:accumulate" />
      <path
         sodipodi:nodetypes="ccccsccsc"
         inkscape:connector-curvature="0"
         id="path24513"
         d="m 2565.6162,-6039.9139 c 3.2835,0 6.2445,3.8092 5.9277,8.4922 l -2.3935,176.4805 c -0.2621,3.8754 -2.1869,7.0273 -4.9043,7.0273 h 39.9512 c 2.7174,0 4.6422,-3.1519 4.9043,-7.0273 l 11.9394,-176.4805 c 0.3168,-4.683 -2.6442,-8.4922 -5.9277,-8.4922 z"
         style="opacity:0.13;vector-effect:none;fill:#77767b;fill-opacity:1;stroke:none;stroke-width:15.2436;stroke-linecap:butt;stroke-linejoin:miter;stroke-miterlimit:4;stroke-dasharray:none;stroke-dashoffset:0;stroke-opacity:1;marker:none;marker-start:none;marker-mid:none;marker-end:none;paint-order:normal" />
      <path
         style="opacity:1;vector-effect:none;fill:#e7f0fc;fill-opacity:1;stroke:none;stroke-width:12.7347;stroke-linecap:butt;stroke-linejoin:miter;stroke-miterlimit:4;stroke-dasharray:none;stroke-dashoffset:0;stroke-opacity:1;marker:none;marker-start:none;marker-mid:none;marker-end:none;paint-order:normal"
         d="m 2496.4372,-6078.9746 h 105.9419 c 3.2835,0 5.3664,2.6917 5.927,5.9271 l 3.9796,22.9661 c 0.5985,3.454 -2.8221,6.3275 -6.3275,6.3275 h -113.1 c -3.5055,0 -6.9261,-2.8735 -6.3276,-6.3275 l 3.9796,-22.9661 c 0.5606,-3.2354 2.6435,-5.9271 5.927,-5.9271 z"
         id="path24474"
         inkscape:connector-curvature="0"
         sodipodi:nodetypes="sssssssss" />
      <path
         inkscape:connector-curvature="0"
         style="opacity:1;vector-effect:none;fill:#c2daf6;fill-opacity:1;stroke:none;stroke-width:12.7347;stroke-linecap:butt;stroke-linejoin:miter;stroke-miterlimit:4;stroke-dasharray:none;stroke-dashoffset:0;stroke-opacity:1;marker:none;marker-start:none;marker-mid:none;marker-end:none;paint-order:normal"
         d="m 2567.377,-6078.9744 c 3.2835,0 5.3671,2.6923 5.9277,5.9277 l 3.9785,22.9648 c 0.5985,3.454 -2.8208,6.3282 -6.3262,6.3282 h 35.002 c 3.5054,0 6.9247,-2.8742 6.3262,-6.3282 l -3.9786,-22.9648 c -0.5606,-3.2354 -2.6442,-5.9277 -5.9277,-5.9277 z"
         id="path24482" />
      <path
         sodipodi:nodetypes="sssccss"
         inkscape:connector-curvature="0"
         id="rect24484"
         d="m 2478.927,-6062.2603 h 144.146 c 3.2835,0 5.927,2.6435 5.927,5.9271 v 31.0082 h -156 v -31.0082 c 0,-3.2836 2.6435,-5.9271 5.927,-5.9271 z"
         style="opacity:1;vector-effect:none;fill:#d1e3f9;fill-opacity:1;stroke:none;stroke-width:12.7347;stroke-linecap:butt;stroke-linejoin:miter;stroke-miterlimit:4;stroke-dasharray:none;stroke-dashoffset:0;stroke-opacity:1;marker:none;marker-start:none;marker-mid:none;marker-end:none;paint-order:normal" />
      <path
         sodipodi:nodetypes="csccssc"
         inkscape:connector-curvature="0"
         style="opacity:1;vector-effect:none;fill:#b5d2f5;fill-opacity:1;stroke:none;stroke-width:12.7347;stroke-linecap:butt;stroke-linejoin:miter;stroke-miterlimit:4;stroke-dasharray:none;stroke-dashoffset:0;stroke-opacity:1;marker:none;marker-start:none;marker-mid:none;marker-end:none;paint-order:normal"
         d="m 2582.4141,-6062.2596 c 3.2835,0 5.9277,2.6422 5.9277,5.9258 v 30.7578 H 2629 v -30.7578 c 0,-3.2836 -2.6442,-5.9258 -5.9277,-5.9258 z"
         id="path24488" />
    </g>
    <g
       transform="matrix(4.9702911,0,0,4.9702911,-1270.2271,-628.13409)"
       id="g29394-9"
       style="display:inline;stroke-width:1.04199">
      <path
         id="rect29074-6"
         style="display:inline;opacity:1;vector-effect:none;fill:#99c1f1;fill-opacity:1;stroke:none;stroke-width:1.03994;stroke-linecap:round;stroke-linejoin:miter;stroke-miterlimit:4;stroke-dasharray:none;stroke-dashoffset:0;stroke-opacity:1;marker:none;marker-start:none;marker-mid:none;marker-end:none;paint-order:normal"
         d="m 59.729442,183.89973 h 93.618748 c 0.98138,0 1.77145,0.79007 1.77145,1.77146 v 30.96686 c 0,0.98139 -0.79007,1.77146 -1.77145,1.77146 H 59.729442 c -0.981385,0 -1.771453,-0.79007 -1.771453,-1.77146 v -30.96686 c 0,-0.98139 0.790068,-1.77146 1.771453,-1.77146 z"
         sodipodi:nodetypes="sssssssss" />
      <path
         id="rect29076-0"
         style="display:inline;opacity:1;vector-effect:none;fill:#cee1f8;fill-opacity:1;stroke:none;stroke-width:1.037;stroke-linecap:round;stroke-linejoin:miter;stroke-miterlimit:4;stroke-dasharray:none;stroke-dashoffset:0;stroke-opacity:1;marker:none;marker-start:none;marker-mid:none;marker-end:none;paint-order:normal"
         d="m 59.729442,182.69067 h 93.618748 c 0.98138,0 1.77145,0.79007 1.77145,1.77146 v 30.77207 c 0,0.98139 -0.79007,1.77145 -1.77145,1.77145 H 59.729442 c -0.981385,0 -1.771453,-0.79006 -1.771453,-1.77145 v -30.77207 c 0,-0.98139 0.790068,-1.77146 1.771453,-1.77146 z"
         sodipodi:nodetypes="sssssssss" />
      <path
         id="path6153"
         style="display:inline;opacity:1;vector-effect:none;fill:#1a5fb4;fill-opacity:1;stroke:none;stroke-width:1.65416;stroke-linecap:round;stroke-linejoin:miter;stroke-miterlimit:4;stroke-dasharray:none;stroke-dashoffset:0;stroke-opacity:1;marker:none;marker-start:none;marker-mid:none;marker-end:none;paint-order:normal"
         d="m 138.72959,200.40592 h 4.58871 c 0.56117,0 1.01293,0.45177 1.01293,1.01294 v 3.2658 c 0,0.56116 -0.45176,1.01293 -1.01293,1.01293 h -4.58871 c -0.56116,0 -1.01293,-0.45177 -1.01293,-1.01293 v -3.2658 c 0,-0.56117 0.45177,-1.01294 1.01293,-1.01294 z m 7.94035,-13.06114 h 4.58871 c 0.56117,0 1.01293,0.45177 1.01293,1.01294 v 3.2658 c 0,0.56116 -0.45176,1.01293 -1.01293,1.01293 h -4.58871 c -0.56116,0 -1.01293,-0.45177 -1.01293,-1.01293 v -3.2658 c 0,-0.56117 0.45177,-1.01294 1.01293,-1.01294 z m 0,19.68763 h 4.58871 c 0.56117,0 1.01293,0.45177 1.01293,1.01294 v 3.2658 c 0,0.56116 -0.45176,1.01293 -1.01293,1.01293 h -4.58871 c -0.56116,0 -1.01293,-0.45177 -1.01293,-1.01293 v -3.2658 c 0,-0.56117 0.45177,-1.01294 1.01293,-1.01294 z m -7.94035,-19.68763 h 4.58871 c 0.56117,0 1.01293,0.45177 1.01293,1.01294 v 3.2658 c 0,0.56116 -0.45176,1.01293 -1.01293,1.01293 h -4.58871 c -0.56116,0 -1.01293,-0.45177 -1.01293,-1.01293 v -3.2658 c 0,-0.56117 0.45177,-1.01294 1.01293,-1.01294 z m -7.9375,0 h 4.58871 c 0.56117,0 1.01293,0.45177 1.01293,1.01294 v 3.2658 c 0,0.56116 -0.45176,1.01293 -1.01293,1.01293 h -4.58871 c -0.56116,0 -1.01293,-0.45177 -1.01293,-1.01293 v -3.2658 c 0,-0.56117 0.45177,-1.01294 1.01293,-1.01294 z m 7.9375,19.68763 h 4.58871 c 0.56117,0 1.01293,0.45177 1.01293,1.01294 v 3.2658 c 0,0.56116 -0.45176,1.01293 -1.01293,1.01293 h -4.58871 c -0.56116,0 -1.01293,-0.45177 -1.01293,-1.01293 v -3.2658 c 0,-0.56117 0.45177,-1.01294 1.01293,-1.01294 z m -7.9375,0 h 4.58871 c 0.56117,0 1.01293,0.45177 1.01293,1.01294 v 3.2658 c 0,0.56116 -0.45176,1.01293 -1.01293,1.01293 h -4.58871 c -0.56116,0 -1.01293,-0.45177 -1.01293,-1.01293 v -3.2658 c 0,-0.56117 0.45177,-1.01294 1.01293,-1.01294 z m -49.2697,0 h 4.588705 c 0.56117,0 1.01293,0.45177 1.01293,1.01294 v 3.2658 c 0,0.56116 -0.45176,1.01293 -1.01293,1.01293 H 81.52239 c -0.561165,0 -1.012933,-0.45177 -1.012933,-1.01293 v -3.2658 c 0,-0.56117 0.451768,-1.01294 1.012933,-1.01294 z m 3.952077,-19.84375 h 4.588708 c 0.56116,0 1.01293,0.45177 1.01293,1.01294 v 3.2658 c 0,0.56116 -0.45177,1.01293 -1.01293,1.01293 h -4.588708 c -0.56116,0 -1.01293,-0.45177 -1.01293,-1.01293 v -3.2658 c 0,-0.56117 0.45177,-1.01294 1.01293,-1.01294 z m -3.968761,6.61458 h 4.588721 c 0.56116,0 1.012928,0.45177 1.012928,1.01294 v 3.2658 c 0,0.56116 -0.451768,1.01293 -1.012928,1.01293 h -4.588721 c -0.56116,0 -1.01293,-0.45177 -1.01293,-1.01293 v -3.2658 c 0,-0.56117 0.45177,-1.01294 1.01293,-1.01294 z m 3.968751,6.61458 h 4.588708 c 0.56117,0 1.01293,0.45177 1.01293,1.01293 v 3.2658 c 0,0.56117 -0.45176,1.01294 -1.01293,1.01294 h -4.588708 c -0.56116,0 -1.01293,-0.45177 -1.01293,-1.01294 v -3.2658 c 0,-0.56116 0.45177,-1.01293 1.01293,-1.01293 z m 38.359133,-6.61458 h 1.94287 c 0.56116,0 1.01293,0.45177 1.01293,1.01294 v 9.88037 c 0,0.56117 -0.45177,1.01294 -1.01293,1.01294 h -1.94287 c -0.56116,0 -1.01293,-0.45177 -1.01293,-1.01294 v -9.88037 c 0,-0.56117 0.45177,-1.01294 1.01293,-1.01294 z m -2.64584,0 h 4.58871 c 0.56116,0 1.01293,0.45177 1.01293,1.01294 v 3.2658 c 0,0.56116 -0.45177,1.01293 -1.01293,1.01293 h -4.58871 c -0.56117,0 -1.01293,-0.45177 -1.01293,-1.01293 v -3.2658 c 0,-0.56117 0.45176,-1.01294 1.01293,-1.01294 z m -59.571001,13.22917 h 8.557485 c 0.561165,0 1.012933,0.45177 1.012933,1.01294 v 3.2658 c 0,0.56116 -0.451768,1.01293 -1.012933,1.01293 h -8.557485 c -0.561165,0 -1.012933,-0.45177 -1.012933,-1.01293 v -3.2658 c 0,-0.56117 0.451768,-1.01294 1.012933,-1.01294 z m 11.906258,0 h 4.588705 c 0.56117,0 1.01293,0.45177 1.01293,1.01294 v 3.2658 c 0,0.56116 -0.45176,1.01293 -1.01293,1.01293 h -4.588705 c -0.561165,0 -1.012933,-0.45177 -1.012933,-1.01293 v -3.2658 c 0,-0.56117 0.451768,-1.01294 1.012933,-1.01294 z m -11.90625,-6.61459 h 4.588705 c 0.561165,0 1.012933,0.45177 1.012933,1.01293 v 3.2658 c 0,0.56117 -0.451768,1.01294 -1.012933,1.01294 h -4.588705 c -0.561165,0 -1.012933,-0.45177 -1.012933,-1.01294 v -3.2658 c 0,-0.56116 0.451768,-1.01293 1.012933,-1.01293 z m -8e-6,-13.22916 h 4.588706 c 0.561165,0 1.012933,0.45177 1.012933,1.01294 v 3.2658 c 0,0.56116 -0.451768,1.01293 -1.012933,1.01293 h -4.588706 c -0.561165,0 -1.012933,-0.45177 -1.012933,-1.01293 v -3.2658 c 0,-0.56117 0.451768,-1.01294 1.012933,-1.01294 z m 7.9375,0 h 4.588706 c 0.561165,0 1.012933,0.45177 1.012933,1.01294 v 3.2658 c 0,0.56116 -0.451768,1.01293 -1.012933,1.01293 h -4.588706 c -0.561165,0 -1.012933,-0.45177 -1.012933,-1.01293 v -3.2658 c 0,-0.56117 0.451768,-1.01294 1.012933,-1.01294 z m 7.937503,0 h 4.588711 c 0.56117,0 1.01294,0.45177 1.01294,1.01294 v 3.2658 c 0,0.56116 -0.45177,1.01293 -1.01294,1.01293 h -4.588711 c -0.56116,0 -1.01293,-0.45177 -1.01293,-1.01293 v -3.2658 c 0,-0.56117 0.45177,-1.01294 1.01293,-1.01294 z m 15.914768,0 h 4.588708 c 0.56116,0 1.01293,0.45177 1.01293,1.01294 v 3.2658 c 0,0.56116 -0.45177,1.01293 -1.01293,1.01293 H 93.40652 c -0.56116,0 -1.01293,-0.45177 -1.01293,-1.01293 v -3.2658 c 0,-0.56117 0.45177,-1.01294 1.01293,-1.01294 z m 7.93748,0 h 4.58871 c 0.56116,0 1.01293,0.45177 1.01293,1.01294 v 3.2658 c 0,0.56116 -0.45177,1.01293 -1.01293,1.01293 H 101.344 c -0.56117,0 -1.01293,-0.45177 -1.01293,-1.01293 v -3.2658 c 0,-0.56117 0.45176,-1.01294 1.01293,-1.01294 z m 7.93751,0 h 4.58871 c 0.56117,0 1.01293,0.45177 1.01293,1.01294 v 3.2658 c 0,0.56116 -0.45176,1.01293 -1.01293,1.01293 h -4.58871 c -0.56116,0 -1.01293,-0.45177 -1.01293,-1.01293 v -3.2658 c 0,-0.56117 0.45177,-1.01294 1.01293,-1.01294 z m 7.9375,0 h 8.55746 c 0.56116,0 1.01293,0.45177 1.01293,1.01294 v 3.2658 c 0,0.56116 -0.45177,1.01293 -1.01293,1.01293 h -8.55746 c -0.56116,0 -1.01293,-0.45177 -1.01293,-1.01293 v -3.2658 c 0,-0.56117 0.45177,-1.01294 1.01293,-1.01294 z m -55.602261,6.61458 h 8.557466 c 0.561165,0 1.012933,0.45177 1.012933,1.01294 v 3.2658 c 0,0.56116 -0.451768,1.01293 -1.012933,1.01293 h -8.557466 c -0.561165,0 -1.012933,-0.45177 -1.012933,-1.01293 v -3.2658 c 0,-0.56117 0.451768,-1.01294 1.012933,-1.01294 z m 11.906258,0 h 4.588705 c 0.56117,0 1.01293,0.45177 1.01293,1.01294 v 3.2658 c 0,0.56116 -0.45176,1.01293 -1.01293,1.01293 h -4.588705 c -0.561165,0 -1.012933,-0.45177 -1.012933,-1.01293 v -3.2658 c 0,-0.56117 0.451768,-1.01294 1.012933,-1.01294 z m 15.914752,0 h 4.588721 c 0.56116,0 1.012928,0.45177 1.012928,1.01294 v 3.2658 c 0,0.56116 -0.451768,1.01293 -1.012928,1.01293 h -4.588721 c -0.56116,0 -1.01293,-0.45177 -1.01293,-1.01293 v -3.2658 c 0,-0.56117 0.45177,-1.01294 1.01293,-1.01294 z m 7.937489,0 h 4.588712 c 0.56116,0 1.01293,0.45177 1.01293,1.01294 v 3.2658 c 0,0.56116 -0.45177,1.01293 -1.01293,1.01293 h -4.588712 c -0.56117,0 -1.01293,-0.45177 -1.01293,-1.01293 v -3.2658 c 0,-0.56117 0.45176,-1.01294 1.01293,-1.01294 z m 7.937512,0 h 4.58871 c 0.56117,0 1.01293,0.45177 1.01293,1.01294 v 3.2658 c 0,0.56116 -0.45176,1.01293 -1.01293,1.01293 h -4.58871 c -0.56116,0 -1.01293,-0.45177 -1.01293,-1.01293 v -3.2658 c 0,-0.56117 0.45177,-1.01294 1.01293,-1.01294 z m 7.93752,0 h 4.58871 c 0.56116,0 1.01293,0.45177 1.01293,1.01294 v 3.2658 c 0,0.56116 -0.45177,1.01293 -1.01293,1.01293 h -4.58871 c -0.56116,0 -1.01293,-0.45177 -1.01293,-1.01293 v -3.2658 c 0,-0.56117 0.45177,-1.01294 1.01293,-1.01294 z m -43.696031,6.61458 h 4.588706 c 0.561165,0 1.012933,0.45177 1.012933,1.01293 v 3.2658 c 0,0.56117 -0.451768,1.01294 -1.012933,1.01294 h -4.588706 c -0.561165,0 -1.012933,-0.45177 -1.012933,-1.01294 v -3.2658 c 0,-0.56116 0.451768,-1.01293 1.012933,-1.01293 z m 7.937493,0 h 4.588711 c 0.56116,0 1.01294,0.45177 1.01294,1.01293 v 3.2658 c 0,0.56117 -0.45178,1.01294 -1.01294,1.01294 h -4.588711 c -0.56117,0 -1.01293,-0.45177 -1.01293,-1.01294 v -3.2658 c 0,-0.56116 0.45176,-1.01293 1.01293,-1.01293 z m 15.914768,0 h 4.588708 c 0.56117,0 1.01293,0.45177 1.01293,1.01293 v 3.2658 c 0,0.56117 -0.45176,1.01294 -1.01293,1.01294 H 93.40651 c -0.56116,0 -1.01293,-0.45177 -1.01293,-1.01294 v -3.2658 c 0,-0.56116 0.45177,-1.01293 1.01293,-1.01293 z m 7.93749,0 h 4.58871 c 0.56116,0 1.01293,0.45177 1.01293,1.01293 v 3.2658 c 0,0.56117 -0.45177,1.01294 -1.01293,1.01294 H 101.344 c -0.56117,0 -1.01293,-0.45177 -1.01293,-1.01294 v -3.2658 c 0,-0.56116 0.45176,-1.01293 1.01293,-1.01293 z m 7.9375,0 h 4.58871 c 0.56116,0 1.01293,0.45177 1.01293,1.01293 v 3.2658 c 0,0.56117 -0.45177,1.01294 -1.01293,1.01294 h -4.58871 c -0.56117,0 -1.01293,-0.45177 -1.01293,-1.01294 v -3.2658 c 0,-0.56116 0.45176,-1.01293 1.01293,-1.01293 z m 7.93751,0 h 3.2658 c 0.56117,0 1.01294,0.45177 1.01294,1.01293 v 3.2658 c 0,0.56117 -0.45177,1.01294 -1.01294,1.01294 h -3.2658 c -0.56116,0 -1.01293,-0.45177 -1.01293,-1.01294 v -3.2658 c 0,-0.56116 0.45177,-1.01293 1.01293,-1.01293 z m 3.96875,6.61459 h 4.58871 c 0.56117,0 1.01293,0.45177 1.01293,1.01294 v 3.2658 c 0,0.56116 -0.45176,1.01293 -1.01293,1.01293 h -4.58871 c -0.56116,0 -1.01293,-0.45177 -1.01293,-1.01293 v -3.2658 c 0,-0.56117 0.45177,-1.01294 1.01293,-1.01294 z m -7.9375,0 h 4.58871 c 0.56117,0 1.01293,0.45177 1.01293,1.01294 v 3.2658 c 0,0.56116 -0.45176,1.01293 -1.01293,1.01293 h -4.58871 c -0.56116,0 -1.01293,-0.45177 -1.01293,-1.01293 v -3.2658 c 0,-0.56117 0.45177,-1.01294 1.01293,-1.01294 z m -23.812521,0 h 20.463741 c 0.56117,0 1.01293,0.45177 1.01293,1.01294 v 3.2658 c 0,0.56117 -0.45176,1.01294 -1.01293,1.01294 H 89.437739 c -0.56117,0 -1.01293,-0.45177 -1.01293,-1.01294 v -3.2658 c 0,-0.56117 0.45176,-1.01294 1.01293,-1.01294 z" />
    </g>
    <g
       transform="matrix(4.2622318,0,0,4.2622318,-1455.2352,-365.23224)"
       id="g11726-6"
       style="display:inline;stroke-width:1.50077">
      <rect
         ry="11.641666"
         rx="11.641666"
         y="157.69165"
         x="248.70833"
         height="35.454166"
         width="23.283333"
         id="rect11709-8"
         style="opacity:1;vector-effect:none;fill:#99c1f1;fill-opacity:1;stroke:none;stroke-width:2.38247;stroke-linecap:round;stroke-linejoin:miter;stroke-miterlimit:4;stroke-dasharray:none;stroke-dashoffset:0;stroke-opacity:1;marker:none;marker-start:none;marker-mid:none;marker-end:none;paint-order:normal" />
      <rect
         style="opacity:1;vector-effect:none;fill:#cee1f8;fill-opacity:1;stroke:none;stroke-width:6.35324;stroke-linecap:round;stroke-linejoin:miter;stroke-miterlimit:4;stroke-dasharray:none;stroke-dashoffset:0;stroke-opacity:1;marker:none;marker-start:none;marker-mid:none;marker-end:none;paint-order:normal"
         id="rect11701-7"
         width="23.283333"
         height="35.454166"
         x="248.70833"
         y="156.10417"
         rx="11.641666"
         ry="11.641666" />
      <path
         style="fill:#89b7ef;fill-opacity:1;stroke:#99c1f1;stroke-width:0.397077px;stroke-linecap:butt;stroke-linejoin:miter;stroke-opacity:1"
         d="M 260.61458,170.65625 V 156.10416"
         id="path11703-9"
         inkscape:connector-curvature="0" />
      <rect
         style="opacity:1;vector-effect:none;fill:#1a5fb4;fill-opacity:1;stroke:none;stroke-width:6.35324;stroke-linecap:round;stroke-linejoin:miter;stroke-miterlimit:4;stroke-dasharray:none;stroke-dashoffset:0;stroke-opacity:1;marker:none;marker-start:none;marker-mid:none;marker-end:none;paint-order:normal"
         id="rect11707-2"
         width="5.2916665"
         height="13.229166"
         x="257.96875"
         y="160.07292"
         rx="2.6458333"
         ry="2.6458333" />
      <circle
         r="1.4552083"
         cy="162.00343"
         cx="260.603"
         id="path15652-0"
         style="opacity:1;vector-effect:none;fill:#c0bfbc;fill-opacity:0.102362;stroke:none;stroke-width:2.90278;stroke-linecap:round;stroke-linejoin:miter;stroke-miterlimit:4;stroke-dasharray:none;stroke-dashoffset:0;stroke-opacity:1;marker:none;marker-start:none;marker-mid:none;marker-end:none;paint-order:normal" />
    </g>
    <g
       id="g1"
       transform="translate(-102.03,-327.55376)">
      <g
         id="g6">
        <g
           id="g24938-9"
           transform="matrix(0.68795307,0,0,0.68795307,523.68736,258.76988)"
           style="stroke-width:1.45358">
          <path
             id="rect257-7"
             style="font-variation-settings:normal;opacity:1;vector-effect:none;fill:#1a5fb4;fill-opacity:1;stroke:none;stroke-width:1.2886102;stroke-linecap:round;stroke-linejoin:miter;stroke-miterlimit:4;stroke-dasharray:none;stroke-dashoffset:0;stroke-opacity:1;-inkscape-stroke:none;marker:none;marker-start:none;marker-mid:none;marker-end:none;paint-order:normal;stop-color:#000000;stop-opacity:1"
             d="m 794.93638,419.59402 c -10.29354,0 -18.58008,8.28652 -18.58008,18.58006 v 238.23244 c 0,10.29354 8.28654,18.58006 18.58008,18.58006 h 206.77152 c 10.2935,0 18.58,-8.28652 18.58,-18.58006 V 438.17408 c 0,-10.29354 -8.2865,-18.58006 -18.58,-18.58006 z m 103.38477,86.67967 a 65.580681,65.580681 0 0 1 65.58203,65.5801 65.580681,65.580681 0 0 1 -65.58203,65.58006 65.580681,65.580681 0 0 1 -65.58008,-65.58006 65.580681,65.580681 0 0 1 65.58008,-65.5801 z" />
          <g
             transform="matrix(1.6138779,0,0,1.6138779,-911.2908,243.26047)"
             style="display:inline;stroke-width:1.41393;enable-background:new"
             id="g65-5">
            <path
               style="display:inline;opacity:1;vector-effect:none;fill:#12407a;fill-opacity:1;stroke:none;stroke-width:0.0696353px;stroke-linecap:butt;stroke-linejoin:miter;stroke-miterlimit:4;stroke-dasharray:none;stroke-dashoffset:0;stroke-opacity:1;marker:none;marker-start:none;marker-mid:none;marker-end:none;paint-order:normal;enable-background:new"
               d="M 1367.7351,-75.863459 V 221.75228 a 8,8 135 0 1 -8,8 H 872.26485 a 8,8 45 0 1 -8,-8 V -75.863459 a 8,8 135 0 1 8,-8 h 487.47025 a 8,8 45 0 1 8,8 z"
               id="path63-3"
               inkscape:connector-curvature="0"
               sodipodi:nodetypes="ccccc"
               inkscape:path-effect="#path-effect259-5"
               inkscape:original-d="M 1367.7351,-83.863459 V 229.75228 H 864.26485 V -83.863459 Z" />
          </g>
          <rect
             style="fill:#1c71d8;fill-opacity:1;stroke:none;stroke-width:11.4420083;stroke-linecap:round;stop-color:#000000;font-variation-settings:normal;opacity:1;vector-effect:none;stroke-linejoin:miter;stroke-miterlimit:4;stroke-dasharray:none;stroke-dashoffset:0;stroke-opacity:1;-inkscape-stroke:none;marker:none;marker-start:none;marker-mid:none;marker-end:none;paint-order:normal;stop-opacity:1"
             id="rect1457-8"
             width="780.12268"
             height="470.00391"
             x="499.46835"
             y="124.65135" />
          <g
             id="g192-8"
             transform="matrix(0.43832528,0,0,0.43832528,462.71026,117.26868)"
             style="stroke-width:1.45358;opacity:0.6">
            <g
               fill="none"
               stroke="#ffffff"
               id="g190-3"
               style="stroke-width:1.45358">
              <g
                 transform="matrix(3.34654,0,0,3.34654,-2287.12,-5943.066)"
                 id="g152-1"
                 style="stroke-width:1.45358">
                <rect
                   width="270"
                   height="190"
                   x="847.79199"
                   y="1840.916"
                   rx="8.7215214"
                   ry="8.7215214"
                   stroke-width="2.90718"
                   stroke-linecap="square"
                   stroke-linejoin="round"
                   stroke-dashoffset="26.4"
                   id="rect112-8" />
                <path
                   d="m 847.792,1864.916 h 270"
                   stroke-width="2.90718"
                   id="path114-9" />
                <rect
                   width="150"
                   height="75"
                   x="907.79199"
                   y="1890.916"
                   rx="5.8143482"
                   ry="5.8143482"
                   stroke-width="2.90718"
                   stroke-linecap="square"
                   stroke-linejoin="round"
                   stroke-dashoffset="26.4"
                   id="rect116-6" />
                <path
                   d="m 907.792,1880.916 h 40"
                   stroke-width="5.81432"
                   id="path118-4" />
                <path
                   d="m 907.792,1920.916 h 150 m -150,30 h 150"
                   stroke-width="2.90718"
                   id="path120-3" />
                <path
                   d="m 1057.792,2030.916 v -36 c 0,-2.216 -1.784,-4 -4,-4 h -142 c -2.216,0 -4,1.784 -4,4 v 36"
                   stroke-width="2.90718"
                   stroke-linecap="square"
                   stroke-linejoin="round"
                   stroke-dashoffset="26.4"
                   id="path122-3" />
                <path
                   d="m 907.792,1980.916 h 40"
                   stroke-width="5.81432"
                   id="path124-3" />
                <path
                   d="m 907.792,2020.916 h 150"
                   stroke-width="2.90718"
                   id="path126-8" />
                <rect
                   width="14"
                   height="12"
                   x="853.79199"
                   y="1846.916"
                   rx="2.9071741"
                   ry="2.9071741"
                   stroke-width="2.90718"
                   stroke-linecap="square"
                   stroke-linejoin="round"
                   stroke-dashoffset="26.4"
                   id="rect128-60" />
                <path
                   stroke-width="2.90718"
                   stroke-linecap="square"
                   stroke-linejoin="round"
                   stroke-dashoffset="26.4"
                   d="m 920.792,1840.916 h 40 v 24 h -40 z"
                   id="path130-4" />
                <circle
                   cx="929.79199"
                   cy="1852.916"
                   r="3"
                   stroke-width="2.90718"
                   stroke-linecap="square"
                   stroke-linejoin="round"
                   stroke-dashoffset="26.4"
                   id="circle132-8" />
                <path
                   d="m 939.792,1852.916 h 15"
                   stroke-width="2.90718"
                   id="path134-8" />
                <circle
                   cx="973.79199"
                   cy="1852.916"
                   r="3"
                   stroke-width="2.90718"
                   stroke-linecap="square"
                   stroke-linejoin="round"
                   stroke-dashoffset="26.4"
                   id="circle136-8" />
                <path
                   d="m 983.792,1852.916 h 15"
                   stroke-width="2.90718"
                   id="path138-9" />
                <circle
                   cx="1013.792"
                   cy="1852.916"
                   r="3"
                   stroke-width="2.90718"
                   stroke-linecap="square"
                   stroke-linejoin="round"
                   stroke-dashoffset="26.4"
                   id="circle140-7" />
                <path
                   d="m 1023.792,1852.916 h 15"
                   stroke-width="2.90718"
                   id="path142-7" />
                <rect
                   width="14"
                   height="12"
                   x="1080.792"
                   y="1846.916"
                   rx="2.9071741"
                   ry="2.9071741"
                   stroke-width="2.90718"
                   stroke-linecap="square"
                   stroke-linejoin="round"
                   stroke-dashoffset="26.4"
                   id="rect144-6" />
                <rect
                   width="14"
                   height="12"
                   x="1060.792"
                   y="1846.916"
                   rx="2.9071741"
                   ry="2.9071741"
                   stroke-width="2.90718"
                   stroke-linecap="square"
                   stroke-linejoin="round"
                   stroke-dashoffset="26.4"
                   id="rect146-4" />
                <circle
                   cx="1105.792"
                   cy="1852.916"
                   r="3"
                   stroke-width="2.90718"
                   stroke-linecap="square"
                   stroke-linejoin="round"
                   stroke-dashoffset="26.4"
                   id="circle148-3" />
                <path
                   d="m 847.792,1864.916 h 270"
                   stroke-width="2.90718"
                   id="path150-0" />
              </g>
              <g
                 stroke-width="2.90718"
                 id="g188-3">
                <path
                   d="M 466.385,296.881 V 217.63 m -117.128,0 h 250.99 m -250.99,635.842 h 250.99"
                   opacity="0.4"
                   stroke-width="9.72897"
                   id="path154-0" />
                <path
                   d="m 797.792,1835.916 v 180"
                   opacity="0.4"
                   marker-start="url(#o-61)"
                   marker-end="url(#p-59)"
                   transform="matrix(3.34654,0,0,3.34654,-2287.12,-5909.6)"
                   id="path156-9"
                   style="stroke-width:2.90718;marker-start:url(#o-61);marker-end:url(#p-59)" />
                <path
                   d="M 432.92,297.947 H 600.247"
                   opacity="0.4"
                   stroke-width="9.72897"
                   id="path158-2" />
                <path
                   d="m 822.792,1810.916 v 15"
                   opacity="0.4"
                   marker-end="url(#q-4)"
                   transform="matrix(3.34654,0,0,3.34654,-2287.12,-5909.6)"
                   id="path160-5"
                   style="stroke-width:2.90718;marker-end:url(#q-4)" />
                <path
                   d="m 822.792,1874.597 v -15"
                   opacity="0.4"
                   marker-end="url(#r-1)"
                   transform="matrix(3.34654,0,0,3.34654,-2287.12,-5909.6)"
                   id="path162-4"
                   style="stroke-width:2.90718;marker-end:url(#r-1)" />
                <path
                   d="m 1330.857,144.006 h 45.787 m 0,-34.608 v 147.248 m -46.852,-147.248 v 147.248"
                   opacity="0.4"
                   stroke-width="9.72897"
                   id="path164-0" />
                <path
                   d="m 1114.792,1808.916 h -15"
                   opacity="0.4"
                   marker-end="url(#s-3)"
                   transform="matrix(3.34654,0,0,3.34654,-2287.12,-5909.6)"
                   id="path166-5"
                   style="stroke-width:2.90718;marker-end:url(#s-3)" />
                <path
                   d="m 1061.11,1808.916 h 15"
                   opacity="0.4"
                   marker-end="url(#t-4)"
                   transform="matrix(3.34654,0,0,3.34654,-2287.12,-5909.6)"
                   id="path168-9"
                   style="stroke-width:2.90718;marker-end:url(#t-4)" />
                <path
                   d="M 1252.821,970.602 V 820.007 M 750.84,970.602 V 820.007"
                   opacity="0.4"
                   stroke-width="9.72897"
                   id="path170-4" />
                <path
                   d="m 1052.792,2045.916 h -140"
                   opacity="0.4"
                   marker-start="url(#u-4)"
                   marker-end="url(#v-7)"
                   transform="matrix(3.34654,0,0,3.34654,-2287.12,-5909.6)"
                   id="path172-6"
                   style="stroke-width:2.90718;marker-start:url(#u-4);marker-end:url(#v-7)" />
                <path
                   d="M 928.208,110.54 V 261.135 M 794.346,110.54 v 150.595"
                   opacity="0.4"
                   stroke-width="9.72897"
                   id="path174-9" />
                <path
                   d="m 955.792,1808.916 h -30"
                   opacity="0.4"
                   marker-start="url(#w-3)"
                   marker-end="url(#x-7)"
                   transform="matrix(3.34654,0,0,3.34654,-2287.12,-5909.6)"
                   id="path176-2"
                   style="stroke-width:2.90718;marker-start:url(#w-3);marker-end:url(#x-7)" />
                <path
                   d="m 1570.743,384.957 h -384.852 m 384.852,250.99 h -384.852"
                   opacity="0.4"
                   stroke-width="9.72897"
                   id="path178-2" />
                <path
                   d="m 1142.792,1885.916 v 65"
                   opacity="0.4"
                   marker-start="url(#y-9)"
                   marker-end="url(#z-2)"
                   transform="matrix(3.34654,0,0,3.34654,-2287.12,-5909.6)"
                   id="path180-4"
                   style="stroke-width:2.90718;marker-start:url(#y-9);marker-end:url(#z-2)" />
                <g
                   id="path184-7"
                   transform="matrix(3.34654,0,0,3.34654,-2287.12,-5909.6)"
                   style="opacity:0.4;stroke-width:2.90718">
                  <g
                     id="g3127-7"
                     style="stroke-width:2.90718">
                    <g
                       id="path3129-5"
                       style="opacity:1;stroke-width:2.90718" />
                  </g>
                </g>
              </g>
            </g>
          </g>
        </g>
        <g
           id="g41201-4"
           transform="matrix(0.52078247,0,0,0.52078247,223.24065,339.06353)"
           style="stroke-width:1.40025">
          <path
             id="rect2-8"
             style="font-variation-settings:normal;opacity:1;vector-effect:none;fill:#12407a;fill-opacity:1;stroke:none;stroke-width:3.87374;stroke-linecap:round;stroke-linejoin:miter;stroke-miterlimit:4;stroke-dasharray:none;stroke-dashoffset:0;stroke-opacity:1;-inkscape-stroke:none;marker:none;marker-start:none;marker-mid:none;marker-end:none;paint-order:normal;stop-color:#000000;stop-opacity:1"
             sodipodi:type="inkscape:offset"
             inkscape:radius="13.183152"
             inkscape:original="M 2292.7422 294.37109 C 2273.0862 294.37109 2257.2617 310.19559 2257.2617 329.85156 L 2257.2617 716.77734 C 2257.2617 736.43331 2273.0862 752.25781 2292.7422 752.25781 L 2555.498 752.25781 C 2575.154 752.25781 2590.9766 736.43331 2590.9766 716.77734 L 2590.9766 329.85156 C 2590.9766 310.19559 2575.154 294.37109 2555.498 294.37109 L 2292.7422 294.37109 z "
             d="m 2292.7422,281.1875 c -26.7316,0 -48.6641,21.93249 -48.6641,48.66406 v 386.92578 c 0,26.73158 21.9325,48.66407 48.6641,48.66407 h 262.7558 c 26.7316,0 48.6622,-21.93334 48.6622,-48.66407 V 329.85156 c 0,-26.73072 -21.9306,-48.66406 -48.6622,-48.66406 z" />
          <rect
             style="font-variation-settings:normal;opacity:1;vector-effect:none;fill:#1c71d8;fill-opacity:1;stroke:none;stroke-width:15.11488038;stroke-linecap:round;stroke-linejoin:miter;stroke-miterlimit:4;stroke-dasharray:none;stroke-dashoffset:0;stroke-opacity:1;-inkscape-stroke:none;marker:none;marker-start:none;marker-mid:none;marker-end:none;paint-order:normal;stop-color:#000000;stop-opacity:1"
             id="rect29571-1"
             width="333.71484"
             height="457.88672"
             x="2257.2625"
             y="294.37164"
             rx="37.726093"
             ry="37.726093" />
          <g
             id="g7"
             style="opacity:0.6">
            <rect
               style="fill:#ffffff;stroke-width:5.64115;stroke-linecap:round;stroke-linejoin:round;stroke-dasharray:5.64115, 11.2824;stop-color:#000000"
               id="rect674-2"
               width="40.28693"
               height="40.28693"
               x="2318.4998"
               y="435.52798"
               rx="28.205837"
               ry="28.205837" />
            <rect
               style="fill:#ffffff;stroke-width:5.64115;stroke-linecap:round;stroke-linejoin:round;stroke-dasharray:5.64115, 11.2824;stop-color:#000000"
               id="rect676-8"
               width="40.28693"
               height="40.28693"
               x="2378.9302"
               y="435.52798"
               rx="28.205837"
               ry="28.205837" />
            <rect
               style="fill:#ffffff;stroke-width:5.64115;stroke-linecap:round;stroke-linejoin:round;stroke-dasharray:5.64115, 11.2824;stop-color:#000000"
               id="rect684-9"
               width="40.28693"
               height="40.28693"
               x="2318.4998"
               y="495.95834"
               rx="28.205837"
               ry="28.205837" />
            <rect
               style="fill:#ffffff;stroke-width:5.64115;stroke-linecap:round;stroke-linejoin:round;stroke-dasharray:5.64115, 11.2824;stop-color:#000000"
               id="rect686-3"
               width="40.28693"
               height="40.28693"
               x="2378.9302"
               y="495.95834"
               rx="28.205837"
               ry="28.205837" />
            <rect
               style="fill:#ffffff;stroke-width:5.64115;stroke-linecap:round;stroke-linejoin:round;stroke-dasharray:5.64115, 11.2824;stop-color:#000000"
               id="rect694-6"
               width="40.28693"
               height="40.28693"
               x="2318.4998"
               y="556.38861"
               rx="28.205837"
               ry="28.205837" />
            <rect
               style="fill:#ffffff;stroke-width:5.64115;stroke-linecap:round;stroke-linejoin:round;stroke-dasharray:5.64115, 11.2824;stop-color:#000000"
               id="rect696-8"
               width="40.28693"
               height="40.28693"
               x="2378.9302"
               y="556.38861"
               rx="28.205837"
               ry="28.205837" />
            <rect
               style="fill:#ffffff;stroke-width:5.64115;stroke-linecap:round;stroke-linejoin:round;stroke-dasharray:5.64115, 11.2824;stop-color:#000000"
               id="rect704-0"
               width="40.28693"
               height="40.28693"
               x="2318.4998"
               y="616.81903"
               rx="28.205837"
               ry="28.205837" />
            <rect
               style="fill:#ffffff;stroke-width:5.64115;stroke-linecap:round;stroke-linejoin:round;stroke-dasharray:5.64115, 11.2824;stop-color:#000000"
               id="rect706-2"
               width="40.28693"
               height="40.28693"
               x="2378.9302"
               y="616.81903"
               rx="28.205837"
               ry="28.205837" />
            <rect
               style="fill:#ffffff;stroke-width:5.64115;stroke-linecap:round;stroke-linejoin:round;stroke-dasharray:5.64115, 11.2824;stop-color:#000000"
               id="rect720-1"
               width="40.28693"
               height="40.28693"
               x="2439.3606"
               y="435.52798"
               rx="28.205837"
               ry="28.205837" />
            <rect
               style="fill:#ffffff;stroke-width:5.64115;stroke-linecap:round;stroke-linejoin:round;stroke-dasharray:5.64115, 11.2824;stop-color:#000000"
               id="rect722-0"
               width="40.28693"
               height="40.28693"
               x="2499.791"
               y="435.52798"
               rx="28.205837"
               ry="28.205837" />
            <rect
               style="fill:#ffffff;stroke-width:5.64115;stroke-linecap:round;stroke-linejoin:round;stroke-dasharray:5.64115, 11.2824;stop-color:#000000"
               id="rect726-5"
               width="40.28693"
               height="40.28693"
               x="2439.3606"
               y="495.95834"
               rx="28.205837"
               ry="28.205837" />
            <rect
               style="fill:#ffffff;stroke-width:5.64115;stroke-linecap:round;stroke-linejoin:round;stroke-dasharray:5.64115, 11.2824;stop-color:#000000"
               id="rect728-1"
               width="40.28693"
               height="40.28693"
               x="2499.791"
               y="495.95834"
               rx="28.205837"
               ry="28.205837" />
            <rect
               style="fill:#ffffff;stroke-width:5.64115;stroke-linecap:round;stroke-linejoin:round;stroke-dasharray:5.64115, 11.2824;stop-color:#000000"
               id="rect732-1"
               width="40.28693"
               height="40.28693"
               x="2439.3606"
               y="556.38861"
               rx="28.205837"
               ry="28.205837" />
            <rect
               style="fill:#ffffff;stroke-width:5.64115;stroke-linecap:round;stroke-linejoin:round;stroke-dasharray:5.64115, 11.2824;stop-color:#000000"
               id="rect734-0"
               width="40.28693"
               height="40.28693"
               x="2499.791"
               y="556.38861"
               rx="28.205837"
               ry="28.205837" />
            <rect
               style="fill:#ffffff;stroke-width:5.64115;stroke-linecap:round;stroke-linejoin:round;stroke-dasharray:5.64115, 11.2824;stop-color:#000000"
               id="rect738-8"
               width="40.28693"
               height="40.28693"
               x="2439.3606"
               y="616.81903"
               rx="28.205837"
               ry="28.205837" />
            <rect
               style="fill:#ffffff;stroke-width:5.64115;stroke-linecap:round;stroke-linejoin:round;stroke-dasharray:5.64115, 11.2824;stop-color:#000000"
               id="rect740-5"
               width="40.28693"
               height="40.28693"
               x="2499.791"
               y="616.81903"
               rx="28.205837"
               ry="28.205837" />
            <path
               style="fill:#ffffff;stroke:#ffffff;stroke-width:2.82056;stroke-linecap:butt;stroke-linejoin:miter;stroke-miterlimit:4;stroke-dasharray:none;stroke-opacity:1"
               d="M 2319.5069,674.44834 V 375.09748"
               id="path3946-3-0"
               sodipodi:nodetypes="cc" />
            <path
               style="fill:#ffffff;stroke:#ffffff;stroke-width:2.82057;stroke-linecap:butt;stroke-linejoin:miter;stroke-miterlimit:4;stroke-dasharray:none;stroke-opacity:1"
               d="M 2539.0707,674.19101 V 375.09748"
               id="path4049-6-6"
               sodipodi:nodetypes="cc" />
            <g
               id="g2223-4"
               transform="matrix(2.0143466,0,0,2.0143466,1955.9174,254.23669)"
               style="fill:#ffffff;stroke-width:1.40025">
              <path
                 style="fill:#ffffff;stroke:#ffffff;stroke-width:1.40181px;stroke-linecap:butt;stroke-linejoin:miter;stroke-opacity:1"
                 d="M 180.98641,75.50056 H 289.1888"
                 id="path6063-7-6"
                 sodipodi:nodetypes="cc" />
              <path
                 id="rect7848-3-5-2"
                 style="fill:#ffffff;stroke-width:1.40025;stroke-linecap:round;stroke-linejoin:round;stop-color:#000000"
                 d="m 183.02871,72.465325 v 5.826176 l -2.91308,-2.913084 z"
                 sodipodi:nodetypes="cccc" />
              <path
                 id="rect7848-6-3-5"
                 style="fill:#ffffff;stroke-width:1.40025;stroke-linecap:round;stroke-linejoin:round;stop-color:#000000"
                 d="m 287,72.587472 v 5.826176 l 2.91307,-2.913084 z"
                 sodipodi:nodetypes="cccc" />
            </g>
            <rect
               style="fill:#ffffff;fill-opacity:1;stroke-width:11.5993;stroke-linecap:round;stroke-linejoin:round;stroke-dasharray:11.5993, 23.1988;stop-color:#000000"
               id="rect2363-8"
               width="104.65497"
               height="20.378418"
               x="2381.9856"
               y="359.47656"
               rx="14.267413"
               ry="14.267413" />
          </g>
        </g>
        <g
           id="g41174-6"
           transform="matrix(0.71415953,0,0,0.71415953,-256.8973,116.73312)"
           style="stroke-width:1.40025">
          <g
             id="g27868-2"
             transform="matrix(1.16717,0,0,1.16717,-608.17055,-171.76734)"
             style="stroke-width:1.40025">
            <path
               style="vector-effect:none;fill:#12407a;fill-opacity:1;stroke:none;stroke-width:3.31888;stroke-linecap:round;stroke-linejoin:miter;stroke-miterlimit:4;stroke-dasharray:none;stroke-dashoffset:0;stroke-opacity:1;marker:none;marker-start:none;marker-mid:none;marker-end:none;paint-order:normal"
               sodipodi:type="inkscape:offset"
               inkscape:radius="6.789465"
               inkscape:original="M 2712.5215 728.57227 C 2701.9879 728.57227 2693.5078 737.05044 2693.5078 747.58398 L 2693.5078 866.26758 C 2693.5078 876.80113 2701.9879 885.28125 2712.5215 885.28125 L 2756.5742 885.28125 C 2767.1078 885.28125 2775.5859 876.80113 2775.5859 866.26758 L 2775.5859 747.58398 C 2775.5859 737.05044 2767.1078 728.57227 2756.5742 728.57227 L 2712.5215 728.57227 z "
               xlink:href="#rect2256-6-4"
               id="path42015-8"
               inkscape:href="#rect2256-6-4"
               d="m 2712.5215,721.7832 c -14.1767,0 -25.8027,11.62331 -25.8027,25.80078 v 118.6836 c 0,14.17748 11.6252,25.80273 25.8027,25.80273 h 44.0527 c 14.1775,0 25.8008,-11.62611 25.8008,-25.80273 v -118.6836 c 0,-14.17661 -11.6241,-25.80078 -25.8008,-25.80078 z" />
            <rect
               ry="19.013624"
               rx="19.013624"
               y="2693.5076"
               x="-885.28137"
               height="82.079346"
               width="156.71004"
               id="rect2256-6-4"
               style="vector-effect:none;fill:#1c71d8;fill-opacity:1;stroke:none;stroke-width:9.44347249;stroke-linecap:round;stroke-linejoin:miter;stroke-miterlimit:4;stroke-dasharray:none;stroke-dashoffset:0;stroke-opacity:1;marker:none;marker-start:none;marker-mid:none;marker-end:none;paint-order:normal;font-variation-settings:normal;opacity:1;-inkscape-stroke:none;stop-color:#000000;stop-opacity:1"
               transform="rotate(-90)" />
            <path
               id="rect25326-7"
               style="fill:#12407a;fill-opacity:1;stroke:none;stroke-width:2.45477;stroke-linecap:round;stroke-opacity:1;-inkscape-stroke:none;stop-color:#000000"
               d="m 2705.9839,727.38525 c 0,0.006 0,0.0111 0,0.0167 0,4.32614 3.4835,7.80802 7.8097,7.80802 h 41.1854 c 4.3261,0 7.8096,-3.48188 7.8096,-7.80802 0,-0.006 0,-0.0111 0,-0.0167 z" />
          </g>
          <g
             id="g8"
             style="opacity:0.6">
            <rect
               style="fill:#ffffff;stroke-width:1.77819;stroke-linecap:round;stroke-linejoin:round;stroke-dasharray:1.77819, 3.55622;stop-color:#000000"
               id="rect28149-2"
               width="12.698671"
               height="12.698671"
               x="2548.5901"
               y="710.81158"
               rx="8.8906422"
               ry="8.8906422" />
            <rect
               style="fill:#ffffff;stroke-width:1.77819;stroke-linecap:round;stroke-linejoin:round;stroke-dasharray:1.77819, 3.55622;stop-color:#000000"
               id="rect28151-4"
               width="12.698671"
               height="12.698671"
               x="2567.6379"
               y="710.81158"
               rx="8.8906422"
               ry="8.8906422" />
            <rect
               style="fill:#ffffff;stroke-width:1.77819;stroke-linecap:round;stroke-linejoin:round;stroke-dasharray:1.77819, 3.55622;stop-color:#000000"
               id="rect28153-0"
               width="12.698671"
               height="12.698671"
               x="2548.5901"
               y="729.85962"
               rx="8.8906422"
               ry="8.8906422" />
            <rect
               style="fill:#ffffff;stroke-width:1.77819;stroke-linecap:round;stroke-linejoin:round;stroke-dasharray:1.77819, 3.55622;stop-color:#000000"
               id="rect28155-6"
               width="12.698671"
               height="12.698671"
               x="2567.6379"
               y="729.85962"
               rx="8.8906422"
               ry="8.8906422" />
            <rect
               style="fill:#ffffff;stroke-width:1.77819;stroke-linecap:round;stroke-linejoin:round;stroke-dasharray:1.77819, 3.55622;stop-color:#000000"
               id="rect28157-2"
               width="12.698671"
               height="12.698671"
               x="2548.5901"
               y="748.90741"
               rx="8.8906422"
               ry="8.8906422" />
            <rect
               style="fill:#ffffff;stroke-width:1.77819;stroke-linecap:round;stroke-linejoin:round;stroke-dasharray:1.77819, 3.55622;stop-color:#000000"
               id="rect28159-9"
               width="12.698671"
               height="12.698671"
               x="2567.6379"
               y="748.90741"
               rx="8.8906422"
               ry="8.8906422" />
            <rect
               style="fill:#ffffff;stroke-width:1.77819;stroke-linecap:round;stroke-linejoin:round;stroke-dasharray:1.77819, 3.55622;stop-color:#000000"
               id="rect28161-9"
               width="12.698671"
               height="12.698671"
               x="2548.5901"
               y="767.95575"
               rx="8.8906422"
               ry="8.8906422" />
            <rect
               style="fill:#ffffff;stroke-width:1.77819;stroke-linecap:round;stroke-linejoin:round;stroke-dasharray:1.77819, 3.55622;stop-color:#000000"
               id="rect28163-0"
               width="12.698671"
               height="12.698671"
               x="2567.6379"
               y="767.95575"
               rx="8.8906422"
               ry="8.8906422" />
            <rect
               style="fill:#ffffff;stroke-width:1.77819;stroke-linecap:round;stroke-linejoin:round;stroke-dasharray:1.77819, 3.55622;stop-color:#000000"
               id="rect28165-8"
               width="12.698671"
               height="12.698671"
               x="2586.6855"
               y="710.81158"
               rx="8.8906422"
               ry="8.8906422" />
            <rect
               style="fill:#ffffff;stroke-width:1.77819;stroke-linecap:round;stroke-linejoin:round;stroke-dasharray:1.77819, 3.55622;stop-color:#000000"
               id="rect28167-1"
               width="12.698671"
               height="12.698671"
               x="2605.7334"
               y="710.81158"
               rx="8.8906422"
               ry="8.8906422" />
            <rect
               style="fill:#ffffff;stroke-width:1.77819;stroke-linecap:round;stroke-linejoin:round;stroke-dasharray:1.77819, 3.55622;stop-color:#000000"
               id="rect28169-3"
               width="12.698671"
               height="12.698671"
               x="2586.6855"
               y="729.85962"
               rx="8.8906422"
               ry="8.8906422" />
            <rect
               style="fill:#ffffff;stroke-width:1.77819;stroke-linecap:round;stroke-linejoin:round;stroke-dasharray:1.77819, 3.55622;stop-color:#000000"
               id="rect28171-1"
               width="12.698671"
               height="12.698671"
               x="2605.7334"
               y="729.85962"
               rx="8.8906422"
               ry="8.8906422" />
            <rect
               style="fill:#ffffff;stroke-width:1.77819;stroke-linecap:round;stroke-linejoin:round;stroke-dasharray:1.77819, 3.55622;stop-color:#000000"
               id="rect28173-1"
               width="12.698671"
               height="12.698671"
               x="2586.6855"
               y="748.90741"
               rx="8.8906422"
               ry="8.8906422" />
            <rect
               style="fill:#ffffff;stroke-width:1.77819;stroke-linecap:round;stroke-linejoin:round;stroke-dasharray:1.77819, 3.55622;stop-color:#000000"
               id="rect28175-0"
               width="12.698671"
               height="12.698671"
               x="2605.7334"
               y="748.90741"
               rx="8.8906422"
               ry="8.8906422" />
            <rect
               style="fill:#ffffff;stroke-width:1.77819;stroke-linecap:round;stroke-linejoin:round;stroke-dasharray:1.77819, 3.55622;stop-color:#000000"
               id="rect28177-3"
               width="12.698671"
               height="12.698671"
               x="2586.6855"
               y="767.95575"
               rx="8.8906422"
               ry="8.8906422" />
            <rect
               style="fill:#ffffff;stroke-width:1.77819;stroke-linecap:round;stroke-linejoin:round;stroke-dasharray:1.77819, 3.55622;stop-color:#000000"
               id="rect28179-4"
               width="12.698671"
               height="12.698671"
               x="2605.7334"
               y="767.95575"
               rx="8.8906422"
               ry="8.8906422" />
            <path
               style="fill:#ffffff;stroke:#ffffff;stroke-width:0.889062;stroke-linecap:butt;stroke-linejoin:miter;stroke-miterlimit:4;stroke-dasharray:none;stroke-opacity:1"
               d="M 2548.9073,839.80786 V 691.76354"
               id="path28181-0"
               sodipodi:nodetypes="cc" />
            <path
               style="fill:#ffffff;stroke:#ffffff;stroke-width:0.889071;stroke-linecap:butt;stroke-linejoin:miter;stroke-miterlimit:4;stroke-dasharray:none;stroke-opacity:1"
               d="M 2618.1146,839.72674 V 691.76354"
               id="path28183-3"
               sodipodi:nodetypes="cc" />
            <g
               id="g28191-9"
               transform="matrix(0.63493378,0,0,0.63493378,2434.3012,653.6675)"
               style="fill:#ffffff;stroke-width:1.40025">
              <path
                 style="fill:#ffffff;stroke:#ffffff;stroke-width:1.40181px;stroke-linecap:butt;stroke-linejoin:miter;stroke-opacity:1"
                 d="M 180.98641,75.50056 H 289.1888"
                 id="path28185-1"
                 sodipodi:nodetypes="cc" />
              <path
                 id="path28187-9"
                 style="fill:#ffffff;stroke-width:1.40025;stroke-linecap:round;stroke-linejoin:round;stop-color:#000000"
                 d="m 183.02871,72.465325 v 5.826176 l -2.91308,-2.913084 z"
                 sodipodi:nodetypes="cccc" />
              <path
                 id="path28189-6"
                 style="fill:#ffffff;stroke-width:1.40025;stroke-linecap:round;stroke-linejoin:round;stop-color:#000000"
                 d="m 287,72.587472 v 5.826176 l 2.91307,-2.913084 z"
                 sodipodi:nodetypes="cccc" />
            </g>
            <rect
               style="fill:#ffffff;stroke-width:1.77819;stroke-linecap:round;stroke-linejoin:round;stroke-dasharray:1.77819, 3.55622;stop-color:#000000"
               id="rect28195-9"
               width="12.698671"
               height="12.698671"
               x="2548.5901"
               y="839.80798"
               rx="8.8906422"
               ry="8.8906422" />
            <rect
               style="fill:#ffffff;stroke-width:1.77819;stroke-linecap:round;stroke-linejoin:round;stroke-dasharray:1.77819, 3.55622;stop-color:#000000"
               id="rect28197-3"
               width="12.698671"
               height="12.698671"
               x="2567.6379"
               y="839.80798"
               rx="8.8906422"
               ry="8.8906422" />
            <rect
               style="fill:#ffffff;stroke-width:1.77819;stroke-linecap:round;stroke-linejoin:round;stroke-dasharray:1.77819, 3.55622;stop-color:#000000"
               id="rect28199-3"
               width="12.698671"
               height="12.698671"
               x="2586.6855"
               y="839.80798"
               rx="8.8906422"
               ry="8.8906422" />
            <rect
               style="fill:#ffffff;stroke-width:1.77819;stroke-linecap:round;stroke-linejoin:round;stroke-dasharray:1.77819, 3.55622;stop-color:#000000"
               id="rect28201-8"
               width="12.698671"
               height="12.698671"
               x="2605.7334"
               y="839.80798"
               rx="8.8906422"
               ry="8.8906422" />
            <rect
               style="fill:#ffffff;stroke-width:1.77819;stroke-linecap:round;stroke-linejoin:round;stroke-dasharray:1.77819, 3.55622;stop-color:#000000"
               id="rect44401-0"
               width="12.698671"
               height="12.698671"
               x="2548.5901"
               y="787.67389"
               rx="8.8906422"
               ry="8.8906422" />
            <rect
               style="fill:#ffffff;stroke-width:1.77819;stroke-linecap:round;stroke-linejoin:round;stroke-dasharray:1.77819, 3.55622;stop-color:#000000"
               id="rect44403-5"
               width="12.698671"
               height="12.698671"
               x="2567.6379"
               y="787.67389"
               rx="8.8906422"
               ry="8.8906422" />
            <rect
               style="fill:#ffffff;stroke-width:1.77819;stroke-linecap:round;stroke-linejoin:round;stroke-dasharray:1.77819, 3.55622;stop-color:#000000"
               id="rect44405-6"
               width="12.698671"
               height="12.698671"
               x="2586.6855"
               y="787.67389"
               rx="8.8906422"
               ry="8.8906422" />
            <rect
               style="fill:#ffffff;stroke-width:1.77819;stroke-linecap:round;stroke-linejoin:round;stroke-dasharray:1.77819, 3.55622;stop-color:#000000"
               id="rect44407-6"
               width="12.698671"
               height="12.698671"
               x="2605.7334"
               y="787.67389"
               rx="8.8906422"
               ry="8.8906422" />
          </g>
        </g>
        <g
           id="g1-4"
           transform="matrix(0.94046552,0,0,0.94046552,62.125328,55.51993)"
           style="stroke-width:1.0633">
          <path
             id="rect29074-6-3-0"
             style="display:inline;vector-effect:none;fill:#1a5fb4;fill-opacity:1;stroke:none;stroke-width:5.49599;stroke-linecap:round;stroke-linejoin:miter;stroke-miterlimit:4;stroke-dasharray:none;stroke-dashoffset:0;stroke-opacity:1;marker:none;marker-start:none;marker-mid:none;marker-end:none;paint-order:normal"
             d="m 430.6741,736.30412 h 456.82882 c 4.78882,0 8.64411,3.92688 8.64411,8.80467 v 9.91431 c 0,4.8778 -3.85529,8.80467 -8.64411,8.80467 H 430.6741 c -4.78884,0 -8.6441,-3.92687 -8.6441,-8.80467 v -9.91431 c 0,-4.87779 3.85526,-8.80467 8.6441,-8.80467 z"
             sodipodi:nodetypes="sssssssss" />
          <path
             id="rect29076-0-6-0"
             style="display:inline;vector-effect:none;fill:#1f7ef1;fill-opacity:1;stroke:none;stroke-width:5.48047;stroke-linecap:round;stroke-linejoin:miter;stroke-miterlimit:4;stroke-dasharray:none;stroke-dashoffset:0;stroke-opacity:1;marker:none;marker-start:none;marker-mid:none;marker-end:none;paint-order:normal"
             d="m 430.6741,730.29474 h 456.82882 c 4.78882,0 8.64411,3.92688 8.64411,8.80467 v 8.94615 c 0,4.87779 -3.85529,8.80462 -8.64411,8.80462 H 430.6741 c -4.78884,0 -8.6441,-3.92683 -8.6441,-8.80462 v -8.94615 c 0,-4.87779 3.85526,-8.80467 8.6441,-8.80467 z"
             sodipodi:nodetypes="sssssssss" />
          <rect
             style="vector-effect:none;fill:#12407a;fill-opacity:1;stroke:none;stroke-width:8.36986;stroke-linecap:round;stroke-linejoin:miter;stroke-miterlimit:4;stroke-dasharray:none;stroke-dashoffset:0;stroke-opacity:1;marker:none;marker-start:none;marker-mid:none;marker-end:none;paint-order:normal"
             id="rect2246-4"
             width="472.2941"
             height="288.62418"
             x="423.85294"
             y="441.98267"
             rx="15.204532"
             ry="15.204532" />
          <rect
             ry="8.2997351"
             rx="8.2997351"
             y="450"
             x="431.45621"
             height="272.58951"
             width="457.08755"
             id="rect2256-62"
             style="vector-effect:none;fill:#1c71d8;fill-opacity:1;stroke:none;stroke-width:8.36986;stroke-linecap:round;stroke-linejoin:miter;stroke-miterlimit:4;stroke-dasharray:none;stroke-dashoffset:0;stroke-opacity:1;marker:none;marker-start:none;marker-mid:none;marker-end:none;paint-order:normal;font-variation-settings:normal;opacity:1;-inkscape-stroke:none;stop-color:#000000;stop-opacity:1" />
          <g
             id="g3293-6"
             transform="matrix(0.43832528,0,0,0.43832528,-252.82974,1343.59)"
             style="stroke-width:1.0633;opacity:0.6">
            <rect
               width="328.55078"
               height="374.18201"
               x="1939.6774"
               y="-1899.7522"
               rx="21.350319"
               ry="21.350319"
               stroke-width="7.11677"
               stroke-linecap="square"
               stroke-linejoin="round"
               stroke-dashoffset="26.4"
               id="rect3211-7"
               style="fill:none;stroke:#ffffff" />
            <circle
               cx="2247.0217"
               cy="-1874.4869"
               r="5.8806181"
               stroke-width="7.11677"
               stroke-linecap="square"
               stroke-linejoin="round"
               stroke-dashoffset="26.4"
               id="circle3247-5"
               style="fill:none;stroke:#ffffff" />
            <path
               d="m 1941.7359,-1824.3145 h 325.3995"
               stroke-width="7.11677"
               id="path3249-6"
               sodipodi:nodetypes="cc"
               style="fill:none;stroke:#ffffff" />
            <path
               d="m 2335.6726,-1884.9816 v 343.9645"
               opacity="0.4"
               marker-start="url(#o-61)"
               marker-end="url(#p-59)"
               id="path3255-9"
               style="fill:none;stroke:#ffffff;stroke-width:7.11677;marker-start:url(#o-61);marker-end:url(#p-59)"
               sodipodi:nodetypes="cc" />
            <path
               d="m 1941.7359,-1584.9846 h 325.3995"
               stroke-width="7.11677"
               id="path3337-8"
               sodipodi:nodetypes="cc"
               style="fill:none;stroke:#ffffff" />
            <path
               style="font-variation-settings:normal;vector-effect:none;fill:none;fill-opacity:1;stroke:#ffffff;stroke-width:7.11677;stroke-linecap:butt;stroke-linejoin:miter;stroke-miterlimit:4;stroke-dasharray:none;stroke-dashoffset:0;stroke-opacity:1;stop-color:#000000"
               d="m 2103.9133,-1525.9394 v -57.4616"
               id="path3339-7" />
            <path
               d="M 1993.1985,-1824.3145 H 1890.7026"
               stroke-width="11.4267"
               id="path3587-2"
               sodipodi:nodetypes="cc"
               style="font-variation-settings:normal;opacity:0.4;vector-effect:none;fill:none;fill-opacity:1;stroke:#ffffff;stroke-width:7.11738;stroke-linecap:butt;stroke-linejoin:miter;stroke-miterlimit:4;stroke-dasharray:none;stroke-dashoffset:0;stroke-opacity:1;stop-color:#000000" />
            <path
               d="M 1993.1985,-1899.8192 H 1890.7026"
               stroke-width="11.4267"
               id="path3726-8"
               sodipodi:nodetypes="cc"
               style="font-variation-settings:normal;opacity:0.4;vector-effect:none;fill:none;fill-opacity:1;stroke:#ffffff;stroke-width:7.11738;stroke-linecap:butt;stroke-linejoin:miter;stroke-miterlimit:4;stroke-dasharray:none;stroke-dashoffset:0;stroke-opacity:1;stop-color:#000000" />
            <path
               d="m 1905.3892,-1758.9049 v -49.7407"
               stroke-width="11.4267"
               id="path3728-2"
               sodipodi:nodetypes="cc"
               style="font-variation-settings:normal;opacity:0.4;vector-effect:none;fill:none;fill-opacity:1;stroke:#ffffff;stroke-width:7.11738;stroke-linecap:butt;stroke-linejoin:miter;stroke-miterlimit:4;stroke-dasharray:none;stroke-dashoffset:0;stroke-opacity:1;marker-end:url(#p-59);stop-color:#000000" />
            <path
               d="m 1905.3892,-1964.546 v 49.7406"
               stroke-width="11.4267"
               id="path3730-9"
               sodipodi:nodetypes="cc"
               style="font-variation-settings:normal;opacity:0.4;vector-effect:none;fill:none;fill-opacity:1;stroke:#ffffff;stroke-width:7.11738;stroke-linecap:butt;stroke-linejoin:miter;stroke-miterlimit:4;stroke-dasharray:none;stroke-dashoffset:0;stroke-opacity:1;marker-end:url(#p-59);stop-color:#000000" />
            <path
               style="font-variation-settings:normal;opacity:0.4;vector-effect:none;fill:none;fill-opacity:1;stroke:#ffffff;stroke-width:7.11738;stroke-linecap:butt;stroke-linejoin:miter;stroke-miterlimit:4;stroke-dasharray:none;stroke-dashoffset:0;stroke-opacity:1;stop-color:#000000"
               d="m 1905.3803,-1827.8122 v -68.4423"
               id="path3732-9" />
            <path
               d="M 2352.152,-1526.3949 H 2249.6561"
               stroke-width="11.4267"
               id="path3882-6"
               sodipodi:nodetypes="cc"
               style="font-variation-settings:normal;opacity:0.4;vector-effect:none;fill:none;fill-opacity:1;stroke:#ffffff;stroke-width:7.11738;stroke-linecap:butt;stroke-linejoin:miter;stroke-miterlimit:4;stroke-dasharray:none;stroke-dashoffset:0;stroke-opacity:1;stop-color:#000000" />
            <path
               d="M 2352.152,-1899.8192 H 2249.6561"
               stroke-width="11.4267"
               id="path3884-0"
               sodipodi:nodetypes="cc"
               style="font-variation-settings:normal;opacity:0.4;vector-effect:none;fill:none;fill-opacity:1;stroke:#ffffff;stroke-width:7.11738;stroke-linecap:butt;stroke-linejoin:miter;stroke-miterlimit:4;stroke-dasharray:none;stroke-dashoffset:0;stroke-opacity:1;stop-color:#000000" />
          </g>
          <rect
             width="20.536222"
             height="17.602478"
             x="605.37988"
             y="517.88055"
             rx="3.119462"
             ry="3.119462"
             stroke-width="2.93375"
             stroke-linecap="square"
             stroke-linejoin="round"
             stroke-dashoffset="26.4"
             id="rect128-6-2"
             style="font-variation-settings:normal;vector-effect:none;fill:none;fill-opacity:1;stroke:#ffffff;stroke-width:3.11947;stroke-linecap:butt;stroke-linejoin:miter;stroke-miterlimit:4;stroke-dasharray:none;stroke-dashoffset:0;stroke-opacity:1;stop-color:#000000" />
          <rect
             style="opacity:1;fill:#1a5fb4;fill-opacity:1;stroke-width:2.1266;paint-order:stroke markers fill"
             id="rect1-7"
             width="319.96582"
             height="10.115301"
             x="499.10562"
             y="736.30414"
             rx="2.5375323"
             ry="2.5375323" />
        </g>
      </g>
    </g>
  </g>
</svg>
