<?xml version="1.0" encoding="UTF-8" standalone="no"?>
<svg
   width="220"
   height="100"
   version="1.1"
   id="svg16"
   sodipodi:docname="hig.svg"
   inkscape:version="1.4 (e7c3feb100, 2024-10-09)"
   xmlns:inkscape="http://www.inkscape.org/namespaces/inkscape"
   xmlns:sodipodi="http://sodipodi.sourceforge.net/DTD/sodipodi-0.dtd"
   xmlns="http://www.w3.org/2000/svg"
   xmlns:svg="http://www.w3.org/2000/svg"
   xmlns:rdf="http://www.w3.org/1999/02/22-rdf-syntax-ns#"
   xmlns:cc="http://creativecommons.org/ns#"
   xmlns:dc="http://purl.org/dc/elements/1.1/">
  <sodipodi:namedview
     pagecolor="#ffffff"
     bordercolor="#666666"
     borderopacity="1"
     objecttolerance="10"
     gridtolerance="10"
     guidetolerance="10"
     inkscape:pageopacity="0"
     inkscape:pageshadow="2"
     inkscape:window-width="2346"
     inkscape:window-height="1320"
     id="namedview18"
     showgrid="true"
     inkscape:current-layer="svg16"
     inkscape:showpageshadow="2"
     inkscape:pagecheckerboard="0"
     inkscape:deskcolor="#d1d1d1"
     inkscape:zoom="5.6568542"
     inkscape:cx="105.09375"
     inkscape:cy="54.535611"
     inkscape:window-x="26"
     inkscape:window-y="23"
     inkscape:window-maximized="0">
    <inkscape:grid
       id="grid2"
       units="px"
       originx="0"
       originy="0"
       spacingx="1"
       spacingy="1"
       empcolor="#0099e5"
       empopacity="0.30196078"
       color="#0099e5"
       opacity="0.14901961"
       empspacing="5"
       enabled="true"
       visible="true" />
  </sodipodi:namedview>
  <metadata
     id="metadata22">
    <rdf:RDF>
      <cc:Work
         rdf:about="">
        <dc:format>image/svg+xml</dc:format>
        <dc:type
           rdf:resource="http://purl.org/dc/dcmitype/StillImage" />
      </cc:Work>
    </rdf:RDF>
  </metadata>
  <defs
     id="defs20">
    <marker
       id="c"
       orient="auto"
       overflow="visible"
       refX="0"
       refY="0"
       viewBox="0 0 4.2595265 4.92430809"
       markerWidth="4.2595265"
       markerHeight="4.92430809"
       preserveAspectRatio="xMidYMid">
      <path
         fill="#ffffff"
         fill-rule="evenodd"
         stroke="#ffffff"
         stroke-width="0.4pt"
         d="m -2.308,0 3.46,-2 v 4 z"
         id="path13" />
    </marker>
    <marker
       id="i"
       orient="auto"
       overflow="visible"
       refX="0"
       refY="0"
       viewBox="0 0 4.2595265 4.9243081"
       markerWidth="4.25952667"
       markerHeight="4.9243083"
       preserveAspectRatio="xMidYMid">
      <path
         fill="#ffffff"
         fill-rule="evenodd"
         stroke="#ffffff"
         stroke-width="0.4pt"
         d="m 2.308,0 -3.46,2 v -4 z"
         id="path6" />
    </marker>
    <marker
       id="p"
       orient="auto"
       overflow="visible"
       refX="0"
       refY="0"
       viewBox="0 0 4.2595265 4.9243081"
       markerWidth="4.2595267"
       markerHeight="4.9243083"
       preserveAspectRatio="xMidYMid">
      <path
         fill="#ffffff"
         fill-rule="evenodd"
         stroke="#ffffff"
         stroke-width="0.4pt"
         d="m 2.308,0 -3.46,2 v -4 z"
         id="path14" />
    </marker>
    <marker
       id="marker1"
       orient="auto"
       overflow="visible"
       refX="0"
       refY="0"
       viewBox="0 0 4.2595265 4.9243081"
       markerWidth="4.2595267"
       markerHeight="4.9243083"
       preserveAspectRatio="xMidYMid">
      <path
         fill="#ffffff"
         fill-rule="evenodd"
         stroke="#ffffff"
         stroke-width="0.4pt"
         d="m 2.308,0 -3.46,2 v -4 z"
         id="path1" />
    </marker>
    <marker
       orient="auto"
       overflow="visible"
       refX="0"
       refY="0"
       viewBox="0 0 4.2595265 4.92430809"
       markerWidth="4.2595265"
       markerHeight="4.92430809"
       preserveAspectRatio="xMidYMid"
       id="c9901"
       inkscape:stockid="c9901">
      <path
         fill="#ffffff"
         fill-rule="evenodd"
         stroke="#ffffff"
         stroke-width="0.4pt"
         d="m -2.308,0 3.46,-2 v 4 z"
         id="path13-1"
         style="stroke-opacity:1.0;stroke:#3584e4;fill-opacity:1.0;fill:#3584e4" />
    </marker>
    <marker
       orient="auto"
       overflow="visible"
       refX="0"
       refY="0"
       viewBox="0 0 4.2595265 4.9243081"
       markerWidth="4.25952667"
       markerHeight="4.9243083"
       preserveAspectRatio="xMidYMid"
       id="i5696"
       inkscape:stockid="i5696">
      <path
         fill="#ffffff"
         fill-rule="evenodd"
         stroke="#ffffff"
         stroke-width="0.4pt"
         d="m 2.308,0 -3.46,2 v -4 z"
         id="path6-1"
         style="stroke-opacity:1.0;stroke:#3584e4;fill-opacity:1.0;fill:#3584e4" />
    </marker>
    <marker
       orient="auto"
       overflow="visible"
       refX="0"
       refY="0"
       viewBox="0 0 4.2595265 4.9243081"
       markerWidth="4.2595267"
       markerHeight="4.9243083"
       preserveAspectRatio="xMidYMid"
       id="p7378"
       inkscape:stockid="p7378">
      <path
         fill="#ffffff"
         fill-rule="evenodd"
         stroke="#ffffff"
         stroke-width="0.4pt"
         d="m 2.308,0 -3.46,2 v -4 z"
         id="path14-1"
         style="stroke-opacity:1.0;stroke:#3584e4;fill-opacity:1.0;fill:#3584e4" />
    </marker>
    <marker
       orient="auto"
       overflow="visible"
       refX="0"
       refY="0"
       viewBox="0 0 4.2595265 4.9243081"
       markerWidth="4.2595267"
       markerHeight="4.9243083"
       preserveAspectRatio="xMidYMid"
       id="p9903"
       inkscape:stockid="p9903">
      <path
         fill="#ffffff"
         fill-rule="evenodd"
         stroke="#ffffff"
         stroke-width="0.4pt"
         d="m 2.308,0 -3.46,2 v -4 z"
         id="path14-1-1"
         style="stroke-opacity:1.0;stroke:#3584e4;fill-opacity:1.0;fill:#3584e4" />
    </marker>
  </defs>
  <g
     id="g1"
     transform="matrix(0.5909519,0,0,0.5909519,24.996782,10.261155)"
     style="stroke-width:1.69219">
    <rect
       width="111.68421"
       height="126.74199"
       x="81.230331"
       y="11.56062"
       rx="11.506859"
       ry="11.508552"
       style="fill:none;stroke:#3584e4;stroke-width:3.38437;stroke-miterlimit:4;stroke-dasharray:none"
       id="rect81" />
    <circle
       cx="182.04193"
       cy="22.650394"
       r="5.1373968"
       style="fill:none;stroke:#3584e4;stroke-width:1.69219;stroke-miterlimit:4;stroke-dasharray:none"
       id="circle81" />
    <path
       d="M 81.230331,35.899724 H 193.496"
       style="fill:none;stroke:#3584e4;stroke-width:1.69219;stroke-miterlimit:4;stroke-dasharray:none"
       id="path81"
       sodipodi:nodetypes="cc" />
    <path
       marker-end="url(#p)"
       marker-start="url(#c)"
       d="M 203.85897,16.58457 V 133.46073"
       opacity="0.4"
       style="fill:none;stroke:#3584e4;stroke-width:1.69219;stroke-dasharray:none;marker-start:url(#c9901);marker-end:url(#i5696)"
       id="path82"
       sodipodi:nodetypes="cc" />
    <path
       d="M 100.714,35.937115 H 66 M 100.714,10.250937 H 66 m 4.222153,24.93219 V 10.770487 M 212.13689,139.10119 H 187.576 M 212.13689,10.550076 H 153.7323"
       style="font-variation-settings:normal;opacity:0.4;fill:none;fill-opacity:1;stroke:#3584e4;stroke-width:1.69219;stroke-linecap:butt;stroke-linejoin:miter;stroke-miterlimit:4;stroke-dasharray:none;stroke-dashoffset:0;stroke-opacity:1;stop-color:#000000"
       id="path84"
       sodipodi:nodetypes="cccccccccc" />
    <path
       d="M 70.226153,53.119931 V 40.079347"
       style="font-variation-settings:normal;opacity:0.4;fill:none;fill-opacity:1;stroke:#3584e4;stroke-width:1.69219;stroke-linecap:butt;stroke-linejoin:miter;stroke-miterlimit:4;stroke-dasharray:none;stroke-dashoffset:0;stroke-opacity:1;marker-end:url(#p9903);stop-color:#000000"
       id="path85"
       sodipodi:nodetypes="cc" />
    <path
       d="M 70.300937,-5.9894236 V 6.8386368"
       style="font-variation-settings:normal;opacity:0.4;fill:none;fill-opacity:1;stroke:#3584e4;stroke-width:1.69219;stroke-linecap:butt;stroke-linejoin:miter;stroke-miterlimit:4;stroke-dasharray:none;stroke-dashoffset:0;stroke-opacity:1;marker-end:url(#p7378);stop-color:#000000"
       id="path86"
       sodipodi:nodetypes="cc" />
    <rect
       width="13.62164"
       height="13.602"
       x="87.152977"
       y="17.354273"
       rx="4.5092459"
       ry="4.5092459"
       style="font-variation-settings:normal;fill:none;fill-opacity:1;stroke:#3584e4;stroke-width:1.69219;stroke-linecap:butt;stroke-linejoin:miter;stroke-miterlimit:4;stroke-dasharray:none;stroke-dashoffset:0;stroke-opacity:1;stop-color:#000000"
       id="rect86" />
    <rect
       style="fill:none;fill-opacity:1;stroke:#3584e4;stroke-width:1.69219;stroke-linecap:round;stroke-linejoin:round;stroke-dasharray:none;stroke-opacity:0.596078;paint-order:stroke fill markers"
       id="rect4"
       width="45.768524"
       height="13.711394"
       x="88.873077"
       y="117.19044"
       rx="5.0765553"
       ry="5.0765553" />
    <rect
       style="fill:none;fill-opacity:1;stroke:#3584e4;stroke-width:1.69219;stroke-linecap:round;stroke-linejoin:round;stroke-dasharray:none;stroke-opacity:0.596078;paint-order:stroke fill markers"
       id="rect2"
       width="45.870789"
       height="13.762529"
       x="139.53638"
       y="117.13931"
       rx="5.0765553"
       ry="5.0765553" />
  </g>
</svg>
