<?xml version="1.0" encoding="UTF-8" standalone="no"?>
<svg
   version="1.1"
   viewBox="0 0 712.04 520.28"
   id="svg303"
   sodipodi:docname="overview-pride.svg"
   inkscape:version="1.1.2 (0a00cf5339, 2022-02-04)"
   xmlns:inkscape="http://www.inkscape.org/namespaces/inkscape"
   xmlns:sodipodi="http://sodipodi.sourceforge.net/DTD/sodipodi-0.dtd"
   xmlns:xlink="http://www.w3.org/1999/xlink"
   xmlns="http://www.w3.org/2000/svg"
   xmlns:svg="http://www.w3.org/2000/svg">
  <sodipodi:namedview
     id="namedview305"
     pagecolor="#ffffff"
     bordercolor="#666666"
     borderopacity="1.0"
     inkscape:pageshadow="2"
     inkscape:pageopacity="0.0"
     inkscape:pagecheckerboard="0"
     showgrid="false"
     inkscape:zoom="4.7459382"
     inkscape:cx="293.19809"
     inkscape:cy="422.88793"
     inkscape:window-width="2560"
     inkscape:window-height="1371"
     inkscape:window-x="0"
     inkscape:window-y="0"
     inkscape:window-maximized="1"
     inkscape:current-layer="svg303" />
  <defs
     id="defs117">
    <clipPath
       id="s">
      <rect
         x="2.8359"
         y="361.12"
         width="443.74"
         height="423.92"
         rx="0"
         ry="0"
         fill="#9141ac"
         stop-color="#000000"
         id="rect2" />
    </clipPath>
    <clipPath
       id="t">
      <circle
         cx="60.445"
         cy="758.59"
         r="252.86"
         fill="#9141ac"
         stop-color="#000000"
         id="circle5" />
    </clipPath>
    <clipPath
       id="r">
      <path
         d="m65 177c-18.502 0-33.5 14.998-33.5 33.5 8e-3 7.371 4.131 15.807 11.388 23.526l12.617 13.171h19.515l12.137-13.245c6.636-7.059 11.33-16.117 11.344-23.452 0-18.502-14.998-33.5-33.5-33.5z"
         fill="#fff"
         stroke-width="2"
         id="path8" />
    </clipPath>
    <radialGradient
       id="q"
       cx="79.091"
       cy="48.406"
       r="33.5"
       gradientTransform="matrix(.00476 1.6223 -1.4342 .00422 141.7 -82.047)"
       gradientUnits="userSpaceOnUse">
      <stop
         stop-color="#fff"
         offset="0"
         id="stop11" />
      <stop
         stop-color="#fff"
         offset=".519"
         id="stop13" />
      <stop
         stop-color="#cfcfcf"
         offset=".734"
         id="stop15" />
      <stop
         stop-color="#dcdcdc"
         offset="1"
         id="stop17" />
    </radialGradient>
    <radialGradient
       id="p"
       cx="71.474"
       cy="54.102"
       r="12"
       gradientTransform="matrix(4.5061,0,0,4.7666,-259.31,-59.706)"
       gradientUnits="userSpaceOnUse">
      <stop
         stop-color="#ed686f"
         offset="0"
         id="stop20" />
      <stop
         stop-color="#a51d2d"
         offset=".865"
         id="stop22" />
      <stop
         stop-color="#e01b24"
         offset="1"
         id="stop24" />
    </radialGradient>
    <radialGradient
       id="c"
       cx="40.152"
       cy="49.777"
       r="14.583"
       gradientTransform="matrix(.87016 4.2787 -2.5669 .52204 148.39 -163.31)"
       gradientUnits="userSpaceOnUse">
      <stop
         stop-color="#ed686f"
         offset="0"
         id="stop27" />
      <stop
         stop-color="#a51d2d"
         offset=".911"
         id="stop29" />
      <stop
         stop-color="#e01b24"
         offset="1"
         id="stop31" />
    </radialGradient>
    <clipPath
       id="u">
      <rect
         x="290"
         y="240"
         width="250"
         height="240"
         fill="#ed333b"
         stop-color="#000000"
         stroke-width="2"
         id="rect34" />
    </clipPath>
    <linearGradient
       id="h"
       x1="607.98889"
       x2="346.63"
       y1="100.85694"
       y2="325.57999"
       gradientTransform="translate(-59.129,19.28)"
       gradientUnits="userSpaceOnUse"
       spreadMethod="reflect">
      <stop
         stop-color="#f66151"
         offset="0"
         id="stop3955"
         style="stop-color:#a3489e;stop-opacity:1" />
      <stop
         stop-color="#ff7800"
         offset="1"
         id="stop39"
         style="stop-color:#d493d4;stop-opacity:1" />
    </linearGradient>
    <linearGradient
       id="k"
       x1="45.999"
       x2="64"
       y1="246.97"
       y2="276"
       gradientUnits="userSpaceOnUse"
       gradientTransform="matrix(2,0,0,2,384.86,-351.86)">
      <stop
         stop-color="#613583"
         offset="0"
         id="stop42"
         style="stop-color:#8b1b9e;stop-opacity:1" />
      <stop
         stop-color="#a347ba"
         offset="1"
         id="stop44"
         style="stop-color:#c22edc;stop-opacity:1" />
    </linearGradient>
    <linearGradient
       id="n"
       x1="82"
       x2="64"
       y1="225.61"
       y2="196"
       gradientUnits="userSpaceOnUse"
       gradientTransform="matrix(2,0,0,2,384.86,-351.86)">
      <stop
         stop-color="#e5a50a"
         offset="0"
         id="stop47"
         style="stop-color:#dac300;stop-opacity:1" />
      <stop
         stop-color="#f6d32d"
         offset="1"
         id="stop49"
         style="stop-color:#ffe500;stop-opacity:1" />
    </linearGradient>
    <linearGradient
       id="j"
       x1="45.999"
       x2="28"
       y1="225.61"
       y2="256.78"
       gradientUnits="userSpaceOnUse"
       gradientTransform="matrix(2,0,0,2,384.86,-351.86)">
      <stop
         stop-color="#1a5fb4"
         offset="0"
         id="stop52"
         style="stop-color:#05368f;stop-opacity:1" />
      <stop
         stop-color="#3584e4"
         offset="1"
         id="stop54"
         style="stop-color:#0644b3;stop-opacity:1" />
    </linearGradient>
    <linearGradient
       id="m"
       x1="82.001"
       x2="100"
       y1="246.39"
       y2="216"
       gradientUnits="userSpaceOnUse"
       gradientTransform="matrix(2,0,0,2,384.86,-351.86)">
      <stop
         stop-color="#c64600"
         offset="0"
         id="stop57"
         style="stop-color:#d57500;stop-opacity:1" />
      <stop
         stop-color="#ff7800"
         offset="1"
         id="stop59"
         style="stop-color:#fd8c00;stop-opacity:1" />
    </linearGradient>
    <linearGradient
       id="i"
       x1="63.999"
       x2="28"
       y1="215.22"
       y2="215.22"
       gradientUnits="userSpaceOnUse"
       gradientTransform="matrix(2,0,0,2,384.86,-351.86)">
      <stop
         stop-color="#26a269"
         offset="0"
         id="stop62"
         style="stop-color:#0d7508;stop-opacity:1" />
      <stop
         stop-color="#33d17a"
         offset="1"
         id="stop64"
         style="stop-color:#119f0b;stop-opacity:1" />
    </linearGradient>
    <linearGradient
       id="l"
       x1="64.499"
       x2="100"
       y1="257.07"
       y2="258"
       gradientUnits="userSpaceOnUse"
       gradientTransform="matrix(2,0,0,2,384.86,-351.86)">
      <stop
         stop-color="#a51d2d"
         offset="0"
         id="stop67"
         style="stop-color:#a00000;stop-opacity:1" />
      <stop
         stop-color="#e01b24"
         offset="1"
         id="stop69"
         style="stop-color:#fe0000;stop-opacity:1" />
    </linearGradient>
    <linearGradient
       id="b"
       x1="116.2"
       x2="600.2"
       y1="238"
       y2="-316.08"
       gradientTransform="translate(-1.0205e-6,-1.0663e-5)"
       gradientUnits="userSpaceOnUse">
      <stop
         stop-color="#b2d1e9"
         offset="0"
         id="stop72" />
      <stop
         stop-color="#c0c6cd"
         offset=".1358"
         id="stop74" />
      <stop
         stop-color="#d2dee8"
         offset=".45268"
         id="stop76" />
      <stop
         stop-color="#bfc5ce"
         offset=".71953"
         id="stop78" />
      <stop
         stop-color="#dbe2e8"
         offset=".93705"
         id="stop80" />
      <stop
         stop-color="#e4e6e8"
         offset="1"
         id="stop82" />
    </linearGradient>
    <linearGradient
       id="o"
       x1="99.846"
       x2="431.14"
       y1="91.301"
       y2="91.301"
       gradientTransform="translate(-246.02,-371.38)"
       gradientUnits="userSpaceOnUse">
      <stop
         stop-color="#f6d32d"
         offset="0"
         id="stop85" />
      <stop
         stop-color="#f9f06b"
         offset="1"
         id="stop87" />
    </linearGradient>
    <radialGradient
       id="f"
       cx="280"
       cy="16.275"
       r="160"
       gradientTransform="matrix(1,0,0,1.1759,0,-118.64)"
       gradientUnits="userSpaceOnUse">
      <stop
         stop-color="#c4a000"
         offset="0"
         id="stop90" />
      <stop
         stop-color="#edd400"
         stop-opacity="0"
         offset="1"
         id="stop92" />
    </radialGradient>
    <radialGradient
       id="e"
       cx="273.94"
       cy="67.198"
       r="56"
       gradientTransform="matrix(1 0 0 1.0001 0 -.006628)"
       gradientUnits="userSpaceOnUse">
      <stop
         stop-color="#fff"
         offset="0"
         id="stop95" />
      <stop
         stop-color="#c4c5c3"
         offset="1"
         id="stop97" />
    </radialGradient>
    <linearGradient
       id="a"
       x1="36"
       x2="60"
       y1="68"
       y2="68"
       gradientTransform="translate(-8,156)"
       gradientUnits="userSpaceOnUse">
      <stop
         stop-color="#ed336c"
         offset="0"
         id="stop100" />
      <stop
         stop-color="#ffa348"
         offset="1"
         id="stop102" />
    </linearGradient>
    <linearGradient
       id="w"
       x1="72"
       x2="96"
       y1="68"
       y2="68"
       gradientTransform="rotate(90,6,130)"
       gradientUnits="userSpaceOnUse">
      <stop
         stop-color="#404ce6"
         offset="0"
         id="stop105" />
      <stop
         stop-color="#c061cb"
         offset="1"
         id="stop107" />
    </linearGradient>
    <linearGradient
       id="v"
       x1="68.849"
       x2="95.258"
       y1="84"
       y2="84"
       gradientTransform="translate(-8,156)"
       gradientUnits="userSpaceOnUse">
      <stop
         stop-color="#33d1c6"
         offset="0"
         id="stop110" />
      <stop
         stop-color="#1c25d8"
         offset="1"
         id="stop112" />
    </linearGradient>
    <radialGradient
       id="d"
       cx="40.152"
       cy="49.777"
       r="14.583"
       gradientTransform="matrix(.87016 4.2787 -2.5669 .52204 148.39 -163.31)"
       gradientUnits="userSpaceOnUse"
       xlink:href="#c" />
    <linearGradient
       id="g"
       x1="116.2"
       x2="600.2"
       y1="238"
       y2="-316.08"
       gradientTransform="translate(-1.0205e-6,-1.0663e-5)"
       gradientUnits="userSpaceOnUse"
       xlink:href="#b" />
    <linearGradient
       id="h-5"
       x1="614.88"
       x2="346.63"
       y1="95.875"
       y2="325.57999"
       gradientTransform="translate(-59.129,19.28)"
       gradientUnits="userSpaceOnUse">
      <stop
         stop-color="#f66151"
         offset="0"
         id="stop37" />
      <stop
         stop-color="#ff7800"
         offset="1"
         id="stop39-3" />
    </linearGradient>
  </defs>
  <path
     d="m 176.04,111.22 a 30.067,30.067 0 0 0 32,28 h 56 a 32,32 0 0 1 32,32 30.096,30.096 0 0 1 -32,28.062 h -143.3 a 32,32 0 0 0 -32,32 30.068,30.068 0 0 0 32,28.002 h 3.3008 a 32,32 0 0 1 32,32 30.037,30.037 0 0 0 32,27.936 h 16 a 32,32 0 0 1 32,32 24.331,24.331 0 0 1 -20,28 v 60 h 148 a 32,32 0 0 0 32,-32 30.067,30.067 0 0 1 32,-28 h 156 a 32,32 0 0 0 32,-32 30.067,30.067 0 0 0 -32,-28 h -16 a 32,32 0 0 1 -32,-32 30.037,30.037 0 0 1 32,-27.936 h 31 a 32,32 0 0 0 32,-32 30.068,30.068 0 0 0 -32,-28.002 h -101 a 32,32 0 0 1 -32,-32 30.096,30.096 0 0 1 32,-28.062 h 181 a 32,32 0 0 0 32,-32 30.067,30.067 0 0 0 -32,-28 h -471 a 32,32 0 0 0 -32,32 z"
     fill="url(#h)"
     stop-color="#000000"
     stroke-width="8.3324"
     id="path119-5"
     style="fill:url(#h-5)" />
  <g
     transform="translate(-59.129,-40.72)"
     display="none"
     style="mix-blend-mode:multiply"
     id="g177">
    <g
       transform="matrix(1.0791,0,0,1.0791,-813.06,-277.16)"
       clip-path="url(#s)"
       display="inline"
       id="g139">
      <circle
         cx="60.445"
         cy="758.59"
         r="277.13"
         fill="#99c1f1"
         fill-opacity=".58136"
         stop-color="#000000"
         id="circle121" />
      <g
         clip-path="url(#t)"
         id="g133">
        <circle
           cx="60.445"
           cy="758.59"
           r="252.86"
           fill="#1a5fb4"
           stop-color="#000000"
           id="circle123" />
        <g
           fill="#26a269"
           id="g131">
          <path
             d="m143.6 635.83v12.787a30 30 135 0 1-30 30h-3.3809a30 30 135 0 0-30 30v21.381a30 30 45 0 0 30 30h49.771a30 30 45 0 1 30 30 22.292 22.292 17.9 0 0 30 9.6895h74.566a30 30 135 0 0 30-30v-133.86a30 30 45 0 0-30-30h-120.96a30 30 135 0 0-30 30z"
             stop-color="#000000"
             id="path125" />
          <rect
             x="52.351"
             y="577.55"
             width="48.962"
             height="84.074"
             rx="24.481"
             ry="24.481"
             stop-color="#000000"
             id="rect127" />
          <rect
             x="141.5"
             y="540.63"
             width="119.84"
             height="44.28"
             rx="22.14"
             ry="22.14"
             stop-color="#000000"
             id="rect129" />
        </g>
      </g>
      <path
         d="m314.62 601.23a40.625 40.625 0 0 0-36.363 22.576 32.599 32.599 0 0 0-3.0898-0.14844 32.599 32.599 0 0 0-32.6 32.6 32.599 32.599 0 0 0 0.90039 7.6113h136.43a27.262 27.262 0 0 0-24.814-25.949 40.625 40.625 0 0 0-40.434-36.689 40.625 40.625 0 0 0-0.0332 0z"
         fill="#fff"
         stop-color="#000000"
         id="path135" />
      <path
         d="m191.62 667.91a20.492 20.492 0 0 0-19.428 13.979 17.222 17.222 0 0 0-6.5137-1.2812 17.222 17.222 0 0 0-17.223 17.223 17.222 17.222 0 0 0 2.1914 8.4082h30.059a17.222 17.222 0 0 0 0.20118-0.36719 20.492 20.492 0 0 0 0.62304 0.36719h20.176a20.492 20.492 0 0 0 10.406-17.836 20.492 20.492 0 0 0-20.492-20.492z"
         fill="#fff"
         stop-color="#000000"
         id="path137" />
    </g>
    <g
       transform="matrix(2.3172,0,0,2.3172,-4176.8,5246.8)"
       id="g161">
      <g
         transform="matrix(.81868 0 0 .81868 1370.5 -2363.6)"
         id="g159">
        <g
           transform="matrix(.75 0 0 .75 154.46 112)"
           id="g157">
          <g
             transform="matrix(3.1213,0,0,2.9344,91.064,-499.94)"
             clip-path="url(#r)"
             id="g149">
            <path
               transform="translate(-8,156)"
               d="m73 21c-18.502 0-33.5 14.998-33.5 33.5 8e-3 7.371 3.5 14.422 6.94 20.379l11.56 23.121h30l11.605-23.21c3.395-5.88 6.88-12.955 6.895-20.29 0-18.502-14.998-33.5-33.5-33.5z"
               fill="url(#q)"
               id="path141" />
            <path
               d="m64 177s-18.332 12.132-18.332 30.989c0 14.571 16.174 46.011 16.174 46.011h5.158s1.333-31.44 1.333-46.011c0-18.857-4.333-30.989-4.333-30.989z"
               fill="url(#p)"
               id="path143" />
            <path
               transform="translate(-8,156)"
               d="m71.983 21.106c-8.207 0.147-16.328 3.285-22.5 8.695-6.174 5.409-10.35 13.047-11.574 21.163-1.24 8.225 0.567 16.874 4.995 23.915l18.998 23.121h6.432l-13.332-16.73c-4.3-5.395-8.472-11.07-10.596-17.634-2.123-6.564-2.166-13.8 3e-3 -20.348a32.824 32.824 0 0 1 10.516-15.158 32.824 32.824 0 0 1 17.058-7.025z"
               fill="url(#d)"
               id="path145" />
            <path
               transform="matrix(-1,0,0,1,137.16,155.82)"
               d="m73.003 21.303c-7.709-1.547-15.97-0.154-22.746 3.835s-12.002 10.537-14.39 18.029a32.484 32.484 0 0 0-0.757 16.805 32.484 32.484 0 0 0 7.794 14.907l11.206 23.121h13.383l-13.333-23.644c-2.868-5.087-5.557-10.406-6.427-16.181s0.036-11.771 2.374-17.123c4.173-9.55 12.836-17.022 22.895-19.748z"
               fill="url(#d)"
               id="path147" />
          </g>
          <path
             d="m271.06 256.22v19.397a9.702 9.702 0 0 0 9.724 9.726h26.326c5.388 0 8.594-4.457 9.725-9.726v-19.397z"
             fill="#e5a50a"
             id="path151" />
          <path
             d="m271.06 252.06v19.397a9.702 9.702 0 0 0 9.724 9.724h26.326c5.388 0 8.594-4.455 9.725-9.724v-19.397z"
             fill="#e5a50a"
             id="path153" />
          <path
             d="m300.19 252.06v29.121h6.92c5.388 0 8.594-4.455 9.725-9.724v-19.397z"
             fill="#f3af0b"
             id="path155" />
        </g>
      </g>
    </g>
    <rect
       x="-116"
       y="-60"
       width="24"
       height="24"
       ry="12"
       display="inline"
       enable-background="new"
       fill="#deddda"
       id="rect163" />
    <rect
       x="-140"
       y="-60"
       width="24"
       height="24"
       ry="12"
       display="inline"
       enable-background="new"
       fill="#ed333b"
       id="rect165" />
    <rect
       x="-188"
       y="-60"
       width="24"
       height="24"
       ry="12"
       display="inline"
       enable-background="new"
       fill="#ed333b"
       id="rect167" />
    <rect
       x="-164"
       y="-60"
       width="24"
       height="24"
       ry="12"
       display="inline"
       enable-background="new"
       fill="#deddda"
       id="rect169" />
    <rect
       x="-92"
       y="-60"
       width="24"
       height="24"
       ry="12"
       display="inline"
       enable-background="new"
       fill="#ed333b"
       id="rect171" />
    <path
       d="m-182-80c-3.324 0-6 2.676-6 6v26h120v-26c0-3.324-2.676-6-6-6z"
       display="inline"
       enable-background="new"
       fill="#f66151"
       id="path173" />
    <path
       d="m-164-80v32h24v-32zm48 0v32h24v-32z"
       display="inline"
       enable-background="new"
       fill="#f6f5f4"
       id="path175" />
  </g>
  <rect
     x="215.871"
     y="199.28"
     width="250"
     height="240"
     fill="#c0bfbc"
     stop-color="#000000"
     stroke-width="2.1381"
     id="rect179" />
  <rect
     x="225.871"
     y="299.28"
     width="150"
     height="120"
     fill="#62a0ea"
     stop-color="#000000"
     stroke-width="2"
     id="rect181"
     style="fill:#62a0ea;fill-opacity:0.70813924" />
  <path
     d="m 225.871,366.15 v -30.397 l 36.477,-36.477 h 30.397 z"
     enable-background="new"
     fill="#ffffff"
     fill-rule="evenodd"
     opacity="0.2"
     id="path183" />
  <path
     d="m 225.871,390.47 v -12.159 l 79.033,-79.033 h 12.159 z"
     enable-background="new"
     fill="#ffffff"
     fill-rule="evenodd"
     opacity="0.2"
     id="path185" />
  <rect
     x="385.871"
     y="299.28"
     width="70"
     height="140"
     fill="#62a0ea"
     stop-color="#000000"
     stroke-width="1.4757"
     id="rect187"
     style="fill:#f7d100;fill-opacity:1" />
  <path
     d="m 165.871,284.28 h 330 v 20 h -330 z m 350,20 a 35,35 0 0 1 -17.5,30.311 35,35 0 0 1 -35,0 35,35 0 0 1 -17.5,-30.311 35,35 0 0 1 -17.5,30.311 35,35 0 0 1 -35,0 35,35 0 0 1 -17.5,-30.311 35,35 0 0 1 -17.5,30.311 35,35 0 0 1 -35,0 35,35 0 0 1 -17.5,-30.311 m 0.33698,0 a 35,35 0 0 1 -17.5,30.311 35,35 0 0 1 -35,0 35,35 0 0 1 -17.5,-30.311 m -0.33698,0 a 35,35 0 0 1 -17.5,30.311 35,35 0 0 1 -35,0 35,35 0 0 1 -17.5,-30.311"
     fill-opacity="0.12075"
     stop-color="#000000"
     stroke-width="2"
     id="path189" />
  <circle
     cx="432.6871"
     cy="372.90506"
     r="16.135445"
     fill="#1a5fb4"
     stop-color="#000000"
     id="circle191"
     style="font-variation-settings:normal;opacity:1;vector-effect:none;fill:#7502a5;fill-opacity:1;stroke-width:2;stroke-linecap:butt;stroke-linejoin:miter;stroke-miterlimit:4;stroke-dasharray:none;stroke-dashoffset:0;stroke-opacity:1;-inkscape-stroke:none;stop-color:#000000;stop-opacity:1" />
  <circle
     cx="432.6871"
     cy="372.90506"
     r="9.0183392"
     fill="#1a5fb4"
     stop-color="#000000"
     id="circle191-6"
     style="font-variation-settings:normal;vector-effect:none;fill:#f7d100;fill-opacity:1;stroke-width:2;stroke-linecap:butt;stroke-linejoin:miter;stroke-miterlimit:4;stroke-dasharray:none;stroke-dashoffset:0;stroke-opacity:1;-inkscape-stroke:none;stop-color:#000000" />
  <rect
     x="225.871"
     y="409.28"
     width="150"
     height="10"
     fill="#deddda"
     stop-color="#000000"
     id="rect193"
     style="stroke-width:2" />
  <rect
     x="225.871"
     y="419.28"
     width="150"
     height="10"
     fill="#9a9996"
     stop-color="#000000"
     id="rect195"
     style="stroke-width:2" />
  <path
     d="m 235.871,284.28 a 35,35 0 0 1 -17.5,30.311 35,35 0 0 1 -35,0 35,35 0 0 1 -17.5,-30.311"
     fill="#deddda"
     stop-color="#000000"
     id="path201"
     style="stroke-width:2;fill:#3d94b6;fill-opacity:1" />
  <path
     d="m 306.211,284.28 a 35,35 0 0 1 -17.5,30.311 35,35 0 0 1 -35,0 35,35 0 0 1 -17.5,-30.311"
     fill="#e01b24"
     stop-color="#000000"
     id="path203"
     style="stroke-width:2;fill:#cf8f9b;fill-opacity:1" />
  <path
     d="m 375.871,284.28 a 35,35 0 0 1 -17.5,30.311 35,35 0 0 1 -35,0 35,35 0 0 1 -17.5,-30.311"
     fill="#deddda"
     stop-color="#000000"
     id="path205"
     style="stroke-width:2" />
  <path
     d="m 445.871,284.28 a 35,35 0 0 1 -17.5,30.311 35,35 0 0 1 -35,0 35,35 0 0 1 -17.5,-30.311"
     fill="#e01b24"
     stop-color="#000000"
     id="path207"
     style="stroke-width:2;fill:#cf8f9b;fill-opacity:1" />
  <path
     d="m 515.871,284.28 a 35,35 0 0 1 -17.5,30.311 35,35 0 0 1 -35,0 35,35 0 0 1 -17.5,-30.311"
     fill="#deddda"
     stop-color="#000000"
     id="path209"
     style="stroke-width:2;fill:#3d94b6;fill-opacity:1" />
  <path
     d="m 266.471,199.28 h 49.6 l -10.2,85 h -70 z"
     fill="#ed333b"
     stop-color="#000000"
     id="path213"
     style="stroke-width:0.89442;fill:#f5a9b8;fill-opacity:1" />
  <path
     d="m 365.671,199.28 h 49.6 l 30.6,85 h -70 z"
     fill="#ed333b"
     stop-color="#000000"
     id="path215"
     style="stroke-width:0.89442;fill:#f5a9b8;fill-opacity:1" />
  <path
     d="m 216.871,199.28 h 49.6 l -30.6,85 h -70 z"
     stop-color="#000000"
     id="path217"
     style="fill:#5bcefa;stroke-width:0.89442;fill-opacity:1" />
  <path
     d="m 316.071,199.28 h 49.6 l 10.2,85 h -70 z"
     stop-color="#000000"
     id="path219"
     style="fill:#ffffff;stroke-width:0.89442" />
  <path
     d="m 415.271,199.28 h 49.6 l 51,85 h -70 z"
     stop-color="#000000"
     id="path221"
     style="fill:#5bcefa;stroke-width:0.89442;fill-opacity:1" />
  <g
     transform="matrix(1.6,0,0,1.6,121.03,83.93)"
     enable-background="new"
     id="g247">
    <path
       d="m 36,172 8,-8 h 24 l 8,8 z"
       fill="#c0bfbc"
       id="path229" />
    <path
       d="m 44,164 -8,8 v 16 h 8 z"
       fill="#f6f5f4"
       id="path231" />
    <path
       d="m 68,164 8,8 v 16 h -8 z"
       fill="#f6f5f4"
       id="path233" />
    <path
       d="m 8,228 c 32.272,0.0275 64.547,-0.055 96.818,0.0413 5.0074,0.34579 7.8766,5.5188 7.1821,10.137 -0.10048,9.1417 0.20598,18.309 -0.16254,27.434 -0.79338,4.6412 -5.678,6.9823 -10.016,6.3878 -31.546,-0.0275 -63.095,0.055 -94.64,-0.0413 -5.0074,-0.34579 -7.8765,-5.5188 -7.1821,-10.137 0.10048,-9.1417 -0.20598,-18.309 0.16254,-27.434 C 0.85203,230.749 4.2925,227.9367 7.9995,228 Z"
       fill="#deddda"
       id="path235" />
    <path
       d="m 0,184 h 112 v 80 H 0 Z"
       fill="#e5e5e1"
       id="path237" />
    <path
       d="m 0,224 h 112 v 40 H 0 Z"
       fill="#f6f5f4"
       id="path239" />
    <path
       d="m 36,212 c 4.5894,0.36427 9.9861,-1.2484 13.657,2.3433 3.5914,3.6688 1.9791,9.0678 2.3433,13.657 0.17221,5.1573 -5.0358,8.7675 -9.8671,8 -4.4379,-0.11148 -9.9914,0.93858 -12.767,-3.5273 -2.2761,-3.7541 -1.0541,-8.3114 -1.3664,-12.473 -0.09146,-4.301 3.696,-8.091 8,-8 z"
       fill="url(#a)"
       id="path241" />
    <path
       d="m 68,220 c -8.7414,0.39995 -15.065,-10.224 -10.552,-17.721 3.7906,-7.7944 15.98,-8.3841 20.503,-0.9894 5.4673,7.6101 -0.56999,18.988 -9.951,18.71 z"
       fill="url(#w)"
       id="path243" />
    <path
       d="m 74.789,226.98 c -6.0786,3.5643 -12.331,6.8668 -18.3,10.596 -2.9934,3.3211 1.2061,6.0028 3.9639,7.257 5.078,2.8119 10.018,5.9077 15.183,8.5398 4.3866,0.91313 4.647,-4.0626 4.364,-7.1035 -0.07768,-5.7217 0.1569,-11.464 -0.11993,-17.173 -0.5233,-2.1572 -3.1921,-3.2671 -5.091,-2.1167 z"
       fill="url(#v)"
       id="path245" />
  </g>
  <path
     d="m 548.86,99.36 v 41.57 l -36,20.784 -36,-20.784 V 99.36 l 36,-20.784 z"
     enable-background="new"
     fill="#3d3846"
     id="path249"
     style="stroke-width:2" />
  <path
     d="m 440.86,78.58 -7.2e-4,83.138"
     enable-background="new"
     stroke="#33d17a"
     id="path251"
     style="fill:none;stroke-width:72;stroke:#119f0b;stroke-opacity:1" />
  <path
     d="m 512.86,203.28 -72,-41.572"
     enable-background="new"
     stroke="#3584e4"
     id="path253"
     style="fill:none;stroke-width:72;stroke:#0644b3;stroke-opacity:1" />
  <path
     d="m 512.86,203.28 72,-41.574"
     enable-background="new"
     stroke="#a347ba"
     id="path255"
     style="fill:none;stroke-width:72;stroke:#c22edc;stroke-opacity:1" />
  <path
     d="m 584.86,78.56 -7.2e-4,83.138"
     enable-background="new"
     stroke="#e01b24"
     id="path257"
     style="fill:none;stroke-width:72;stroke:#fe0000;stroke-opacity:1" />
  <path
     d="M 584.86,78.56 512.858,36.992"
     enable-background="new"
     stroke="#ff7800"
     id="path259"
     style="fill:none;stroke-width:72;stroke:#fd8c00;stroke-opacity:1" />
  <path
     d="M 440.86,78.58 512.858,37.01"
     enable-background="new"
     stroke="#f6d32d"
     id="path261"
     style="fill:none;stroke-width:72;stroke:#ffe500;stroke-opacity:1" />
  <path
     d="m 512.86,239.28 c 19.8822,0 36,-16.1178 36,-36 -0.018,-11.7856 -5.8028,-22.816 -15.4882,-29.532 l -18.5156,-10.8828 -1.9961,-1.15234 c -5.5476,-3.1326 -11.906,-6.8344 -17.0676,-9.9218 -11.5992,-6.2424 -18.9146,-18.3732 -18.9324,-31.648 v 83.136 c 0,19.8822 16.1178,36 36,36 z m -35.868,-38.902 c 0.047,-0.56618 0.1298,-1.12348 0.20312,-1.6836 -0.081,0.55952 -0.1486,1.12088 -0.20312,1.6836 z m 1.875,-8.8242 c 0.0524,-0.1508 0.0902,-0.307 0.1446,-0.45704 l 0.008,-0.004 c -0.0518,0.1534 -0.1026,0.30696 -0.1524,0.46094 z"
     enable-background="new"
     fill="url(#k)"
     id="path265"
     style="fill:url(#k);stroke-width:2" />
  <path
     d="m 512.86,1 c -19.8822,0 -36,16.1178 -36,36 0.018,11.7856 5.8028,22.816 15.4882,29.532 l 18.5156,10.8828 1.9961,1.15234 c 5.5476,3.1326 11.906,6.8344 17.0676,9.9218 11.5992,6.2424 18.9146,18.3732 18.9324,31.648 v -83.136 c 0,-19.8822 -16.1178,-36 -36,-36 z m 35.868,38.902 c -0.047,0.56618 -0.1298,1.12348 -0.20312,1.6836 0.081,-0.55952 0.1486,-1.12088 0.20312,-1.6836 z m -1.875,8.8242 c -0.0524,0.1508 -0.0902,0.307 -0.1446,0.45704 l -0.008,0.004 c 0.0518,-0.1534 0.1026,-0.30696 0.1524,-0.46094 z"
     enable-background="new"
     fill="url(#n)"
     id="path267"
     style="fill:url(#n);stroke-width:2" />
  <path
     d="m 409.684,179.7 c 9.9412,17.2186 31.958,23.118 49.176,13.177 10.1978,-5.908 16.858,-16.4336 17.8306,-28.178 l 0.167,-21.476 -8e-5,-2.3048 c -0.0608,-6.3706 -0.0342,-13.728 0.0588,-19.7418 -0.39344,-13.1664 6.4544,-25.568 17.9422,-32.22 l -71.998,41.568 c -17.2186,9.9412 -23.118,31.958 -13.177,49.176 z m 15.7568,-50.514 c 0.5138,-0.24242 1.03784,-0.44938 1.5596,-0.6659 -0.52502,0.20968 -1.04504,0.43172 -1.5596,0.6659 z m 8.5796,-2.7884 c 0.1568,-0.03 0.311,-0.0754 0.46806,-0.1034 l 0.008,0.004 c -0.1588,0.0318 -0.31712,0.0646 -0.47534,0.0986 z"
     enable-background="new"
     fill="url(#j)"
     id="path269"
     style="fill:url(#j);stroke-width:2" />
  <path
     d="M 616.04,60.58 C 606.0988,43.3614 584.082,37.462 566.864,47.403 556.6662,53.311 550.006,63.8366 549.0334,75.581 l -0.167,21.476 8e-5,2.3048 c 0.0608,6.3706 0.0342,13.728 -0.0588,19.7418 0.39344,13.1664 -6.4544,25.568 -17.9422,32.22 l 71.998,-41.568 c 17.2186,-9.9412 23.118,-31.958 13.1768,-49.176 z m -15.7568,50.514 c -0.5138,0.24244 -1.03782,0.44936 -1.5596,0.6659 0.52502,-0.2097 1.04504,-0.43172 1.5596,-0.6659 z m -8.5796,2.7884 c -0.1568,0.0302 -0.31098,0.0754 -0.46806,0.1034 l -0.008,-0.004 c 0.1586,-0.0318 0.31712,-0.0646 0.47534,-0.0986 z"
     enable-background="new"
     fill="url(#m)"
     id="path271"
     style="fill:url(#m);stroke-width:2" />
  <path
     d="m 409.684,60.58 c -9.9412,17.2186 -4.0416,39.236 13.1768,49.176 10.2154,5.8776 22.66,6.3826 33.318,1.35238 l 18.6826,-10.5936 1.996,-1.1525 c 5.4868,-3.238 11.8716,-6.8936 17.1262,-9.82 11.2058,-6.924 25.368,-7.1938 36.874,-0.57172 l -71.998,-41.568 c -17.2186,-9.9412 -39.236,-4.0416 -49.176,13.177 z m 51.624,-11.6108 c 0.46684,0.32376 0.90808,0.6741 1.35648,1.0177 -0.4441,-0.34984 -0.8964,-0.68916 -1.35648,-1.0177 z m 6.7044,6.036 c 0.1044,0.1208 0.22074,0.23166 0.32354,0.3537 l -4.4e-4,0.008 c -0.107,-0.1216 -0.21454,-0.24234 -0.32302,-0.3624 z"
     enable-background="new"
     fill="url(#i)"
     id="path273"
     style="fill:url(#i);stroke-width:2" />
  <path
     d="m 616.04,179.7 c 9.9412,-17.2186 4.0416,-39.236 -13.1768,-49.176 -10.2154,-5.8776 -22.66,-6.3826 -33.318,-1.35238 l -18.6826,10.5936 -1.99602,1.1525 c -5.4868,3.238 -11.8716,6.8936 -17.1262,9.82 -11.2058,6.924 -25.368,7.1938 -36.874,0.57172 l 71.998,41.568 c 17.2186,9.9412 39.236,4.0416 49.176,-13.177 z m -51.624,11.6108 c -0.46686,-0.32376 -0.90808,-0.6741 -1.35648,-1.0177 0.4441,0.34984 0.8964,0.68916 1.35648,1.0177 z m -6.7044,-6.036 c -0.1044,-0.1208 -0.22074,-0.23166 -0.32354,-0.3537 l 4.4e-4,-0.008 c 0.1068,0.1216 0.21452,0.24234 0.32302,0.3624 z"
     enable-background="new"
     fill="url(#l)"
     id="path275"
     style="fill:url(#l);stroke-width:2" />
  <g
     id="g19659"
     transform="rotate(60,512.86,120.145)">
    <g
       id="g19654">
      <path
         d="m 476.86,99.36 v 41.57 l 36,20.784 36,-20.784 V 99.36 l -36,-20.784 z"
         enable-background="new"
         fill="#241f31"
         id="path277"
         style="stroke-width:2" />
    </g>
    <path
       d="m 512.86,161.714 36,-20.784 V 99.36 l -36,-20.783999 c 0,48.461879 0,28.767649 0,83.137999 z"
       enable-background="new"
       fill="#241f31"
       id="path277-7"
       style="fill:#734c17;fill-opacity:1;stroke-width:2"
       sodipodi:nodetypes="ccccc" />
  </g>
  <g
     transform="matrix(1.2,0,0,1.2,-3.8,-189.81)"
     enable-background="new"
     id="g301">
    <rect
       x="12"
       y="184"
       width="104"
       height="104"
       rx="8"
       ry="8"
       enable-background="new"
       fill="url(#g)"
       stop-color="#000000"
       style="font-variation-settings:normal;paint-order:normal"
       id="rect281" />
    <circle
       cx="64"
       cy="236"
       r="60"
       enable-background="new"
       fill="url(#g)"
       stop-color="#000000"
       style="font-variation-settings:normal;paint-order:normal"
       id="circle283" />
    <g
       transform="matrix(0.26563,0,0,0.26563,-10.395,230.83)"
       enable-background="new"
       id="g297">
      <ellipse
         cx="280.07999"
         cy="19.474001"
         rx="195.75999"
         ry="195.77"
         enable-background="new"
         style="paint-order:normal"
         id="ellipse285" />
      <circle
         cx="280.07999"
         cy="19.475"
         r="180.71001"
         enable-background="new"
         fill="#2a2a3b"
         style="paint-order:normal"
         id="circle287" />
      <circle
         transform="rotate(90)"
         cx="19.475"
         cy="-280.07999"
         r="165.64999"
         enable-background="new"
         fill="url(#o)"
         style="paint-order:normal"
         id="circle289" />
      <circle
         cx="280"
         cy="20.006001"
         r="0"
         enable-background="new"
         fill="url(#f)"
         style="paint-order:normal"
         id="circle291" />
      <ellipse
         cx="280.07999"
         cy="19.475"
         rx="75.293999"
         ry="75.299004"
         enable-background="new"
         style="paint-order:normal"
         id="ellipse293" />
      <ellipse
         transform="rotate(-15)"
         cx="265.48999"
         cy="91.306"
         rx="60.235001"
         ry="60.238998"
         enable-background="new"
         fill="url(#e)"
         stop-color="#000000"
         style="font-variation-settings:normal;paint-order:normal"
         id="ellipse295" />
    </g>
    <path
       d="M 24,278 A 2,2.0365 0 0 1 22,280.0365 2,2.0365 0 0 1 20,278 2,2.0365 0 0 1 22,275.9635 2,2.0365 0 0 1 24,278 Z m 84,0 a 2,2.0365 0 0 1 -2,2.0365 2,2.0365 0 0 1 -2,-2.0365 2,2.0365 0 0 1 2,-2.0365 2,2.0365 0 0 1 2,2.0365 z m 0,-84 a 2,2.0365 0 0 1 -2,2.0365 2,2.0365 0 0 1 -2,-2.0365 2,2.0365 0 0 1 2,-2.0365 2,2.0365 0 0 1 2,2.0365 z m -84,0 A 2,2.0365 0 0 1 22,196.0365 2,2.0365 0 0 1 20,194 2,2.0365 0 0 1 22,191.9635 2,2.0365 0 0 1 24,194 Z"
       enable-background="new"
       style="paint-order:normal"
       id="path299" />
  </g>
</svg>
