<?xml version="1.0" encoding="UTF-8" standalone="no"?>
<!-- Created with Inkscape (http://www.inkscape.org/) -->

<svg
   xmlns:dc="http://purl.org/dc/elements/1.1/"
   xmlns:cc="http://creativecommons.org/ns#"
   xmlns:rdf="http://www.w3.org/1999/02/22-rdf-syntax-ns#"
   xmlns:svg="http://www.w3.org/2000/svg"
   xmlns="http://www.w3.org/2000/svg"
   xmlns:sodipodi="http://sodipodi.sourceforge.net/DTD/sodipodi-0.dtd"
   xmlns:inkscape="http://www.inkscape.org/namespaces/inkscape"
   width="210mm"
   height="297mm"
   viewBox="0 0 210 297"
   version="1.1"
   id="svg8"
   inkscape:version="0.92.3 (2405546, 2018-03-11)"
   sodipodi:docname="gnome-asia-2018.svg">
  <defs
     id="defs2" />
  <sodipodi:namedview
     id="base"
     pagecolor="#ffffff"
     bordercolor="#666666"
     borderopacity="1.0"
     inkscape:pageopacity="0.0"
     inkscape:pageshadow="2"
     inkscape:zoom="0.35"
     inkscape:cx="90.154432"
     inkscape:cy="384.784"
     inkscape:document-units="mm"
     inkscape:current-layer="layer1"
     showgrid="false"
     inkscape:window-width="2426"
     inkscape:window-height="1329"
     inkscape:window-x="134"
     inkscape:window-y="55"
     inkscape:window-maximized="1" />
  <metadata
     id="metadata5">
    <rdf:RDF>
      <cc:Work
         rdf:about="">
        <dc:format>image/svg+xml</dc:format>
        <dc:type
           rdf:resource="http://purl.org/dc/dcmitype/StillImage" />
        <dc:title />
      </cc:Work>
    </rdf:RDF>
  </metadata>
  <g
     inkscape:label="Layer 1"
     inkscape:groupmode="layer"
     id="layer1">
    <g
       id="g411"
       transform="translate(106.58929,-294.06548)">
      <rect
         style="opacity:0.49000005;fill:#e6e6e6;fill-opacity:1;stroke-width:0.13621093"
         id="rect6471"
         width="82.853561"
         height="53.988453"
         x="-26.994223"
         y="411.10529" />
      <g
         transform="translate(248.74221,106.21968)"
         id="g5813">
        <g
           id="g4941"
           transform="matrix(0.77890298,0,0,0.77890298,-350.50274,292.89876)">
          <path
             style="display:block;fill:#ff6600;stroke:none;stroke-width:0.06796068"
             inkscape:connector-curvature="0"
             d="m 129.61662,30.04019 c -0.18004,1.2605 -3.03346,6.139567 -4.22987,6.892572 3.61109,-0.708932 10.51317,-1.9397 10.51317,-1.9397 l -6.2833,-4.952974 z"
             display="block"
             id="path4892" />
          <path
             style="display:block;fill:#ff6600;fill-opacity:1;stroke:none;stroke-width:0.06796068"
             inkscape:connector-curvature="0"
             d="m 136.23599,39.174546 c 2.09013,0.454386 6.56942,1.859711 7.9779,2.223232 2.68085,1.226827 7.58815,2.998901 8.86038,1.908404 -0.36349,1.590314 -4.13473,0.817873 -6.31593,0.181751 -2.1812,-0.636122 -8.72411,-2.271892 -8.72411,-2.271892 l -1.79831,-2.041471 z"
             display="block"
             id="path4894" />
          <path
             style="display:block;fill:#a94400;fill-opacity:1;stroke:none;stroke-width:0.06796068"
             inkscape:connector-curvature="0"
             d="m 137.51705,33.996181 c 0,0 -7.2001,-3.677692 -7.84232,-3.943419 1.43998,2.348314 3.63317,3.898905 6.24728,4.940402 0.88614,-0.199383 1.57292,-0.97476 1.59507,-0.996915 z"
             display="block"
             id="path4896" />
          <path
             style="display:block;fill:#ff6600;fill-opacity:1;stroke:none;stroke-width:0.06796068"
             inkscape:connector-curvature="0"
             d="m 136.17279,39.143964 c 0,0 -9.45265,1.663134 -11.49725,1.98119 -3.90774,1.908404 -9.49649,2.908038 -11.54108,1.726643 0.13631,2.317323 6.80694,1.280039 13.22243,0.499817 7.18888,-0.87428 12.88602,-1.600134 12.64714,-3.30238 -1.35796,0.566589 -2.30322,-0.47236 -2.8309,-0.905236 z"
             display="block"
             id="path4898" />
          <path
             style="display:block;fill:#ff6600;fill-opacity:1;stroke:none;stroke-width:0.06796068"
             inkscape:connector-curvature="0"
             d="m 125.58431,36.785627 c 0,0 6.77024,-1.272258 8.58785,-1.681211 1.36312,-0.272628 3.18392,-0.939149 3.58968,-1.726643 0.31513,2.315522 -4.80754,3.688905 -5.98665,3.984534 -3.18481,0.79847 -12.86632,2.373255 -12.41574,0.150224 2.04015,0.871256 5.27069,-0.272628 6.22486,-0.727009 z"
             display="block"
             id="path4900" />
          <path
             style="display:block;fill:#a94400;fill-opacity:1;stroke:none;stroke-width:0.07867808"
             inkscape:connector-curvature="0"
             d="m 148.74415,45.849645 c 0,0 1.83654,-0.4744 2.99513,-1.654231 -3.35382,-0.04538 -12.24583,-2.414032 -12.73345,-4.047739 -0.44715,1.974666 -22.81066,4.71885 -24.64152,3.852352 1.89032,1.315956 4.14628,1.668265 4.14628,1.668265 l 19.51015,-1.997501 10.72386,2.17865 z"
             display="block"
             id="path4902" />
          <g
             transform="translate(-1.3274177,1.3676782)"
             style="fill:#a94400;fill-opacity:1;stroke:none"
             id="g4915">
            <path
               transform="matrix(0.03398034,0,0,0.03398034,121.72271,36.613687)"
               id="path4904"
               display="block"
               d="m 700.9528,86.490856 c 0,0 104.3,-9.3603 129.71,-44.127 -73.545,-1.3372 -285.22,-81.356 -319.51,-175.049996 7.1127,92.649996 -474.500003,167.719996 -515.9500026,146.329996 41.4529996,38.778 133.4400026,59.478 133.4400026,59.478 l 335.63,-65.5219996 236.68,78.8939996 z"
               inkscape:connector-curvature="0"
               style="display:block;fill:#a94400;fill-opacity:1;stroke:none;stroke-width:2" />
          </g>
        </g>
        <g
           id="text4516"
           style="font-style:normal;font-variant:normal;font-weight:normal;font-stretch:normal;font-size:4.41995668px;line-height:1.25;font-family:'Rock Salt';-inkscape-font-specification:'Rock Salt, Normal';font-variant-ligatures:normal;font-variant-caps:normal;font-variant-numeric:normal;font-feature-settings:normal;text-align:start;letter-spacing:0px;word-spacing:0px;writing-mode:lr-tb;text-anchor:start;fill:#ff6600;fill-opacity:1;stroke:none;stroke-width:0.11049938"
           aria-label="Summit 2018"
           transform="translate(-279.65554,72.223131)">
          <path
             id="path4570"
             style="font-style:normal;font-variant:normal;font-weight:normal;font-stretch:normal;font-size:4.41995668px;font-family:'Rock Salt';-inkscape-font-specification:'Rock Salt, Normal';font-variant-ligatures:normal;font-variant-caps:normal;font-variant-numeric:normal;font-feature-settings:normal;text-align:start;writing-mode:lr-tb;text-anchor:start;fill:#ff6600;fill-opacity:1;stroke-width:0.11049938"
             d="m 31.469432,269.14468 q 0,0.0432 -0.0043,0.0647 -0.02158,0.009 -0.03453,0.0259 -0.01295,0.0129 -0.04316,0.009 -0.0086,0.0648 -0.04316,0.10791 -0.03453,0.0432 -0.07338,0.0777 -0.03453,0.0388 -0.06906,0.0777 -0.03453,0.0432 -0.04316,0.10791 -0.06475,0.0345 -0.129491,0.0906 -0.06043,0.0604 -0.107909,0.082 -0.03453,0.0173 -0.07338,0.0259 -0.03885,0.0129 -0.07769,0.0302 -0.125174,0.0561 -0.258982,0.11654 -0.129491,0.0604 -0.271931,0.0604 h -0.03021 q -0.01727,0.0173 -0.04316,0.0216 -0.0259,0.009 -0.0518,0.0129 -0.0259,0.004 -0.0518,0.0129 -0.0259,0.009 -0.03885,0.0259 -0.04748,-0.0173 -0.103593,-0.0173 h -0.03021 q -0.07338,0.0173 -0.138124,0.0259 -0.06474,0.009 -0.138123,0.009 -0.129491,0 -0.258982,-0.0173 -0.129491,-0.0173 -0.258982,-0.0302 -0.08201,-0.0647 -0.133807,-0.16402 -0.0518,-0.095 -0.0518,-0.20287 0,-0.082 0.03453,-0.15539 0.03453,-0.0691 0.09064,-0.12517 h 0.01295 q 0.03885,0 0.0777,-0.0173 0.04316,-0.0173 0.08201,-0.0173 0.04316,0 0.06906,0.0345 0.03021,0.0345 0.04316,0.082 0.01726,0.0475 0.02158,0.095 0.0043,0.0518 0.0043,0.082 0.04748,0.0216 0.09928,0.0259 0.05611,0.004 0.112226,0.004 0.05611,0 0.125174,-0.009 0.06906,-0.004 0.138124,-0.0216 0.07338,-0.0129 0.138124,-0.0345 0.06906,-0.0216 0.116542,-0.0561 0.2374,-0.0216 0.418687,-0.10791 0.181287,-0.0863 0.384156,-0.20287 0.0086,-0.0475 0.03453,-0.0734 0.03021,-0.0302 0.03021,-0.0863 0,-0.009 -0.0043,-0.0173 0,-0.0129 0,-0.0216 -0.08633,-0.10791 -0.181287,-0.18992 -0.09064,-0.082 -0.2374,-0.10791 -0.01727,-0.0388 -0.05611,-0.0561 -0.03885,-0.0216 -0.08201,-0.0388 -0.04316,-0.0173 -0.08201,-0.0345 -0.03885,-0.0216 -0.05611,-0.0691 -0.116542,-0.0216 -0.241717,-0.0518 -0.120858,-0.0345 -0.207185,-0.12086 -0.06906,-0.004 -0.133807,-0.0259 -0.06043,-0.0259 -0.120859,-0.0475 -0.06043,-0.0259 -0.125174,-0.0432 -0.06475,-0.0216 -0.133807,-0.0216 -0.01727,-0.0302 -0.04748,-0.0475 -0.03021,-0.0173 -0.06906,-0.0302 -0.03453,-0.0129 -0.06906,-0.0259 -0.03021,-0.0173 -0.04748,-0.0475 -0.01727,0.004 -0.0259,0.0173 -0.0086,0.0129 -0.03022,0.0129 h -0.01726 q -0.0086,-0.0259 -0.03453,-0.0345 -0.0259,-0.0129 -0.03021,-0.0475 -0.07769,-0.004 -0.14244,-0.0302 -0.06043,-0.0259 -0.116542,-0.0561 -0.0518,-0.0345 -0.107909,-0.0648 -0.05611,-0.0302 -0.125174,-0.0475 -0.04316,-0.0345 -0.08201,-0.0734 -0.03453,-0.0432 -0.09064,-0.0432 -0.01295,0 -0.04748,0.009 -0.0086,-0.0777 -0.06475,-0.10791 -0.05611,-0.0345 -0.120858,-0.0604 -0.04316,-0.11223 -0.116542,-0.19856 -0.07338,-0.0863 -0.159706,-0.1597 0.0086,-0.0259 0.0086,-0.0389 0,-0.0432 -0.02158,-0.0734 -0.02158,-0.0345 -0.04748,-0.0561 -0.06043,-0.19424 -0.06043,-0.37984 0,-0.25898 0.116542,-0.47912 0.112225,-0.22445 0.358258,-0.33667 0.0043,-0.0345 0.02158,-0.0604 0.02158,-0.0259 0.0259,-0.0604 0.03885,0 0.06043,-0.0173 0.02158,-0.0173 0.03885,-0.0345 0.02158,-0.0216 0.04316,-0.0388 0.02158,-0.0173 0.05611,-0.0216 0.164022,-0.14244 0.349625,-0.22876 0.185604,-0.0906 0.37984,-0.18561 0.03885,-0.0173 0.06475,-0.0647 h 0.0259 q 0.04316,0 0.06475,-0.0173 0.0259,-0.0216 0.07338,-0.0129 0.01727,-0.0259 0.04316,-0.0345 0.03022,-0.009 0.05611,-0.0129 0.03022,-0.009 0.05611,-0.0216 0.0259,-0.0129 0.03453,-0.0388 h 0.03021 q 0.07338,0 0.14244,-0.0216 0.06906,-0.0259 0.138124,-0.0561 h 0.03021 q 0.08633,0 0.159706,-0.0302 0.07769,-0.0345 0.164022,-0.0475 0.03453,-0.009 0.06906,-0.004 0.03453,0.004 0.06906,0.004 0.02158,0 0.0518,-0.004 0.03021,-0.004 0.04316,-0.0259 h 0.0086 q 0.0259,0 0.03022,0.0173 0.0043,0.0173 0.0259,0.0173 0.03021,0 0.06043,-0.009 0.03022,-0.009 0.06043,-0.009 0.129491,0 0.254666,0.0259 0.12949,0.0259 0.254665,0.0475 0.0086,0.0518 0.04316,0.0734 0.03885,0.0216 0.08201,0.0389 v 0.0173 q 0,0.0345 0.01727,0.0561 -0.01727,0.0604 -0.06043,0.0906 -0.04316,0.0302 -0.09496,0.0518 0.02158,0.0173 0.0259,0.0475 0.0043,0.0302 0.0043,0.0561 v 0.0518 l -0.02158,-0.004 q -0.06906,0 -0.06906,0.0647 -0.05611,-0.0345 -0.125175,-0.0432 -0.06474,-0.009 -0.129491,-0.009 -0.08633,0 -0.181287,0.009 -0.09496,0.004 -0.185604,-0.004 -0.03453,0.0432 -0.08633,0.0648 -0.0518,0.0173 -0.103593,0.0173 -0.05611,0 -0.107909,-0.0216 -0.0518,-0.0259 -0.07338,-0.0734 -0.02158,-0.009 -0.03885,-0.009 h -0.03885 q -0.06906,0 -0.138124,0.0173 -0.06475,0.0129 -0.133807,0.0345 -0.06906,0.0173 -0.138124,0.0389 -0.06475,0.0173 -0.133807,0.0216 -0.0259,0.0345 -0.06906,0.0475 -0.04316,0.013 -0.06906,0.0475 -0.09064,0.0173 -0.164022,0.0604 -0.07338,0.0388 -0.14244,0.0863 l -0.133807,0.0907 q -0.06475,0.0432 -0.146756,0.0734 -0.06043,0.0647 -0.112226,0.10359 -0.0518,0.0388 -0.133807,0.0691 -0.0518,0.0173 -0.06043,0.0518 -0.0043,0.0345 -0.03453,0.0691 -0.0259,0.0302 -0.06475,0.0475 -0.03453,0.0129 -0.06043,0.0475 -0.02158,0.0302 -0.03453,0.0734 -0.0086,0.0388 -0.02158,0.0777 -0.01295,0.0389 -0.03021,0.0777 -0.01727,0.0345 -0.0518,0.0604 0,0.0173 -0.0043,0.0345 0,0.0173 0,0.0302 0,0.0604 0.01295,0.12518 0.01727,0.0604 0.02158,0.12085 0.08633,0.15108 0.202869,0.27625 0.116542,0.12086 0.250349,0.22445 0.133808,0.10359 0.276248,0.19424 0.146756,0.0906 0.289196,0.17697 0.0518,-0.004 0.09496,0.0129 0.04316,0.013 0.09064,0.0173 0.0518,0.0389 0.120858,0.0604 l 0.138124,0.0432 q 0.06906,0.0216 0.133807,0.0518 0.06474,0.0259 0.107909,0.0734 0.02158,0.004 0.03885,0.0129 0.01727,0.004 0.03885,0.004 0.0259,0 0.03021,-0.0173 0.194236,0.0734 0.37984,0.16402 0.185604,0.0863 0.392789,0.13381 0.08201,0.0691 0.181287,0.12086 0.09928,0.0518 0.198553,0.10791 0.09928,0.0518 0.18992,0.11654 0.09064,0.0604 0.159706,0.14676 0.0086,0.082 0.03453,0.1597 0.03021,0.0734 0.03021,0.15971 z"
             inkscape:connector-curvature="0" />
          <path
             id="path4572"
             style="font-style:normal;font-variant:normal;font-weight:normal;font-stretch:normal;font-size:4.41995668px;font-family:'Rock Salt';-inkscape-font-specification:'Rock Salt, Normal';font-variant-ligatures:normal;font-variant-caps:normal;font-variant-numeric:normal;font-feature-settings:normal;text-align:start;writing-mode:lr-tb;text-anchor:start;fill:#ff6600;fill-opacity:1;stroke-width:0.11049938"
             d="m 34.391611,268.60513 q -0.01727,0.0648 -0.05611,0.10791 -0.03885,0.0432 -0.09064,0.0777 -0.04748,0.0345 -0.103593,0.0647 -0.05611,0.0259 -0.107909,0.0604 h -0.05611 q -0.181288,0 -0.280564,-0.0863 -0.09496,-0.0906 -0.146756,-0.22013 -0.0518,-0.13381 -0.07769,-0.28488 -0.02158,-0.15108 -0.05611,-0.27625 -0.0518,0.0432 -0.08633,0.10359 -0.03453,0.0561 -0.07338,0.11223 -0.03453,0.0561 -0.08201,0.10359 -0.04316,0.0475 -0.116542,0.0648 -0.01295,0.0302 -0.03021,0.0604 -0.01295,0.0302 -0.01727,0.0647 -0.09496,0.0518 -0.172654,0.12086 -0.07769,0.0691 -0.15539,0.14244 -0.07769,0.0734 -0.159705,0.14244 -0.07769,0.0648 -0.176971,0.10791 -0.0043,-0.004 -0.01727,-0.004 -0.0518,0 -0.09496,0.0259 -0.04316,0.0216 -0.09496,0.0216 -0.03453,0 -0.06475,-0.0129 -0.0259,-0.013 -0.05611,-0.0302 -0.0259,-0.0173 -0.05611,-0.0259 -0.03021,-0.009 -0.06475,-0.004 -0.04316,-0.0777 -0.116542,-0.14244 -0.06906,-0.0691 -0.08633,-0.15538 -0.0086,-0.0389 -0.01295,-0.0777 0,-0.0432 -0.0086,-0.0863 -0.01295,-0.0647 -0.03453,-0.12949 -0.02158,-0.0691 -0.03453,-0.13812 0.02158,-0.11654 0.04316,-0.25467 0.01727,-0.14244 0.04316,-0.28056 0.03021,-0.14244 0.07769,-0.26762 0.0518,-0.12949 0.129491,-0.22013 l -0.0043,-0.0302 q 0,-0.0691 0.0259,-0.1295 0.0259,-0.0604 0.05611,-0.11654 0.03021,-0.0561 0.0518,-0.11222 0.02158,-0.0561 0.0086,-0.12518 0.0518,-0.0259 0.107909,-0.0432 0.05611,-0.0173 0.116542,-0.0173 0.05611,0 0.103592,0.0173 -0.0086,0.0345 0.03022,0.0432 v 0.0129 q 0,0.0906 -0.02158,0.17697 -0.02158,0.0863 -0.0518,0.17266 -0.03021,0.082 -0.06043,0.16834 -0.0259,0.082 -0.03885,0.16833 -0.01726,0.004 -0.0259,0.0173 -0.0043,0.0129 -0.0086,0.0259 -0.0043,0.0129 -0.01295,0.0216 -0.0086,0.009 -0.0259,0.009 -0.0259,0.15107 -0.05611,0.30215 -0.0259,0.14675 -0.0259,0.29783 0,0.0906 0.01727,0.1856 0.01727,0.095 0.06475,0.18129 l 0.01727,-0.004 q 0.04748,0 0.07338,0.0216 0.03021,0.0216 0.07769,0.0432 0.03453,-0.009 0.06475,-0.0216 0.03021,-0.0173 0.0259,-0.0561 0.05611,-0.004 0.09496,-0.0259 0.03885,-0.0259 0.06906,-0.0561 l 0.06475,-0.0604 q 0.03453,-0.0302 0.08201,-0.0432 0,-0.0259 0.01295,-0.0389 l 0.0259,-0.0259 q 0.01295,-0.0129 0.01726,-0.0259 0.0086,-0.0173 0.0043,-0.0475 0.0518,-0.004 0.07769,-0.0259 0.03021,-0.0216 0.0518,-0.0475 0.0259,-0.0302 0.04748,-0.0604 0.02158,-0.0302 0.05611,-0.0518 0.03021,-0.0647 0.08201,-0.17265 0.05611,-0.10791 0.107909,-0.22445 0.05611,-0.11655 0.09496,-0.22014 0.04316,-0.10791 0.04316,-0.16402 0,-0.0216 -0.01295,-0.0389 -0.0086,-0.0173 -0.0043,-0.0388 v -0.0129 q 0.03453,-0.0432 0.06043,-0.095 0.03022,-0.0518 0.06043,-0.0993 0.03453,-0.0475 0.07338,-0.0863 0.03885,-0.0389 0.09928,-0.0604 0.06906,0.0216 0.138124,0.0302 0.07338,0.009 0.138123,0.0345 0.0043,0.10791 0.02158,0.25035 0.01727,0.14244 0.06043,0.24171 0,0.0561 -0.0043,0.10791 0,0.0518 0,0.1036 0,0.0863 0.0043,0.17697 0.0086,0.0906 0.03021,0.16833 -0.03021,0.0647 -0.03021,0.13813 0,0.0993 0.03021,0.18992 0.03021,0.0863 0.04316,0.1856 0.05611,0.0777 0.146757,0.0777 0.02158,0 0.03453,-0.004 0.01726,-0.004 0.03453,-0.0129 0.03453,0.0388 0.06043,0.0777 0.03021,0.0345 0.06906,0.0647 z"
             inkscape:connector-curvature="0" />
          <path
             id="path4574"
             style="font-style:normal;font-variant:normal;font-weight:normal;font-stretch:normal;font-size:4.41995668px;font-family:'Rock Salt';-inkscape-font-specification:'Rock Salt, Normal';font-variant-ligatures:normal;font-variant-caps:normal;font-variant-numeric:normal;font-feature-settings:normal;text-align:start;writing-mode:lr-tb;text-anchor:start;fill:#ff6600;fill-opacity:1;stroke-width:0.11049938"
             d="m 38.686393,268.76052 q -0.02158,0.0691 -0.01295,0.13812 -0.01295,0.0173 -0.03021,0.0216 -0.01727,0.004 -0.03453,0.0129 -0.01726,0.004 -0.03021,0.0173 -0.0086,0.009 0,0.0388 -0.14244,0.009 -0.27193,0.0604 -0.129491,0.0518 -0.254666,0.11222 -0.06475,-0.0216 -0.112225,-0.0518 -0.04748,-0.0302 -0.120859,-0.0388 -0.07338,-0.14676 -0.138123,-0.30646 -0.06043,-0.16402 -0.06043,-0.32805 0,-0.12086 0.04316,-0.22013 0,-0.12949 0.02158,-0.25467 0.02158,-0.12517 0.04748,-0.24603 0.03021,-0.12517 0.0518,-0.25035 0.02158,-0.12517 0.02158,-0.25466 v -0.095 q -0.0086,0 -0.02158,0.0216 -0.01295,0.0173 -0.0259,0.0432 -0.0086,0.0216 -0.01727,0.0432 -0.0086,0.0216 -0.01295,0.0259 -0.07338,0.0561 -0.116542,0.14244 -0.03885,0.082 -0.08633,0.15539 -0.06043,0.0906 -0.129491,0.17697 -0.06475,0.0863 -0.164022,0.13381 v 0.009 q 0,0.0216 -0.01295,0.0302 -0.01295,0.009 -0.0043,0.0432 -0.107909,0.0345 -0.202869,0.0993 -0.09064,0.0647 -0.151072,0.16402 -0.08633,0.0216 -0.164022,0.0604 -0.07338,0.0345 -0.151073,0.0777 -0.03453,0.0173 -0.07338,0.0432 -0.03885,0.0259 -0.0777,0.0345 -0.03453,0.0129 -0.09496,0.0173 -0.05611,0.004 -0.120858,0.009 -0.06043,0.004 -0.120858,0.004 h -0.09496 q -0.02158,0 -0.05611,-0.0216 -0.03453,-0.0216 -0.07769,-0.0475 -0.03885,-0.0259 -0.08201,-0.0475 -0.04316,-0.0259 -0.08201,-0.0345 -0.03453,-0.11223 -0.09928,-0.19855 -0.06043,-0.0906 -0.129491,-0.18129 -0.02158,-0.10359 -0.06043,-0.21582 -0.03453,-0.11222 -0.125174,-0.1856 0.02158,-0.0302 0.02158,-0.0691 0,-0.0475 -0.02158,-0.0906 -0.02158,-0.0432 -0.02158,-0.095 0,-0.0345 0.0043,-0.0518 -0.04748,0.0518 -0.06906,0.1338 -0.01727,0.0777 -0.01727,0.14244 0,0.0518 0.01295,0.095 -0.04316,0.0604 -0.05611,0.15108 -0.0086,0.0906 -0.0086,0.1597 0,0.0863 0.01295,0.16834 -0.06906,0.0691 -0.06906,0.16834 0,0.0561 0.0259,0.0993 0,0.0173 -0.0086,0.0259 -0.0086,0.009 -0.02158,0.0129 -0.0086,0.004 -0.02158,0.0129 -0.0086,0.004 -0.0086,0.0216 0,0.0216 0,0.0475 0.0043,0.0259 0.0043,0.0518 0,0.0604 -0.0043,0.12517 -0.0043,0.0648 -0.0043,0.12518 0,0.12517 0.02158,0.18129 0.0259,0.0518 0.06043,0.0777 0.03885,0.0259 0.08201,0.0518 0.04316,0.0259 0.08633,0.0993 -0.01295,0.0388 -0.04748,0.0648 -0.03021,0.0216 -0.06043,0.0475 -0.0259,0.0216 -0.04748,0.0518 -0.02158,0.0302 -0.01727,0.0863 h -0.02158 q -0.05611,0 -0.107909,0.0173 -0.0518,0.0173 -0.107909,0.0173 -0.01295,0 -0.0259,-0.004 -0.01295,0 -0.0259,0 l -0.04316,-0.0259 q -0.02158,-0.0129 -0.04316,-0.0129 -0.02158,0 -0.05611,0.009 -0.06043,-0.19423 -0.09496,-0.40142 -0.03021,-0.20719 -0.03021,-0.40574 0,-0.0216 0.0086,-0.0432 0.01295,-0.0259 0.03453,-0.0173 v -0.082 q 0,-0.13381 0.02158,-0.25898 0.0259,-0.12949 0.0259,-0.26762 0,-0.0388 -0.0043,-0.0777 0,-0.0389 -0.0043,-0.0734 0.02158,-0.0734 0.04316,-0.14675 0.0259,-0.0777 0.0259,-0.15971 0,-0.0345 -0.01295,-0.082 0.03453,-0.0259 0.0518,-0.0648 0.01727,-0.0432 0.0259,-0.0906 0.0086,-0.0518 0.01295,-0.0993 0.0043,-0.0475 0.0086,-0.0863 0.04316,-0.0863 0.04748,-0.18561 0.0043,-0.0993 0.04316,-0.1856 -0.0043,-0.0173 -0.0043,-0.0604 0,-0.0863 0.0259,-0.17265 0.03021,-0.0907 0.116542,-0.13813 0.07769,0.0302 0.181287,0.0302 0.09928,0 0.18992,-0.0302 0.0259,0.009 0.04748,0.0216 0.02158,0.009 0.04316,0.0216 0.0259,0.009 0.0518,0.0173 0.0259,0.004 0.06043,0 0.04316,0.12518 0.07338,0.25467 0.03453,0.12949 0.0518,0.26329 0.0086,0.0561 0.0043,0.12086 0,0.0648 0.0086,0.12086 0.0043,0.0345 0.02158,0.0648 0.01726,0.0259 0.03453,0.0604 0.01727,0.0345 0.0259,0.0777 0.01295,0.0432 0.0086,0.10791 0.04748,0.11222 0.103593,0.21582 0.06043,0.0993 0.129491,0.19855 0.03885,0.0129 0.06906,0.0345 0.03021,0.0173 0.03885,0.0604 0.03885,0 0.06906,0.013 l 0.07338,0.0216 q 0.164022,-0.0518 0.302146,-0.13812 0.14244,-0.0863 0.297829,-0.14676 0.18992,-0.1856 0.328043,-0.41005 0.138124,-0.22877 0.276248,-0.45322 v -0.095 q 0.0259,-0.0129 0.04316,-0.0302 0.02158,-0.0216 0.0518,-0.0302 0.0043,-0.0518 0.02158,-0.0993 0.02158,-0.0518 0.04316,-0.095 0.0259,-0.0475 0.04316,-0.0906 0.01726,-0.0475 0.01726,-0.0993 0,-0.0302 -0.0043,-0.0518 0.06475,-0.0648 0.155389,-0.0648 0.08633,0 0.172655,0.0432 0.09064,0.0389 0.168338,0.0734 0.04748,0.1036 0.06906,0.22014 0.0259,0.11222 0.03453,0.23308 0.0086,0.12086 0.0086,0.24172 v 0.30646 q -0.0043,0.0345 -0.0259,0.0518 -0.01727,0.0129 -0.0259,0.0432 v 0.0432 q 0,0.0216 -0.0043,0.0432 0,0.0906 -0.02158,0.18992 -0.02158,0.12517 -0.05611,0.25466 -0.03022,0.12518 -0.03022,0.25467 0,0.0475 0.0043,0.095 0.0043,0.0475 0.01727,0.095 -0.02158,0.0388 -0.02158,0.0993 0,0.0691 0.02158,0.1295 0.0259,0.0561 0.06043,0.11222 0.06043,0 0.120858,-0.004 0.06043,-0.004 0.125175,-0.004 0.06043,0 0.112225,0.0129 0.0518,0.009 0.10791,0.0432 z"
             inkscape:connector-curvature="0" />
          <path
             id="path4576"
             style="font-style:normal;font-variant:normal;font-weight:normal;font-stretch:normal;font-size:4.41995668px;font-family:'Rock Salt';-inkscape-font-specification:'Rock Salt, Normal';font-variant-ligatures:normal;font-variant-caps:normal;font-variant-numeric:normal;font-feature-settings:normal;text-align:start;writing-mode:lr-tb;text-anchor:start;fill:#ff6600;fill-opacity:1;stroke-width:0.11049938"
             d="m 42.985492,268.76052 q -0.02158,0.0691 -0.01295,0.13812 -0.01295,0.0173 -0.03021,0.0216 -0.01727,0.004 -0.03453,0.0129 -0.01727,0.004 -0.03022,0.0173 -0.0086,0.009 0,0.0388 -0.14244,0.009 -0.271931,0.0604 -0.12949,0.0518 -0.254665,0.11222 -0.06475,-0.0216 -0.112225,-0.0518 -0.04748,-0.0302 -0.120859,-0.0388 -0.07338,-0.14676 -0.138123,-0.30646 -0.06043,-0.16402 -0.06043,-0.32805 0,-0.12086 0.04316,-0.22013 0,-0.12949 0.02158,-0.25467 0.02158,-0.12517 0.04748,-0.24603 0.03022,-0.12517 0.0518,-0.25035 0.02158,-0.12517 0.02158,-0.25466 v -0.095 q -0.0086,0 -0.02158,0.0216 -0.01295,0.0173 -0.0259,0.0432 -0.0086,0.0216 -0.01727,0.0432 -0.0086,0.0216 -0.01295,0.0259 -0.07338,0.0561 -0.116542,0.14244 -0.03885,0.082 -0.08633,0.15539 -0.06043,0.0906 -0.129491,0.17697 -0.06475,0.0863 -0.164022,0.13381 v 0.009 q 0,0.0216 -0.01295,0.0302 -0.01295,0.009 -0.0043,0.0432 -0.107909,0.0345 -0.202869,0.0993 -0.09064,0.0647 -0.151072,0.16402 -0.08633,0.0216 -0.164022,0.0604 -0.07338,0.0345 -0.151073,0.0777 -0.03453,0.0173 -0.07338,0.0432 -0.03885,0.0259 -0.07769,0.0345 -0.03453,0.0129 -0.09496,0.0173 -0.05611,0.004 -0.120858,0.009 -0.06043,0.004 -0.120858,0.004 h -0.09496 q -0.02158,0 -0.05611,-0.0216 -0.03453,-0.0216 -0.07769,-0.0475 -0.03885,-0.0259 -0.08201,-0.0475 -0.04316,-0.0259 -0.08201,-0.0345 -0.03453,-0.11223 -0.09928,-0.19855 -0.06043,-0.0906 -0.129491,-0.18129 -0.02158,-0.10359 -0.06043,-0.21582 -0.03453,-0.11222 -0.125174,-0.1856 0.02158,-0.0302 0.02158,-0.0691 0,-0.0475 -0.02158,-0.0906 -0.02158,-0.0432 -0.02158,-0.095 0,-0.0345 0.0043,-0.0518 -0.04748,0.0518 -0.06906,0.1338 -0.01727,0.0777 -0.01727,0.14244 0,0.0518 0.01295,0.095 -0.04316,0.0604 -0.05611,0.15108 -0.0086,0.0906 -0.0086,0.1597 0,0.0863 0.01295,0.16834 -0.06906,0.0691 -0.06906,0.16834 0,0.0561 0.0259,0.0993 0,0.0173 -0.0086,0.0259 -0.0086,0.009 -0.02158,0.0129 -0.0086,0.004 -0.02158,0.0129 -0.0086,0.004 -0.0086,0.0216 0,0.0216 0,0.0475 0.0043,0.0259 0.0043,0.0518 0,0.0604 -0.0043,0.12517 -0.0043,0.0648 -0.0043,0.12518 0,0.12517 0.02158,0.18129 0.0259,0.0518 0.06043,0.0777 0.03885,0.0259 0.08201,0.0518 0.04316,0.0259 0.08633,0.0993 -0.01295,0.0388 -0.04748,0.0648 -0.03021,0.0216 -0.06043,0.0475 -0.0259,0.0216 -0.04748,0.0518 -0.02158,0.0302 -0.01727,0.0863 h -0.02158 q -0.05611,0 -0.107909,0.0173 -0.0518,0.0173 -0.107909,0.0173 -0.01295,0 -0.0259,-0.004 -0.01295,0 -0.0259,0 l -0.04316,-0.0259 q -0.02158,-0.0129 -0.04316,-0.0129 -0.02158,0 -0.05611,0.009 -0.06043,-0.19423 -0.09496,-0.40142 -0.03021,-0.20719 -0.03021,-0.40574 0,-0.0216 0.0086,-0.0432 0.01295,-0.0259 0.03453,-0.0173 v -0.082 q 0,-0.13381 0.02158,-0.25898 0.0259,-0.12949 0.0259,-0.26762 0,-0.0388 -0.0043,-0.0777 0,-0.0389 -0.0043,-0.0734 0.02158,-0.0734 0.04316,-0.14675 0.0259,-0.0777 0.0259,-0.15971 0,-0.0345 -0.01295,-0.082 0.03453,-0.0259 0.0518,-0.0648 0.01727,-0.0432 0.0259,-0.0906 0.0086,-0.0518 0.01295,-0.0993 0.0043,-0.0475 0.0086,-0.0863 0.04316,-0.0863 0.04748,-0.18561 0.0043,-0.0993 0.04316,-0.1856 -0.0043,-0.0173 -0.0043,-0.0604 0,-0.0863 0.0259,-0.17265 0.03021,-0.0907 0.116542,-0.13813 0.07769,0.0302 0.181287,0.0302 0.09928,0 0.18992,-0.0302 0.0259,0.009 0.04748,0.0216 0.02158,0.009 0.04316,0.0216 0.0259,0.009 0.0518,0.0173 0.0259,0.004 0.06043,0 0.04316,0.12518 0.07338,0.25467 0.03453,0.12949 0.0518,0.26329 0.0086,0.0561 0.0043,0.12086 0,0.0648 0.0086,0.12086 0.0043,0.0345 0.02158,0.0648 0.01727,0.0259 0.03453,0.0604 0.01727,0.0345 0.0259,0.0777 0.01295,0.0432 0.0086,0.10791 0.04748,0.11222 0.103593,0.21582 0.06043,0.0993 0.129491,0.19855 0.03885,0.0129 0.06906,0.0345 0.03021,0.0173 0.03885,0.0604 0.03885,0 0.06906,0.013 l 0.07338,0.0216 q 0.164022,-0.0518 0.302146,-0.13812 0.14244,-0.0863 0.297829,-0.14676 0.18992,-0.1856 0.328043,-0.41005 0.138124,-0.22877 0.276248,-0.45322 v -0.095 q 0.0259,-0.0129 0.04316,-0.0302 0.02158,-0.0216 0.0518,-0.0302 0.0043,-0.0518 0.02158,-0.0993 0.02158,-0.0518 0.04316,-0.095 0.0259,-0.0475 0.04316,-0.0906 0.01727,-0.0475 0.01727,-0.0993 0,-0.0302 -0.0043,-0.0518 0.06475,-0.0648 0.155389,-0.0648 0.08633,0 0.172654,0.0432 0.09064,0.0389 0.168339,0.0734 0.04748,0.1036 0.06906,0.22014 0.0259,0.11222 0.03453,0.23308 0.0086,0.12086 0.0086,0.24172 v 0.30646 q -0.0043,0.0345 -0.0259,0.0518 -0.01727,0.0129 -0.0259,0.0432 v 0.0432 q 0,0.0216 -0.0043,0.0432 0,0.0906 -0.02158,0.18992 -0.02158,0.12517 -0.05611,0.25466 -0.03021,0.12518 -0.03021,0.25467 0,0.0475 0.0043,0.095 0.0043,0.0475 0.01726,0.095 -0.02158,0.0388 -0.02158,0.0993 0,0.0691 0.02158,0.1295 0.0259,0.0561 0.06043,0.11222 0.06043,0 0.120858,-0.004 0.06043,-0.004 0.125175,-0.004 0.06043,0 0.112225,0.0129 0.0518,0.009 0.10791,0.0432 z"
             inkscape:connector-curvature="0" />
          <path
             id="path4578"
             style="font-style:normal;font-variant:normal;font-weight:normal;font-stretch:normal;font-size:4.41995668px;font-family:'Rock Salt';-inkscape-font-specification:'Rock Salt, Normal';font-variant-ligatures:normal;font-variant-caps:normal;font-variant-numeric:normal;font-feature-settings:normal;text-align:start;writing-mode:lr-tb;text-anchor:start;fill:#ff6600;fill-opacity:1;stroke-width:0.11049938"
             d="m 44.064582,268.71304 q -0.02158,0.0345 -0.0518,0.0648 -0.03021,0.0259 -0.05611,0.0561 -0.03022,0.0129 -0.06906,0.0129 -0.03453,0 -0.06906,0 -0.03021,-0.004 -0.06043,0 -0.0259,0 -0.04316,0.0173 -0.03453,-0.009 -0.0518,-0.0302 -0.01726,-0.0259 -0.06043,-0.0302 -0.01727,-0.004 -0.03453,0 -0.06474,-0.0734 -0.120858,-0.15538 -0.0518,-0.082 -0.09928,-0.15539 -0.0043,-0.15971 -0.0259,-0.32373 -0.0043,-0.0388 -0.01295,-0.0777 -0.0086,-0.0388 -0.01295,-0.0734 0,-0.0432 0.0043,-0.082 0.0086,-0.0432 0.01295,-0.0777 0.01727,-0.12517 0.03885,-0.24603 0.02158,-0.12086 0.03885,-0.24604 0.01727,-0.11222 0.01727,-0.23308 0,-0.12517 -0.03885,-0.23308 l -0.0043,-0.0216 q 0.0086,-0.0345 0.01727,-0.0561 0.01295,-0.0259 0.01727,-0.0561 0.0086,-0.0475 -0.02158,-0.0691 0.01295,-0.0345 0.04316,-0.0432 0.03021,-0.0129 0.03453,-0.0518 0.0043,-0.0173 0,-0.0345 0.03453,-0.0129 0.06906,-0.0216 0.03885,-0.0129 0.07338,-0.004 0.05611,0.009 0.09928,0.0389 0.04316,0.0259 0.08201,0.0604 0.06906,0.20718 0.05611,0.44026 -0.01295,0.22877 -0.04316,0.46186 -0.03021,0.23308 -0.03885,0.45753 -0.0086,0.22013 0.06906,0.41005 l 0.0086,0.004 q 0.02158,0.004 0.03453,-0.0129 0.01295,-0.0216 0.03453,-0.0173 0.01727,0.009 0.02158,0.009 0.01727,0.0863 0.05611,0.16402 0.03885,0.0777 0.08633,0.15539 z"
             inkscape:connector-curvature="0" />
          <path
             id="path4580"
             style="font-style:normal;font-variant:normal;font-weight:normal;font-stretch:normal;font-size:4.41995668px;font-family:'Rock Salt';-inkscape-font-specification:'Rock Salt, Normal';font-variant-ligatures:normal;font-variant-caps:normal;font-variant-numeric:normal;font-feature-settings:normal;text-align:start;writing-mode:lr-tb;text-anchor:start;fill:#ff6600;fill-opacity:1;stroke-width:0.11049938"
             d="m 48.195342,266.52896 q -0.01726,0.0561 -0.05611,0.10359 l -0.07338,0.0907 q -0.03453,0.0432 -0.06043,0.095 -0.02158,0.0475 -0.01295,0.11222 -0.0086,0 -0.02158,0 -0.01295,-0.004 -0.02158,-0.004 -0.06906,0 -0.107909,0.0345 -0.03453,0.0302 -0.09496,0.0518 -0.0086,-0.0259 -0.02158,-0.0475 -0.01295,-0.0259 -0.03885,-0.0345 -0.103592,0.0216 -0.207185,0.0345 -0.103593,0.009 -0.207186,0.0259 -0.04748,0.009 -0.09496,0.0259 -0.04748,0.0129 -0.09928,0.0259 -0.0259,0.009 -0.05611,0.009 -0.03021,-0.004 -0.06043,0 -0.103593,0.004 -0.224451,0.0173 -0.120858,0.009 -0.215818,0.0647 -0.04316,-0.009 -0.09064,-0.0129 -0.04748,-0.004 -0.09496,-0.004 -0.103592,0 -0.228767,0.0216 -0.120858,0.0173 -0.215818,0.0734 -0.02158,-0.009 -0.04748,-0.013 -0.02158,-0.004 -0.0518,-0.004 -0.0086,0 -0.01295,0.004 -0.0043,0 -0.01295,0 -0.0043,0.0388 0.0086,0.0777 0.01727,0.0345 0.05611,0.0561 -0.01727,0.0475 -0.01727,0.1036 0,0.0734 0.0086,0.14675 0.01295,0.0734 0.01295,0.14676 0,0.082 -0.02158,0.12949 0.04316,0.12949 0.04316,0.27625 0,0.0518 -0.0086,0.10359 -0.0043,0.0475 -0.0043,0.10359 0,0.0475 0.03453,0.0777 0.03453,0.0259 0.03453,0.0734 0,0.0173 -0.0086,0.0345 0.06043,-0.0129 0.116542,-0.0345 0.05611,-0.0259 0.116542,-0.0259 0.03453,0 0.06475,0.0129 0.03453,0.0129 0.06043,0.0345 -0.0043,0.0216 -0.0086,0.0475 0,0.0259 0,0.0518 0,0.0475 0,0.0906 0.0043,0.0389 0.0086,0.0863 -0.03453,0.0604 -0.08201,0.1079 -0.04316,0.0475 -0.06043,0.12086 -0.06475,0 -0.116542,0.0302 -0.04748,0.0259 -0.09064,0.0604 -0.04316,0.0302 -0.08633,0.0604 -0.04316,0.0259 -0.09496,0.0259 -0.06474,0 -0.09064,-0.0173 -0.0259,-0.0216 -0.03885,-0.0432 -0.01295,-0.0216 -0.0259,-0.0388 -0.0086,-0.0173 -0.04316,-0.0129 -0.0086,-0.0561 -0.03453,-0.10359 -0.0259,-0.0518 -0.05611,-0.0993 -0.0259,-0.0475 -0.05611,-0.095 -0.0259,-0.0518 -0.03885,-0.10359 -0.0259,-0.11223 -0.02158,-0.23309 0.0043,-0.12086 -0.03885,-0.23308 0.0086,-0.0604 0.01295,-0.12086 0.0043,-0.0648 0.0043,-0.12517 0,-0.12086 -0.0086,-0.2374 -0.0043,-0.12086 -0.0086,-0.24604 -0.03021,-0.0388 -0.03885,-0.0863 -0.0043,-0.0518 -0.0086,-0.0993 -0.01295,-0.0129 -0.03021,-0.0259 -0.01295,-0.0129 -0.01727,-0.0345 -0.03453,-0.009 -0.0518,-0.009 -0.06043,0 -0.103593,0.0302 -0.03885,0.0259 -0.07338,0.0259 -0.03453,0 -0.06475,-0.009 -0.03021,-0.009 -0.06043,-0.009 -0.0259,0 -0.03021,0.0129 0,0.009 -0.01727,0.0173 -0.01295,0.009 -0.06043,0.0173 -0.04748,0.009 -0.107909,0.0173 -0.05611,0.004 -0.112226,0.009 -0.0518,0.004 -0.06906,0.004 -0.06906,0 -0.103593,-0.0259 -0.03885,-0.0302 -0.09064,-0.0647 0.0086,-0.0259 0.0086,-0.0345 0,-0.0432 -0.0259,-0.0691 -0.0259,-0.0302 -0.0259,-0.0518 0,-0.0475 0.03885,-0.0734 0.03453,-0.0259 0.03885,-0.082 0.09928,-0.0432 0.202869,-0.0648 0.103593,-0.0216 0.211502,-0.0345 0.107909,-0.0129 0.211502,-0.0302 0.107909,-0.0173 0.211502,-0.0561 0.03021,0.004 0.05611,0.009 0.03021,0 0.06043,0 0.12949,0 0.254665,-0.0259 0.129491,-0.0302 0.263298,-0.0302 0.03453,0 0.06906,0.004 0.03453,0.004 0.06906,0.0129 0.172654,-0.0259 0.340993,-0.0561 0.172654,-0.0302 0.353941,-0.0518 0.08633,-0.009 0.168339,-0.0129 0.08633,-0.009 0.172654,-0.0216 0.03022,-0.004 0.04316,-0.0129 0.01726,-0.0129 0.01726,-0.0475 0.03885,0.0173 0.08633,0.0173 0.07338,0 0.14244,-0.0259 0.06906,-0.0259 0.14244,-0.0259 0.01727,0 0.03021,0.004 0.01295,0 0.0259,0 0.03021,0 0.03021,-0.0259 0.0043,-0.0302 0.04316,-0.0388 0.03021,-0.009 0.08633,-0.013 0.05611,-0.004 0.116542,-0.009 0.06475,-0.009 0.116541,-0.0173 0.05611,-0.0129 0.08201,-0.0345 l 0.03021,-0.0475 q 0.07769,0.004 0.112225,0.0691 0.03885,0.0604 0.04316,0.13381 0.01727,0.0173 0.04748,0.0173 0.03453,-0.004 0.06043,-0.004 z"
             inkscape:connector-curvature="0" />
          <path
             id="path4582"
             style="font-style:normal;font-variant:normal;font-weight:normal;font-stretch:normal;font-size:4.41995668px;font-family:'Rock Salt';-inkscape-font-specification:'Rock Salt, Normal';font-variant-ligatures:normal;font-variant-caps:normal;font-variant-numeric:normal;font-feature-settings:normal;text-align:start;writing-mode:lr-tb;text-anchor:start;fill:#ff6600;fill-opacity:1;stroke-width:0.11049938"
             d="m 53.970638,269.2828 q -0.0259,0.0345 -0.06475,0.0475 -0.03885,0.0129 -0.07769,0.0216 -0.03885,0.009 -0.08201,0.0173 -0.03885,0.0129 -0.06906,0.0389 -0.0086,0.004 -0.01295,0.009 0,0.004 -0.0086,0.004 -0.01295,0 -0.0259,-0.0216 -0.0086,-0.0173 -0.03021,-0.0259 -0.112225,0.0604 -0.241716,0.1036 -0.129491,0.0475 -0.258982,0.095 -0.125175,0.0518 -0.246033,0.10791 -0.120858,0.0604 -0.211502,0.14675 -0.06906,0.009 -0.14244,0.0302 -0.06906,0.0259 -0.103592,0.095 h -0.01295 q -0.01727,0 -0.0259,-0.0129 -0.0086,-0.009 -0.0259,-0.009 -0.03021,0 -0.03885,0.0173 -0.0086,0.0173 -0.01295,0.0345 0,0.0216 -0.0043,0.0388 -0.0043,0.0173 -0.0259,0.0173 -0.0086,0 -0.01727,-0.0173 -0.0086,-0.0129 -0.04316,-0.009 -0.159705,0.0863 -0.33236,0.17265 -0.172654,0.0906 -0.297829,0.22877 -0.0086,-0.009 -0.02158,-0.009 -0.0086,0 -0.01295,0 l -0.0043,0.004 q -0.0086,0 -0.01295,-0.004 -0.0043,-0.004 -0.0086,-0.004 -0.09928,0.0863 -0.211502,0.15539 -0.107909,0.0734 -0.220135,0.14244 -0.112225,0.0691 -0.220134,0.13812 -0.107909,0.0734 -0.202869,0.16402 -0.06043,0.004 -0.120858,0.0259 -0.06043,0.0216 -0.120859,0.0432 -0.05611,0.0216 -0.116541,0.0388 -0.06043,0.0216 -0.120859,0.0216 -0.112225,0 -0.185603,-0.0993 -0.01295,0.009 -0.0259,0.0129 -0.0086,0.004 -0.02158,0.004 -0.03453,0 -0.06475,-0.0302 -0.0259,-0.0259 -0.07338,-0.0173 -0.05611,-0.0604 -0.08201,-0.15539 -0.02158,-0.0906 -0.05611,-0.16833 0.0086,-0.16834 0.05611,-0.32805 0.0518,-0.15539 0.06475,-0.32372 0.03885,-0.0388 0.06043,-0.0906 0.02158,-0.0475 0.03885,-0.10359 0.02158,-0.0518 0.04316,-0.10359 0.02158,-0.0518 0.06043,-0.0863 0.0259,-0.12949 0.08633,-0.24603 0.06043,-0.11655 0.08201,-0.25035 0.03453,-0.0216 0.05611,-0.0518 0.0259,-0.0302 0.05611,-0.0561 V 269.01 q 0,-0.0345 -0.01726,-0.0518 0.03021,-0.0777 0.06474,-0.14675 0.03885,-0.0691 0.07338,-0.13813 0.03453,-0.0691 0.06043,-0.14244 0.0259,-0.0734 0.03453,-0.1597 0.03453,-0.0302 0.0518,-0.0734 0.01727,-0.0475 0.03022,-0.0906 0.01726,-0.0475 0.03453,-0.0863 0.02158,-0.0388 0.06906,-0.0604 -0.0043,-0.009 -0.0043,-0.0216 0,-0.0432 0.02158,-0.0777 0.0259,-0.0345 0.0259,-0.0734 0,-0.0216 -0.01295,-0.0432 0.08633,-0.18129 0.168338,-0.35394 0.08201,-0.17697 0.125175,-0.37552 0.04316,-0.0216 0.0518,-0.0648 0.0086,-0.0432 0.03885,-0.0777 v -0.0216 q 0,-0.0734 0.03022,-0.16402 0.03453,-0.0906 0.08201,-0.15107 0.02158,-0.15107 0.04748,-0.3151 0.03021,-0.16833 0.09064,-0.30646 -0.0086,-0.0302 -0.0259,-0.0604 -0.01295,-0.0302 -0.02158,-0.0647 -0.107909,0.0604 -0.246032,0.10791 -0.0259,0.009 -0.05611,0.0173 -0.03021,0.004 -0.0518,0.0173 -0.0259,0.009 -0.03021,0.0432 -0.0043,0.0302 -0.0043,0.0518 -0.0518,0 -0.08201,0.0216 -0.03022,0.0216 -0.06043,0.0518 -0.0259,0.0259 -0.05611,0.0518 -0.03021,0.0216 -0.07769,0.0302 -0.0518,0.0518 -0.08633,0.082 -0.03453,0.0259 -0.09928,0.0518 -0.02158,0.009 -0.04316,0.0345 l -0.04316,0.0518 q -0.02158,0.0259 -0.04316,0.0432 -0.01727,0.0173 -0.03885,0.0129 -0.01295,0.0389 -0.03885,0.0648 -0.02158,0.0259 -0.04748,0.0518 -0.0259,0.0216 -0.04316,0.0518 -0.01727,0.0302 -0.01295,0.0777 -0.01726,0.0173 -0.03021,0.0173 -0.01295,0 -0.03022,-0.0173 -0.0086,0.0518 -0.03453,0.0863 -0.02158,0.0302 -0.0518,0.0561 -0.03021,0.0259 -0.06475,0.0518 -0.03453,0.0259 -0.06475,0.0561 -0.03885,-0.004 -0.06906,-0.0173 -0.0259,-0.0129 -0.05611,-0.0259 -0.03021,-0.0129 -0.06475,-0.0173 -0.03021,-0.009 -0.07769,-0.004 0.0043,-0.0259 -0.0086,-0.0389 -0.01295,-0.0129 -0.03453,-0.0216 0,-0.0345 0,-0.0863 0.0043,-0.0518 0.0043,-0.10359 0.0043,-0.0561 0.01295,-0.10359 0.0086,-0.0475 0.0259,-0.0777 0.0259,-0.0432 0.08201,-0.0777 0.06043,-0.0345 0.125175,-0.0691 0.06906,-0.0389 0.129491,-0.0777 0.06475,-0.0432 0.103593,-0.10359 0.0043,0.004 0.01727,0.004 0.03453,0 0.05611,-0.0173 0.02158,-0.0389 0.05611,-0.0561 0.03885,-0.0173 0.06906,-0.0518 0.01295,-0.0129 0.01295,-0.0302 0.0043,-0.0216 0.01727,-0.0345 0.01295,-0.0129 0.04748,-0.0259 0.03885,-0.0129 0.06043,-0.0345 0.0259,-0.0216 0.03885,-0.0475 0.01727,-0.0259 0.03885,-0.0475 0.03453,-0.0259 0.07338,-0.0388 0.04316,-0.0129 0.08201,-0.0345 0.03885,-0.0259 0.06906,-0.0604 0.03453,-0.0345 0.0518,-0.082 0.08633,-0.0389 0.168338,-0.0777 0.08201,-0.0432 0.159706,-0.0906 0.04316,-0.0259 0.08201,-0.0561 0.03885,-0.0345 0.07769,-0.0648 0.04316,-0.0302 0.08633,-0.0518 0.04748,-0.0216 0.09928,-0.0216 0.06475,0 0.09928,0.0259 0.03453,0.0216 0.06043,0.0518 0.03021,0.0259 0.06043,0.0561 0.03453,0.0302 0.08633,0.0432 0.04316,0.0691 0.05611,0.15107 0.01727,0.0777 0.02158,0.16402 0.0043,0.082 0,0.16402 0,0.082 0.01295,0.15971 -0.0259,0.0734 -0.06043,0.14244 -0.03453,0.0691 -0.03453,0.14675 0,0.0302 0.0043,0.0518 h -0.0518 q -0.01727,0.14244 -0.06475,0.28056 -0.04748,0.13381 -0.107909,0.26762 l -0.116542,0.2633 q -0.05611,0.12949 -0.09496,0.26761 -0.0086,0.0389 -0.03022,0.0475 -0.02158,0.004 -0.03021,0.0345 -0.02158,0.0475 -0.03453,0.1036 -0.01295,0.0561 -0.03453,0.1079 -0.04316,0.11223 -0.08633,0.21582 -0.04316,0.1036 -0.09064,0.20287 v 0.0432 q 0,0.0216 0.01295,0.0216 -0.138124,0.18992 -0.185604,0.43163 -0.03453,0.0259 -0.0518,0.0648 -0.01295,0.0345 -0.04316,0.0604 -0.03021,0.12517 -0.08201,0.24603 -0.04748,0.11654 -0.09928,0.23309 -0.0518,0.11654 -0.09928,0.23308 -0.04748,0.12086 -0.07338,0.24603 -0.04748,0.0432 -0.07769,0.10359 -0.0259,0.0604 -0.04748,0.1295 -0.01727,0.0691 -0.03453,0.13812 -0.01295,0.0691 -0.03021,0.12517 l -0.04316,0.15539 v 0.0863 q 0,0.0216 -0.0043,0.0475 -0.0043,0.0259 -0.0259,0.0345 0.0086,0.0302 0.02158,0.0475 0.01727,0.0173 0.0086,0.0475 0.01726,0.0345 0.06043,0.0388 0.04748,0.009 0.08201,0.0216 0.03453,-0.009 0.03885,-0.0389 0.0043,-0.0302 0.02158,-0.0518 0.03885,-0.0518 0.116542,-0.11223 0.08201,-0.0604 0.172654,-0.12517 0.09496,-0.0648 0.181288,-0.12518 0.09064,-0.0561 0.146756,-0.10359 h 0.07769 q 0.155389,-0.0993 0.310778,-0.19424 0.155389,-0.0906 0.323727,-0.16402 0.04316,-0.0561 0.103593,-0.0863 0.06475,-0.0302 0.129491,-0.0604 0.06906,-0.0259 0.129491,-0.0561 0.06475,-0.0302 0.103592,-0.0863 0.04748,-0.009 0.103593,-0.0216 0.05611,-0.013 0.08201,-0.0604 h 0.01727 q 0.01295,0 0.0259,0.004 0.01295,0.009 0.01726,0.0259 0.03022,-0.009 0.03453,-0.0389 0.0086,-0.0302 0.03022,-0.0518 0.125174,-0.0475 0.254665,-0.0993 0.129491,-0.0518 0.254666,-0.11654 0.06043,0 0.133807,-0.0173 0.07769,-0.0173 0.116542,-0.0777 0.0086,0.004 0.02158,0.004 0.04748,0 0.09064,-0.0129 0.04748,-0.0173 0.09496,-0.0345 0.04748,-0.0216 0.09496,-0.0388 0.04748,-0.0173 0.09928,-0.0216 h 0.0086 q 0.0086,0 0.0043,-0.0216 0,-0.0259 0,-0.0302 0,-0.0173 0.01726,-0.0129 0.01295,-0.004 0.04316,-0.004 0.04748,0 0.08633,0.0216 0.04316,0.0173 0.08201,0.0432 0.03885,0.0259 0.07769,0.0561 0.03885,0.0259 0.08201,0.0388 -0.0086,0.0345 -0.0086,0.0561 0,0.0216 0.0043,0.0432 0.0086,0.0173 0.01727,0.0389 z"
             inkscape:connector-curvature="0" />
          <path
             id="path4584"
             style="font-style:normal;font-variant:normal;font-weight:normal;font-stretch:normal;font-size:4.41995668px;font-family:'Rock Salt';-inkscape-font-specification:'Rock Salt, Normal';font-variant-ligatures:normal;font-variant-caps:normal;font-variant-numeric:normal;font-feature-settings:normal;text-align:start;writing-mode:lr-tb;text-anchor:start;fill:#ff6600;fill-opacity:1;stroke-width:0.11049938"
             d="m 56.279892,267.4354 q 0,0.27193 -0.0518,0.53091 -0.04748,0.25466 -0.116542,0.51365 -0.04748,0.0475 -0.07338,0.0993 -0.0259,0.0475 -0.02158,0.11655 -0.0518,0.0129 -0.06906,0.0647 -0.01727,0.0475 -0.03885,0.0906 -0.07338,0.0475 -0.129491,0.11223 -0.0518,0.0604 -0.112225,0.12086 -0.01727,0.0173 -0.03453,0.0389 -0.01295,0.0216 -0.03022,0.0345 -0.03885,0.0302 -0.08633,0.0561 -0.04748,0.0216 -0.08633,0.0475 -0.08633,0.0561 -0.168338,0.11654 -0.08201,0.0648 -0.159706,0.13812 -0.185603,0.0734 -0.358258,0.16403 -0.168338,0.095 -0.336676,0.20718 h -0.107909 q -0.05611,0.0345 -0.103593,0.0561 -0.04748,0.0216 -0.112226,0.0216 -0.08633,0.0561 -0.18992,0.0906 -0.103592,0.0389 -0.211501,0.0691 -0.10791,0.0302 -0.215819,0.0561 -0.107909,0.0259 -0.202869,0.0604 -0.02158,-0.004 -0.04316,-0.013 -0.01727,-0.004 -0.03885,-0.004 -0.06043,0 -0.112225,0.0259 -0.04748,0.0259 -0.103593,0.0388 -0.01727,0.009 -0.03885,0.004 -0.02158,0 -0.03885,0 -0.112226,0 -0.20287,-0.0388 -0.09064,-0.0345 -0.194236,-0.0561 -0.0259,-0.0561 -0.07338,-0.10791 l -0.09496,-0.10359 q -0.04748,-0.0518 -0.08201,-0.10791 -0.03885,-0.0518 -0.04748,-0.11654 v -0.0432 q 0,-0.0475 -0.0086,-0.095 -0.0086,-0.0475 -0.02158,-0.095 0.03021,-0.0777 0.06043,-0.16402 0.03021,-0.0863 0.06475,-0.16834 0.03453,-0.0863 0.07769,-0.16402 0.04316,-0.0777 0.107909,-0.13381 0.02158,-0.095 0.06906,-0.17265 0.04316,-0.082 0.09928,-0.15539 0.0518,-0.0777 0.103593,-0.15539 0.0518,-0.0777 0.08633,-0.16834 0.02158,0.004 0.0259,-0.009 0.0086,-0.013 0.01295,-0.0259 0.0086,-0.0173 0.01727,-0.0259 0.0086,-0.009 0.03453,0 0,-0.0432 0.01727,-0.0691 0.01727,-0.0302 0.03453,-0.0561 0.02158,-0.0259 0.03453,-0.0518 0.01727,-0.0302 0.02158,-0.0691 0.03021,-0.0129 0.04748,-0.0388 0.02158,-0.0259 0.03885,-0.0518 0.01727,-0.0302 0.03453,-0.0561 0.01727,-0.0259 0.0518,-0.0388 0.0086,-0.0561 0.03022,-0.095 0.0259,-0.0432 0.0518,-0.0777 0.03021,-0.0345 0.05611,-0.0691 0.03021,-0.0388 0.04748,-0.0863 0.0259,-0.0216 0.06043,-0.0129 0.06043,-0.12085 0.14244,-0.22876 0.08201,-0.10791 0.168338,-0.2115 0.08633,-0.1036 0.172655,-0.20719 0.08633,-0.10791 0.151072,-0.22445 0.06043,-0.0345 0.112226,-0.082 0.05611,-0.0518 0.09064,-0.11654 -0.08633,-0.16403 -0.151072,-0.3151 -0.06475,-0.15539 -0.06475,-0.34962 0,-0.0302 0.0043,-0.0604 0.0043,-0.0302 0.0086,-0.0648 0.07338,-0.0993 0.14244,-0.16402 0.06906,-0.0691 0.202869,-0.0691 0.129491,0 0.25035,0.0475 0.125174,0.0475 0.254665,0.0475 0.06475,0.0475 0.129491,0.0863 0.06906,0.0345 0.14244,0.0691 l 0.05611,0.0216 q 0.03453,0.009 0.06043,0.0216 0.0259,0.0173 0.0518,0.0388 0.03021,0.0216 0.05611,0.0432 0.172654,0.14244 0.319411,0.31078 0.151073,0.16402 0.297829,0.33668 v 0.009 q 0,0.0691 0.03021,0.10791 0.03021,0.0345 0.06475,0.082 0,0.0777 0.02158,0.13812 0.02158,0.0604 0.05611,0.12518 0,0.0604 0,0.12517 0.0043,0.0604 0.02158,0.12086 0.01727,0.0432 0.02158,0.0648 0.01727,0.0604 0.01727,0.15538 z m -0.349626,-0.004 q 0,-0.12517 -0.01727,-0.22877 -0.01295,-0.10791 -0.03453,-0.22876 -0.01727,-0.1036 -0.04316,-0.20719 -0.02158,-0.10359 -0.06906,-0.19855 -0.04316,-0.095 -0.116542,-0.17266 -0.06906,-0.0777 -0.172654,-0.1338 H 55.4641 q -0.01295,0 -0.03021,0.0216 -0.01295,0.0173 -0.06043,0.0173 -0.0259,0 -0.0518,-0.009 -0.02158,-0.0129 -0.04316,-0.009 h -0.01727 q -0.0518,0.0259 -0.09064,0.0388 -0.03885,0.0129 -0.09928,0.004 -0.06475,0.0604 -0.138124,0.11223 -0.06906,0.0475 -0.155389,0.0734 -0.03885,0.0777 -0.09928,0.13813 -0.06043,0.0561 -0.146757,0.0777 -0.01727,0.0518 -0.0518,0.0906 -0.03021,0.0345 -0.06906,0.0647 -0.03885,0.0259 -0.08201,0.0518 -0.04316,0.0259 -0.07769,0.0561 -0.03453,0.0345 -0.05611,0.0734 -0.01727,0.0345 -0.0518,0.0647 -0.04748,0.0432 -0.08633,0.082 -0.03453,0.0388 -0.06906,0.0906 -0.03021,0.0475 -0.06043,0.095 -0.0259,0.0475 -0.03021,0.10791 -0.125175,0.0734 -0.198553,0.18992 l -0.146756,0.23308 q -0.03021,0.0432 -0.06043,0.0777 l -0.06043,0.0691 q -0.01295,0.0173 -0.01727,0.0388 0,0.0216 0.0043,0.0432 -0.06043,0.0432 -0.103592,0.10359 -0.04316,0.0561 -0.08201,0.12086 -0.03453,0.0648 -0.0777,0.12949 -0.03885,0.0604 -0.09496,0.10791 -0.03453,0.0863 -0.08201,0.17697 -0.04316,0.0863 -0.116542,0.14676 -0.07338,0.18129 -0.14244,0.35826 -0.06475,0.17697 -0.09064,0.3712 0.03021,0.0302 0.06043,0.0518 0.03021,0.0259 0.06043,0.0561 0.0043,0.004 0.01727,0.004 0.02158,0 0.03021,-0.0129 0.01295,-0.0129 0.03021,-0.0129 0.0086,0 0.0086,0 l 0.0086,0.004 q 0.0043,0.0302 0.0259,0.0432 0.02158,0.013 0.0518,0.0173 0.03021,0.009 0.06043,0.013 0.03021,0.004 0.04748,0.0216 0.09496,-0.0302 0.211501,-0.0475 0.116542,-0.0129 0.228768,-0.0345 0.116542,-0.0173 0.224451,-0.0518 0.107909,-0.0345 0.185603,-0.0993 h 0.04748 q 0.04316,0 0.06043,0.0173 0.08201,-0.082 0.164022,-0.12518 0.08201,-0.0432 0.194237,-0.0475 0.164021,-0.15107 0.371207,-0.24171 0.211502,-0.095 0.401422,-0.20719 0.02158,-0.009 0.02158,-0.0302 0,-0.0259 0.02158,-0.0302 0.02158,-0.004 0.03453,0 0.01727,0 0.03453,0 0.151073,-0.14675 0.289197,-0.29783 0.14244,-0.15539 0.250349,-0.33667 0,-0.0302 0.0043,-0.0518 0.0086,-0.0259 0.0086,-0.0475 0,-0.009 -0.0043,-0.0173 -0.0043,-0.0129 -0.0086,-0.0216 0.08633,-0.17265 0.120858,-0.36689 0.03885,-0.19855 0.03885,-0.38847 z m -0.99708,-1.55389 q -0.05611,-0.0388 -0.133807,-0.0691 -0.07769,-0.0345 -0.146757,-0.0345 -0.07338,0 -0.107909,0.0432 -0.03021,0.0389 -0.03021,0.10791 0,0.0389 0.02158,0.0647 0.02158,0.0216 0.0086,0.0863 0.01295,0.009 0.03453,0.009 0.0518,0 0.09928,-0.0216 0.04748,-0.0216 0.08633,-0.0518 0.04316,-0.0345 0.08201,-0.0691 0.04316,-0.0388 0.08633,-0.0647 z"
             inkscape:connector-curvature="0" />
          <path
             id="path4586"
             style="font-style:normal;font-variant:normal;font-weight:normal;font-stretch:normal;font-size:4.41995668px;font-family:'Rock Salt';-inkscape-font-specification:'Rock Salt, Normal';font-variant-ligatures:normal;font-variant-caps:normal;font-variant-numeric:normal;font-feature-settings:normal;text-align:start;writing-mode:lr-tb;text-anchor:start;fill:#ff6600;fill-opacity:1;stroke-width:0.11049938"
             d="m 58.291318,265.54483 q 0,0.0863 -0.02158,0.16834 -0.02158,0.0777 -0.03453,0.16402 -0.0043,0.009 -0.0043,0.0302 0,0.0259 0.0043,0.0518 0.0043,0.0216 0.01295,0.0432 -0.04316,0.0863 -0.06475,0.18561 -0.02158,0.095 -0.03885,0.19423 l -0.03453,0.19856 q -0.01727,0.0993 -0.04748,0.19423 v 0.0129 q 0,0.0216 0.0086,0.0389 0.01295,0.0173 0.01295,0.0388 v 0.0173 q -0.05611,0.18129 -0.08633,0.37553 -0.03021,0.18992 -0.09928,0.35394 0.0086,0.0432 0.0086,0.0647 0,0.0475 -0.01295,0.0863 -0.0086,0.0345 -0.0259,0.0648 l -0.03021,0.0561 q -0.01295,0.0259 -0.02158,0.0561 -0.0043,0.0173 -0.0043,0.0345 v 0.0345 q -0.0043,0.0993 -0.0086,0.17266 -0.0043,0.0734 -0.06043,0.1597 -0.0043,0.11223 -0.0259,0.21582 -0.01727,0.10359 -0.0518,0.2115 -0.02158,0.0863 -0.0518,0.17266 -0.03022,0.0863 -0.04316,0.17265 -0.0086,0.0432 -0.0043,0.10791 0.0086,0.0604 0.0086,0.10791 0,0.0993 -0.0086,0.19424 -0.0043,0.0993 -0.0259,0.18992 0.01295,0.0647 0.04748,0.11654 0.03453,0.0561 0.04316,0.12086 0.01295,0.0129 0.0259,0.0129 0.0086,0 0.01727,-0.004 0.01295,-0.004 0.0259,-0.004 0.01727,0 0.0259,0.009 0.01295,0.0345 0.01295,0.0604 0,0.0518 -0.04748,0.0906 0.0043,0.0259 0.0043,0.0432 v 0.0432 q 0,0.0302 -0.0086,0.0777 -0.0043,0.0475 -0.04748,0.0475 -0.02158,0 -0.02158,-0.0259 0.0043,-0.0216 -0.01727,-0.0302 -0.0259,0.009 -0.04316,0.009 -0.03453,0 -0.05611,-0.0129 l -0.04316,-0.0259 q -0.02158,-0.013 -0.04748,-0.0259 -0.02158,-0.009 -0.05611,-0.004 -0.03453,-0.0648 -0.07769,-0.12518 -0.03885,-0.0561 -0.09064,-0.10359 -0.03021,-0.10359 -0.03885,-0.21582 -0.0043,-0.10791 -0.04316,-0.20718 0.0043,-0.004 0.01295,-0.0259 l 0.01727,-0.0432 q 0.0086,-0.0216 0.01295,-0.0432 0.0086,-0.0216 0.0086,-0.0302 0,-0.0259 -0.0086,-0.0475 -0.0086,-0.0173 -0.01295,-0.0388 0.03021,-0.0993 0.03885,-0.21582 0.0086,-0.11654 0.05611,-0.20287 0.0043,-0.0432 0.0086,-0.0993 0.0043,-0.0604 0.01295,-0.11223 0.01295,-0.0561 0.03021,-0.10359 0.02158,-0.0518 0.06043,-0.0863 -0.0086,-0.0216 -0.01295,-0.0475 0,-0.0302 0,-0.0518 0,-0.10359 0.02158,-0.19855 0.0259,-0.0993 0.05611,-0.19855 0.0086,-0.0302 0.01727,-0.0604 0.01295,-0.0302 0.02158,-0.0647 0.0043,-0.009 0,-0.0173 0,-0.009 0,-0.0173 0,-0.0518 -0.01295,-0.0993 0.0259,-0.0173 0.03453,-0.0432 0.0086,-0.0302 0.01295,-0.0604 0.0086,-0.0345 0.01727,-0.0647 0.0086,-0.0302 0.03021,-0.0518 v -0.0216 q 0,-0.15107 0.04316,-0.29351 0.04316,-0.14676 0.07769,-0.2892 v -0.0173 q 0,-0.0173 -0.0086,-0.0259 -0.0086,-0.009 -0.0086,-0.0259 v -0.009 q 0.0086,-0.0388 0.02158,-0.0734 0.01295,-0.0389 0.02158,-0.0777 0.02158,-0.095 0.0259,-0.18992 0.0086,-0.095 0.04316,-0.1856 -0.0086,-0.0345 -0.0086,-0.0691 v -0.0691 q 0,-0.0993 0.0086,-0.18992 0.01295,-0.095 0.03453,-0.18992 0.0086,-0.0345 0.02158,-0.0906 0.01727,-0.0561 0.01727,-0.0863 0,-0.0518 -0.01295,-0.1036 -0.01295,-0.0561 -0.01295,-0.10791 0,-0.0259 0.0043,-0.0518 0.0043,-0.0259 0.02158,-0.0475 -0.03022,-0.0561 -0.03022,-0.12949 0,-0.0604 0.01727,-0.12086 0.01726,-0.0647 0.06043,-0.10791 h 0.129491 q 0.06043,0 0.120858,0.0173 0.06043,0.0173 0.09064,0.0777 0.0086,0.0129 0.01727,0.0475 0.01295,0.0302 0.02158,0.0691 0.01295,0.0345 0.02158,0.0691 0.0086,0.0302 0.0086,0.0475 0,0.0518 -0.0259,0.095 0.03021,0.0345 0.03453,0.0777 0.0086,0.0388 0.0086,0.082 z"
             inkscape:connector-curvature="0" />
          <path
             id="path4588"
             style="font-style:normal;font-variant:normal;font-weight:normal;font-stretch:normal;font-size:4.41995668px;font-family:'Rock Salt';-inkscape-font-specification:'Rock Salt, Normal';font-variant-ligatures:normal;font-variant-caps:normal;font-variant-numeric:normal;font-feature-settings:normal;text-align:start;writing-mode:lr-tb;text-anchor:start;fill:#ff6600;fill-opacity:1;stroke-width:0.11049938"
             d="m 62.447976,265.0614 q 0,0.10359 -0.05611,0.20287 -0.05611,0.0993 -0.168339,0.12085 -0.03885,0.0863 -0.09928,0.15108 -0.05611,0.0647 -0.120858,0.12517 -0.06043,0.0604 -0.125175,0.12518 -0.06043,0.0604 -0.103592,0.13812 -0.04316,0.009 -0.07338,0.0389 -0.0259,0.0302 -0.06475,0.0388 -0.04748,0.0604 -0.09496,0.11223 -0.04748,0.0475 -0.120858,0.0734 -0.233084,0.32372 -0.444586,0.6604 -0.211502,0.33236 -0.423003,0.66904 v 0.0259 q 0,0.0475 -0.01727,0.0777 -0.01726,0.0302 -0.03021,0.0691 0.04316,0.0561 0.09928,0.095 0.06043,0.0389 0.120858,0.0777 0.06043,0.0345 0.116542,0.0777 0.05611,0.0432 0.09496,0.10359 0.04748,0.004 0.07769,0.0259 0.03021,0.0216 0.07769,0.0216 0.01727,0.0475 0.04748,0.0777 0.03453,0.0302 0.07338,0.0561 0.03885,0.0259 0.07769,0.0475 0.04316,0.0216 0.07769,0.0518 0.0259,0.0647 0.06906,0.11654 0.04316,0.0518 0.103593,0.0863 0.01727,0.0518 0.03885,0.0993 0.0259,0.0475 0.04748,0.095 0.0259,0.0432 0.03885,0.0906 0.01727,0.0475 0.01727,0.10791 0,0.0691 -0.01727,0.1338 -0.08201,0.0993 -0.146756,0.21582 -0.06043,0.11654 -0.133807,0.22877 -0.138124,0.082 -0.276247,0.1597 -0.138124,0.082 -0.263299,0.18129 -0.07769,0.004 -0.14244,0.0302 -0.06043,0.0302 -0.120858,0.082 -0.14244,0.0302 -0.28488,0.0604 -0.138124,0.0345 -0.28488,0.0345 -0.138124,0 -0.215818,-0.0259 -0.07769,-0.0259 -0.138124,-0.0691 -0.06043,-0.0432 -0.120858,-0.0993 -0.06043,-0.0518 -0.164022,-0.10791 v -0.0129 q 0,-0.0216 0.0086,-0.0345 0.0086,-0.009 0.0086,-0.0259 0,-0.0259 -0.03021,-0.082 -0.03021,-0.0518 -0.04748,-0.0734 -0.01295,-0.082 -0.01295,-0.17265 0,-0.22877 0.05611,-0.41437 0.06043,-0.18992 0.146756,-0.36258 0.08633,-0.17697 0.181287,-0.34962 0.09496,-0.17266 0.168339,-0.37121 -0.04748,-0.0777 -0.129491,-0.12086 -0.07769,-0.0432 -0.159706,-0.0647 -0.03453,-0.095 -0.103593,-0.14676 -0.06475,-0.0518 -0.125174,-0.12086 -0.0518,-0.0734 -0.06475,-0.14244 -0.0043,-0.009 -0.0043,-0.009 0.0043,-0.004 0,-0.0129 -0.0086,-0.0259 -0.03021,-0.0173 -0.02158,0.004 -0.03021,-0.0173 -0.0086,-0.0129 -0.01727,-0.0734 -0.0043,-0.0647 -0.0086,-0.13812 -0.0043,-0.0777 -0.0086,-0.14244 0,-0.0691 0,-0.095 0.02158,-0.0518 0.04316,-0.11223 0.02158,-0.0604 0.04748,-0.11654 0.0259,-0.0561 0.06474,-0.0993 0.03885,-0.0475 0.09496,-0.0734 0,-0.0475 0.0259,-0.0734 0.0259,-0.0259 0.02158,-0.082 0.07338,-0.0302 0.129491,-0.0777 0.06043,-0.0475 0.120858,-0.095 0.03021,-0.0216 0.06043,-0.0302 0.03022,-0.009 0.06043,-0.0302 0.02158,-0.0173 0.01295,-0.0259 -0.0043,-0.0129 0.01727,-0.0389 0.06475,0.004 0.133807,-0.0475 0.07338,-0.0561 0.116542,-0.10359 h 0.01295 q 0.06906,0 0.129491,-0.0345 0.06043,-0.0345 0.133807,-0.0302 0.02158,-0.0432 0.06475,-0.0648 0.04316,-0.0216 0.09064,-0.0388 0.0518,-0.0173 0.09928,-0.0302 0.0518,-0.0173 0.08633,-0.0518 0.120858,-0.0173 0.2374,-0.0561 l 0.2374,-0.0777 q 0.120858,-0.0389 0.2374,-0.0734 0.120858,-0.0345 0.246033,-0.0518 0.02158,-0.0388 0.05611,-0.0604 0.03453,-0.0259 0.06906,-0.0518 0.04316,-0.0388 0.07338,-0.0906 0.03453,-0.0518 0.06475,-0.095 0.03453,-0.0475 0.07769,-0.0777 0.04316,-0.0345 0.116542,-0.0345 0.06906,0 0.120858,0.0388 0.0518,0.0388 0.07338,0.10359 h 0.0086 q 0.04748,0 0.06906,-0.0302 0.02158,0.0647 0.02158,0.12949 z m -1.247429,3.76387 v -0.0216 q -0.04748,-0.0647 -0.09496,-0.12517 -0.04748,-0.0604 -0.107909,-0.12086 -0.02158,-0.0216 -0.03885,-0.0561 -0.01295,-0.0345 -0.03453,-0.0561 -0.04316,-0.0345 -0.09928,-0.0432 -0.05611,-0.0129 -0.103592,-0.0475 -0.02158,-0.0173 -0.03885,-0.0389 -0.01727,-0.0216 -0.03885,-0.0388 -0.0259,-0.0216 -0.05611,-0.0259 -0.0259,-0.004 -0.0518,-0.0216 -0.0259,-0.0173 -0.04748,-0.0432 -0.01726,-0.0302 -0.04748,-0.0475 -0.03021,-0.0216 -0.06474,-0.0259 -0.03453,-0.004 -0.06906,-0.0216 h -0.03453 q -0.0086,0.0302 -0.02158,0.0475 -0.01295,0.0173 -0.0259,0.0389 -0.0086,0.0173 -0.01727,0.0388 -0.0043,0.0216 0.0043,0.0604 -0.0086,-0.004 -0.02158,-0.004 -0.02158,0 -0.0259,0.0173 0,0.013 -0.01295,0.0216 -0.09496,0.19423 -0.176971,0.39279 -0.08201,0.19423 -0.14244,0.40574 -0.0043,0.009 -0.01295,0.0475 -0.0086,0.0388 -0.0086,0.0475 0,0.0216 0.0086,0.0388 0.0086,0.0173 0.0086,0.0389 0,0.009 -0.0043,0.0173 -0.01295,0.0173 -0.01727,0.0388 -0.0043,0.0259 -0.0259,0.0345 0.01727,0.0432 0.01727,0.082 0,0.0388 0.01295,0.0734 0.0518,0.0604 0.129491,0.0863 0.07769,0.0302 0.146756,0.0561 0.04748,-0.0259 0.103593,-0.0388 0.05611,-0.009 0.107909,-0.0216 0.05611,-0.009 0.107909,-0.0259 0.05611,-0.0173 0.09928,-0.0561 h 0.01727 q 0.07338,0 0.112225,-0.0345 0.04316,-0.0345 0.08633,-0.0863 0.08201,-0.0129 0.129491,-0.0518 0.0518,-0.0388 0.09064,-0.0863 0.04316,-0.0518 0.08201,-0.0993 0.03885,-0.0518 0.09928,-0.0863 0.0086,-0.0389 0.02158,-0.0648 0.01295,-0.0302 0.0259,-0.0604 0.01295,-0.0302 0.02158,-0.0604 0.0086,-0.0302 0.0086,-0.0734 z m -0.107909,-2.96535 q -0.04316,0 -0.06906,0.0216 -0.02158,0.0216 -0.05611,0.0302 -0.01295,-0.0432 -0.0518,-0.0432 -0.03453,0 -0.07769,0.0302 -0.04316,0.0259 -0.08633,0.0259 -0.0259,0 -0.04316,-0.0129 -0.06475,0.0734 -0.168339,0.0993 -0.103592,0.0216 -0.18992,0.0345 -0.06475,0.11222 -0.198552,0.14244 0,-0.0129 -0.0043,-0.0302 0,-0.0173 -0.01727,-0.0173 h -0.0086 v 0.009 q 0,0.0216 -0.01727,0.0302 -0.01295,0.009 -0.0043,0.0389 -0.08633,0.0388 -0.155389,0.095 -0.06475,0.0561 -0.120858,0.12518 -0.0518,0.0691 -0.103593,0.14244 -0.04748,0.0734 -0.09496,0.14675 0,0.0216 0,0.0475 0.0043,0.0259 0.0043,0.0518 0,0.0432 -0.02158,0.0863 0.03453,0.0906 0.07338,0.17697 0.04316,0.082 0.09928,0.15539 0.05611,0.0691 0.129491,0.12085 0.07338,0.0518 0.176971,0.0777 0,-0.0129 0.01295,-0.0173 0.01295,-0.004 0.02158,0 0.07769,-0.1597 0.168338,-0.31941 0.09496,-0.16402 0.233084,-0.28488 0.0518,-0.10359 0.116542,-0.20287 0.06906,-0.0993 0.129491,-0.20287 0.01295,-0.095 0.05611,-0.1597 0.04316,-0.0648 0.09496,-0.12518 0.0518,-0.0604 0.09928,-0.12085 0.0518,-0.0648 0.07338,-0.15108 z"
             inkscape:connector-curvature="0" />
        </g>
        <g
           id="g4890"
           transform="matrix(0.70244436,0,0,0.70244436,-288.55659,289.65278)">
          <g
             transform="matrix(0.7330874,0,0,0.7330874,-22.48602,49.199121)"
             id="text4556"
             style="font-style:normal;font-variant:normal;font-weight:normal;font-stretch:normal;font-size:15.99388981px;line-height:1.25;font-family:'Droid Sans';-inkscape-font-specification:'Droid Sans, Normal';font-variant-ligatures:normal;font-variant-caps:normal;font-variant-numeric:normal;font-feature-settings:normal;text-align:start;letter-spacing:0px;word-spacing:0px;writing-mode:lr-tb;text-anchor:start;fill:#000000;fill-opacity:1;stroke:none;stroke-width:0.39984724"
             aria-label="ASIA">
            <path
               inkscape:connector-curvature="0"
               d="m 189.16755,24.91691 -1.24953,-3.537711 h -4.25618 l -1.26514,3.537711 h -1.46819 l 4.19371,-11.46437 h 1.32762 l 4.20151,11.46437 z m -1.71029,-4.826281 -1.15581,-3.311235 q -0.0468,-0.140571 -0.11714,-0.343619 -0.0625,-0.203047 -0.13276,-0.437333 -0.0703,-0.234285 -0.14057,-0.48419 -0.0703,-0.257714 -0.13276,-0.499809 -0.0547,0.242095 -0.12496,0.499809 -0.0703,0.257714 -0.14057,0.499809 -0.0703,0.234286 -0.14057,0.437333 -0.0625,0.195238 -0.10933,0.328 l -1.13238,3.311235 z m -7.18475,4.826281 h -4.13905 v -0.796571 l 1.34324,-0.32019 v -9.183991 l -1.34324,-0.32019 v -0.796571 h 4.13905 v 0.796571 l -1.34324,0.32019 v 9.183991 l 1.34324,0.32019 z m -5.52133,-3.053521 q 0,0.757523 -0.27333,1.358856 -0.26553,0.593523 -0.76534,1.007428 -0.49981,0.413904 -1.21828,0.632571 -0.71848,0.210857 -1.61657,0.210857 -0.86686,0 -1.62438,-0.140572 -0.74971,-0.132762 -1.25733,-0.398285 V 23.14415 q 0.26552,0.124952 0.60133,0.249904 0.34362,0.117143 0.71848,0.210857 0.37485,0.09371 0.77314,0.156191 0.39828,0.05467 0.78876,0.05467 1.24952,0 1.84304,-0.468571 0.60134,-0.468571 0.60134,-1.343236 0,-0.421714 -0.11714,-0.734095 -0.10934,-0.312381 -0.39829,-0.570095 -0.28114,-0.265523 -0.75752,-0.507618 -0.47638,-0.249905 -1.20267,-0.538857 -0.69505,-0.273333 -1.21047,-0.593523 -0.50762,-0.328 -0.84343,-0.734095 -0.328,-0.406095 -0.492,-0.921523 -0.15619,-0.515428 -0.15619,-1.171427 0,-0.687238 0.2499,-1.226094 0.24991,-0.538857 0.70286,-0.905904 0.45295,-0.374857 1.07771,-0.570095 0.63257,-0.195238 1.3901,-0.195238 0.92933,0 1.67123,0.179619 0.74191,0.171809 1.31981,0.445143 l -0.52324,1.218284 q -0.50761,-0.226476 -1.1558,-0.390476 -0.64039,-0.171809 -1.32762,-0.171809 -0.95276,0 -1.476,0.445142 -0.52324,0.437333 -0.52324,1.187047 0,0.445142 0.11714,0.773142 0.11715,0.32019 0.39048,0.585714 0.27333,0.257714 0.71848,0.491999 0.45295,0.226476 1.10895,0.48419 0.71066,0.281143 1.24171,0.577905 0.53886,0.296761 0.89809,0.671618 0.35924,0.374857 0.53886,0.866856 0.18743,0.492 0.18743,1.163618 z m -9.04342,3.053521 -1.24952,-3.537711 h -4.25619 l -1.26514,3.537711 h -1.46819 l 4.19371,-11.46437 h 1.32762 l 4.20152,11.46437 z m -1.71028,-4.826281 -1.15581,-3.311235 q -0.0469,-0.140571 -0.11715,-0.343619 -0.0625,-0.203047 -0.13276,-0.437333 -0.0703,-0.234285 -0.14057,-0.48419 -0.0703,-0.257714 -0.13276,-0.499809 -0.0547,0.242095 -0.12495,0.499809 -0.0703,0.257714 -0.14057,0.499809 -0.0703,0.234286 -0.14058,0.437333 -0.0625,0.195238 -0.10933,0.328 l -1.13238,3.311235 z"
               style="font-style:normal;font-variant:normal;font-weight:normal;font-stretch:normal;font-size:15.99388981px;font-family:'Droid Sans';-inkscape-font-specification:'Droid Sans, Normal';font-variant-ligatures:normal;font-variant-caps:normal;font-variant-numeric:normal;font-feature-settings:normal;text-align:start;writing-mode:lr-tb;text-anchor:start;stroke-width:0.39984724"
               id="path4633" />
          </g>
          <path
             inkscape:connector-curvature="0"
             d="m 90.77945,54.60319 h 0.412352 l 0.521915,1.391783 0.524572,-1.391783 h 0.412359 v 2.045175 H 92.380805 V 54.85253 l -0.527396,1.402739 H 91.575357 L 91.04796,54.85253 v 1.795835 H 90.77945 V 54.60319 m -2.021589,0 h 1.730014 v 0.232907 h -0.725936 v 1.812268 H 89.483797 V 54.836097 H 88.757861 V 54.60319 m -8.425353,2.119924 h 6.345366 v 2.098983 h -3.994128 v 2.233814 h 3.070367 v 1.870495 h -3.070367 v 2.466896 h 4.128435 v 2.099072 h -6.479673 v -10.76926 m -12.434149,0 h 2.992521 l 2.076365,6.723178 2.088735,-6.723178 h 2.52928 l 1.142618,10.76926 h -2.222946 l -0.685559,-6.734134 -2.100921,6.766401 h -1.490126 l -2.100831,-6.994978 -0.68565,6.962711 h -2.229132 l 1.142709,-10.76926 m -20.853408,0 h 1.483407 l 4.687458,6.472159 v -6.472159 h 2.000555 v 10.76926 h -1.483496 l -4.687369,-6.472159 v 6.472159 h -2.000555 v -10.76926 m -1.607194,9.968605 c -1.216396,1.02158 -3.026278,1.009846 -3.780308,1.009846 -1.518661,0 -2.721715,-0.500112 -3.609339,-1.500362 -0.887535,-1.005022 -1.331347,-2.36588 -1.331347,-4.082636 0,-1.736017 0.451941,-3.101645 1.355822,-4.097063 0.903881,-0.995418 2.141571,-1.493127 3.713157,-1.493127 0.606563,0 1.186796,0.06733 1.740523,0.201981 0.557791,0.134567 1.082979,0.334163 1.575651,0.598612 l -0.632717,1.870407 c -0.276906,-0.151619 -0.594016,-0.301029 -0.887977,-0.406084 -0.500801,-0.168318 -1.003634,-0.252433 -1.5085,-0.252433 -0.936396,0 -1.659058,0.310129 -2.167989,0.930476 -0.504866,0.615488 -0.757298,1.497898 -0.757298,2.647231 0,1.139703 0.244303,2.01964 0.732824,2.639987 0.488607,0.620347 1.222845,0.930564 2.082548,0.930564 0.873487,0 1.414402,-0.220182 1.702972,-0.452205 v -1.86325 h -1.89223 v -1.86104 h 3.664208 m 15.601092,-4.983362 c -1.381091,0.03719 -2.471669,0.533581 -3.273675,1.485439 -0.830634,0.990647 -1.248381,2.359369 -1.248381,4.105016 0,1.740788 0.417747,3.105711 1.248381,4.096365 0.834609,0.990621 1.980498,1.485449 3.442167,1.485449 1.465651,0 2.614451,-0.494828 3.445089,-1.485449 0.830542,-0.990654 1.245463,-2.355577 1.245463,-4.096365 0,-1.745647 -0.414921,-3.114369 -1.245463,-4.105016 -0.830638,-0.990558 -1.979438,-1.485439 -3.445089,-1.485439 -0.05707,0 -0.112386,-0.0015 -0.168492,0 z m 0.10276,2.011068 c 0.02208,-6.16e-4 0.04337,0 0.06573,0 0.720633,0 1.279044,0.311809 1.673994,0.936927 0.394951,0.625206 0.594194,1.507528 0.594194,2.64246 0,1.129984 -0.199333,2.005768 -0.594194,2.630886 -0.39495,0.625206 -0.953361,0.939842 -1.673994,0.939842 -0.716564,0 -1.270467,-0.314636 -1.665418,-0.939842 -0.394951,-0.625118 -0.594194,-1.500902 -0.594194,-2.630886 0,-1.134932 0.199243,-2.017254 0.594194,-2.64246 0.382581,-0.605592 0.915279,-0.91793 1.599686,-0.936927"
             style="fill:#000000;fill-opacity:1;fill-rule:nonzero;stroke:none;stroke-width:0.00883559"
             id="path4611" />
          <path
             id="path4518"
             d="m 91.457201,66.36692 a 1.1432823,1.1432823 0 0 1 -1.143282,1.143283 1.1432823,1.1432823 0 0 1 -1.143282,-1.143283 1.1432823,1.1432823 0 0 1 1.143282,-1.143282 1.1432823,1.1432823 0 0 1 1.143282,1.143282 z"
             style="opacity:1;vector-effect:none;fill:#000000;fill-opacity:1;fill-rule:evenodd;stroke:none;stroke-width:0.2329717;stroke-linecap:butt;stroke-linejoin:miter;stroke-miterlimit:4;stroke-dasharray:none;stroke-dashoffset:0;stroke-opacity:1"
             inkscape:connector-curvature="0" />
        </g>
        <g
           id="g5776"
           transform="translate(5.588006)">
          <g
             transform="translate(-279.58516,74.394575)"
             id="text4966"
             style="font-style:normal;font-weight:normal;font-size:3.41847968px;line-height:1.25;font-family:sans-serif;letter-spacing:0px;word-spacing:0px;fill:#000000;fill-opacity:1;stroke:none;stroke-width:0.60000002;stroke-miterlimit:4;stroke-dasharray:none"
             aria-label="TAIPEI">
            <path
               id="path4607"
               style="letter-spacing:0.83079165px;stroke-width:0.60000002;stroke-miterlimit:4;stroke-dasharray:none"
               d="m 32.572104,270.23039 h 2.108174 v 0.28376 h -0.884665 v 2.20832 h -0.338844 v -2.20832 h -0.884665 z"
               inkscape:connector-curvature="0" />
            <path
               id="path4609"
               style="letter-spacing:0.83079165px;stroke-width:0.60000002;stroke-miterlimit:4;stroke-dasharray:none"
               d="m 36.40408,270.56255 -0.457355,1.24021 h 0.91638 z m -0.190286,-0.33216 h 0.382242 l 0.949763,2.49208 h -0.350528 l -0.227008,-0.63929 h -1.123358 l -0.227008,0.63929 h -0.355536 z"
               inkscape:connector-curvature="0" />
            <path
               id="path4612"
               style="letter-spacing:0.83079165px;stroke-width:0.60000002;stroke-miterlimit:4;stroke-dasharray:none"
               d="m 38.738803,270.23039 h 0.337174 v 2.49208 h -0.337174 z"
               inkscape:connector-curvature="0" />
            <path
               id="path4614"
               style="letter-spacing:0.83079165px;stroke-width:0.60000002;stroke-miterlimit:4;stroke-dasharray:none"
               d="m 40.914953,270.50747 v 0.93641 h 0.423972 q 0.235354,0 0.363881,-0.12185 0.128527,-0.12185 0.128527,-0.34719 0,-0.22367 -0.128527,-0.34552 -0.128527,-0.12185 -0.363881,-0.12185 z m -0.337174,-0.27708 h 0.761146 q 0.418964,0 0.632619,0.19028 0.215324,0.18862 0.215324,0.55417 0,0.36889 -0.215324,0.55751 -0.213655,0.18862 -0.632619,0.18862 h -0.423972 v 1.0015 h -0.337174 z"
               inkscape:connector-curvature="0" />
            <path
               id="path4616"
               style="letter-spacing:0.83079165px;stroke-width:0.60000002;stroke-miterlimit:4;stroke-dasharray:none"
               d="m 43.471676,270.23039 h 1.575706 v 0.28376 h -1.238531 v 0.73778 h 1.186786 v 0.28376 h -1.186786 v 0.90302 h 1.268576 v 0.28376 h -1.605751 z"
               inkscape:connector-curvature="0" />
            <path
               id="path4618"
               style="letter-spacing:0.83079165px;stroke-width:0.60000002;stroke-miterlimit:4;stroke-dasharray:none"
               d="m 46.465725,270.23039 h 0.337174 v 2.49208 h -0.337174 z"
               inkscape:connector-curvature="0" />
          </g>
          <path
             inkscape:connector-curvature="0"
             id="path4962"
             d="m -261.39571,345.65435 v 0.59961 h 13.53321 v -0.59961 z"
             style="color:#000000;font-style:normal;font-variant:normal;font-weight:normal;font-stretch:normal;font-size:medium;line-height:normal;font-family:sans-serif;font-variant-ligatures:normal;font-variant-position:normal;font-variant-caps:normal;font-variant-numeric:normal;font-variant-alternates:normal;font-feature-settings:normal;text-indent:0;text-align:start;text-decoration:none;text-decoration-line:none;text-decoration-style:solid;text-decoration-color:#000000;letter-spacing:normal;word-spacing:normal;text-transform:none;writing-mode:lr-tb;direction:ltr;text-orientation:mixed;dominant-baseline:auto;baseline-shift:baseline;text-anchor:start;white-space:normal;shape-padding:0;clip-rule:nonzero;display:inline;overflow:visible;visibility:visible;opacity:1;isolation:auto;mix-blend-mode:normal;color-interpolation:sRGB;color-interpolation-filters:linearRGB;solid-color:#000000;solid-opacity:1;vector-effect:none;fill:#000000;fill-opacity:1;fill-rule:nonzero;stroke:none;stroke-width:0.60000002;stroke-linecap:butt;stroke-linejoin:miter;stroke-miterlimit:4;stroke-dasharray:none;stroke-dashoffset:0;stroke-opacity:1;color-rendering:auto;image-rendering:auto;shape-rendering:auto;text-rendering:auto;enable-background:accumulate" />
          <path
             inkscape:connector-curvature="0"
             id="path4968"
             d="m -231.93282,345.65435 v 0.59961 h 13.53321 v -0.59961 z"
             style="color:#000000;font-style:normal;font-variant:normal;font-weight:normal;font-stretch:normal;font-size:medium;line-height:normal;font-family:sans-serif;font-variant-ligatures:normal;font-variant-position:normal;font-variant-caps:normal;font-variant-numeric:normal;font-variant-alternates:normal;font-feature-settings:normal;text-indent:0;text-align:start;text-decoration:none;text-decoration-line:none;text-decoration-style:solid;text-decoration-color:#000000;letter-spacing:normal;word-spacing:normal;text-transform:none;writing-mode:lr-tb;direction:ltr;text-orientation:mixed;dominant-baseline:auto;baseline-shift:baseline;text-anchor:start;white-space:normal;shape-padding:0;clip-rule:nonzero;display:inline;overflow:visible;visibility:visible;opacity:1;isolation:auto;mix-blend-mode:normal;color-interpolation:sRGB;color-interpolation-filters:linearRGB;solid-color:#000000;solid-opacity:1;vector-effect:none;fill:#000000;fill-opacity:1;fill-rule:nonzero;stroke:none;stroke-width:0.60000002;stroke-linecap:butt;stroke-linejoin:miter;stroke-miterlimit:4;stroke-dasharray:none;stroke-dashoffset:0;stroke-opacity:1;color-rendering:auto;image-rendering:auto;shape-rendering:auto;text-rendering:auto;enable-background:accumulate" />
        </g>
      </g>
    </g>
  </g>
</svg>
