<svg width="800" height="400" viewBox="0 0 800 400" fill="none" xmlns="http://www.w3.org/2000/svg">
<path d="M614.514 37C604.212 37 635.109 40.9914 642.445 48.2236C649.78 55.4563 654.062 65.6925 654.062 75.9938C654.062 86.2952 649.78 96.5314 642.445 103.764C635.109 110.996 624.814 115.133 614.514 114.988C614.489 114.987 614.463 114.987 614.438 114.987H544.764C538.181 114.998 537.521 124.62 544.042 125.53C552.495 126.696 560.527 130.728 566.512 136.812C572.498 142.895 576.398 150.991 577.427 159.463C578.455 167.935 576.604 176.73 572.247 184.068C567.891 191.406 561.057 197.244 553.128 200.398C547.706 202.557 549.25 210.614 555.085 210.616H671.572C671.597 210.616 671.622 210.615 671.647 210.615C681.947 210.469 692.243 214.606 699.578 221.838C706.913 229.071 711.195 239.307 711.195 249.609C711.195 259.91 706.913 270.146 699.578 277.379C692.243 284.611 681.948 288.748 671.647 288.603C671.622 288.602 671.597 288.602 671.572 288.602H648.692C642.675 288.606 641.322 297.045 647.036 298.929C655.785 301.809 663.437 307.9 668.206 315.78C672.975 323.66 674.822 333.265 673.315 342.352C671.808 351.439 666.959 359.933 659.902 365.851C652.844 371.77 643.635 375.065 634.425 374.966C634.406 374.966 634.388 374.966 634.369 374.966H151.732C151.707 374.966 151.681 374.967 151.656 374.967C141.356 375.113 131.061 370.976 123.726 363.744C116.39 356.511 112.108 346.275 112.108 335.973C112.108 325.672 116.39 315.436 123.726 308.203C131.061 300.971 141.356 296.834 151.656 296.979C151.681 296.98 151.707 296.98 151.732 296.98H174.612C180.634 296.98 181.985 288.53 176.264 286.651C161.151 281.691 149.923 266.669 149.446 250.771C148.968 234.872 159.273 219.202 174.061 213.343C179.486 211.189 177.947 203.128 172.11 203.123H55.6234C55.5984 203.123 55.5734 203.123 55.5484 203.124C45.2476 203.27 34.9527 199.133 27.6173 191.9C20.2815 184.667 16 174.432 16 164.13C16 153.828 20.2815 143.592 27.6173 136.36C34.9527 129.127 45.2476 124.991 55.5484 125.136C55.5734 125.137 55.5984 125.137 55.6234 125.137H125.297C131.87 125.135 132.557 115.536 126.052 114.597C116.391 113.208 107.326 108.038 101.21 100.432C95.0954 92.8252 91.9942 82.8609 92.7126 73.128C93.4305 63.3946 97.9612 53.9927 105.126 47.3665C112.292 40.7397 122.018 36.9576 131.778 37.001C131.786 37.001 131.794 37.001 131.802 37.001H614.438C614.463 37.0008 614.539 37 614.514 37V37Z" fill="#F6F5F4" fill-opacity="0.256114"/>
<g clip-path="url(#clip0_4_2)">
<path d="M296.228 260.877V306.491H341.842L296.228 260.877Z" fill="white"/>
<path d="M250.614 169.649V352.105L296.228 306.491V352.105H250.614V374.912H455.877L250.614 169.649Z" fill="url(#paint0_linear_4_2)"/>
<path d="M205 283.684V306.491H227.807L205 283.684Z" fill="#E66100"/>
<path d="M227.807 329.298V306.491H250.614L227.807 329.298Z" fill="#F66151"/>
<path d="M501.491 32.8069V78.4209H547.105L501.491 32.8069Z" fill="#A34888"/>
<path d="M547.105 55.6139V32.8069H569.912L547.105 55.6139Z" fill="#9342A9"/>
<path d="M387.456 238.07V306.491H455.877L387.456 238.07Z" fill="#E66100"/>
<path d="M455.877 374.912V306.491H524.298L455.877 374.912Z" fill="#F66151"/>
<path d="M410.263 10V151.91L374.786 116.433V151.91H410.263V169.649H250.614L410.263 10Z" fill="url(#paint1_linear_4_2)"/>
<path d="M410.263 169.649V311.559L445.741 276.082V311.559H410.263V329.298H569.912L410.263 169.649Z" fill="#E66100"/>
<path d="M501.491 124.035V78.421H455.877L501.491 124.035Z" fill="url(#paint2_linear_4_2)"/>
<path d="M410.263 78.421V124.035H455.877L410.263 78.421Z" fill="#A34888"/>
<path d="M296.228 78.4209V32.8069H341.842L296.228 78.4209Z" fill="#A34888"/>
<path d="M492.476 126.316H343.255C329.879 126.316 319.035 137.325 319.035 150.904V309.271C319.035 322.851 329.879 333.86 343.255 333.86H492.476C505.852 333.86 516.696 322.851 516.696 309.271V150.904C516.696 137.325 505.852 126.316 492.476 126.316Z" fill="black" fill-opacity="0.102362"/>
<path d="M492.476 124.035H343.255C329.879 124.035 319.035 135.044 319.035 148.624V304.71C319.035 318.29 329.879 329.298 343.255 329.298H492.476C505.852 329.298 516.696 318.29 516.696 304.71V148.624C516.696 135.044 505.852 124.035 492.476 124.035Z" fill="#F6F5F4"/>
<path d="M343.256 124.035C329.838 124.035 319.035 135.001 319.035 148.623V184.854H516.696V148.623C516.696 135.001 505.893 124.035 492.475 124.035H343.256Z" fill="#DEDDDA"/>
<path d="M478.675 144.562C478.073 144.564 477.497 144.804 477.072 145.23C476.644 145.657 476.404 146.237 476.404 146.842C476.404 147.447 476.644 148.027 477.072 148.455L483.062 154.445L477.072 160.434C476.644 160.862 476.404 161.442 476.404 162.047C476.404 162.652 476.644 163.232 477.072 163.659C477.499 164.087 478.079 164.327 478.684 164.327C479.289 164.327 479.869 164.087 480.297 163.659L486.287 157.67L492.276 163.659C492.704 164.087 493.284 164.327 493.889 164.327C494.494 164.327 495.074 164.087 495.501 163.659C495.929 163.232 496.169 162.652 496.169 162.047C496.169 161.442 495.929 160.862 495.501 160.434L489.512 154.445L495.501 148.455C495.929 148.027 496.169 147.447 496.169 146.842C496.169 146.237 495.929 145.657 495.501 145.23C495.289 145.017 495.036 144.848 494.757 144.733C494.479 144.619 494.18 144.56 493.879 144.562C493.278 144.564 492.702 144.804 492.276 145.23L486.287 151.22L480.297 145.23C480.084 145.017 479.831 144.848 479.553 144.733C479.274 144.619 478.976 144.56 478.675 144.562V144.562Z" fill="white"/>
<path d="M516.696 182.968H319.035V184.854H516.696V182.968Z" fill="#C0BFBC"/>
<path opacity="0.05" d="M399.4 210.344C400.327 210.344 401.244 210.526 402.101 210.881C402.957 211.236 403.735 211.756 404.391 212.411C405.046 213.067 405.566 213.845 405.921 214.701C406.276 215.558 406.458 216.475 406.458 217.402V251.283C406.458 251.468 406.495 251.652 406.566 251.823C406.637 251.995 406.741 252.15 406.872 252.281C407.003 252.412 407.158 252.516 407.33 252.587C407.501 252.658 407.684 252.695 407.87 252.695H408.34C408.715 252.695 409.074 252.546 409.339 252.281C409.603 252.017 409.752 251.658 409.752 251.283V247.519C409.752 246.653 409.922 245.797 410.254 244.997C410.585 244.198 411.07 243.472 411.682 242.86C412.293 242.248 413.02 241.763 413.819 241.432C414.618 241.101 415.475 240.931 416.34 240.931C418.087 240.931 419.763 241.625 420.998 242.86C422.234 244.096 422.928 245.771 422.928 247.519V251.283C422.928 251.468 422.964 251.652 423.035 251.823C423.106 251.995 423.21 252.15 423.341 252.281C423.473 252.412 423.628 252.516 423.799 252.587C423.971 252.658 424.154 252.695 424.34 252.695H424.81C425.185 252.695 425.544 252.546 425.808 252.281C426.073 252.017 426.222 251.658 426.222 251.283V247.519C426.222 246.653 426.392 245.797 426.723 244.997C427.054 244.198 427.54 243.472 428.151 242.86C428.763 242.248 429.489 241.763 430.289 241.432C431.088 241.101 431.945 240.931 432.81 240.931C434.557 240.931 436.233 241.625 437.468 242.86C438.704 244.096 439.398 245.771 439.398 247.519V251.283C439.398 251.468 439.434 251.652 439.505 251.823C439.576 251.995 439.68 252.15 439.811 252.281C439.942 252.412 440.098 252.516 440.269 252.587C440.44 252.658 440.624 252.695 440.809 252.695H441.28C441.654 252.695 442.013 252.546 442.278 252.281C442.543 252.017 442.692 251.658 442.692 251.283V250.813C442.692 249.947 442.862 249.091 443.193 248.291C443.524 247.492 444.01 246.766 444.621 246.154C445.233 245.542 445.959 245.057 446.759 244.726C447.558 244.395 448.414 244.225 449.28 244.225C451.027 244.225 452.703 244.919 453.938 246.154C455.173 247.39 455.868 249.065 455.868 250.813V285.634C455.868 287.488 455.502 289.324 454.793 291.037C454.084 292.749 453.044 294.306 451.733 295.617C450.422 296.927 448.866 297.967 447.153 298.677C445.44 299.386 443.604 299.751 441.751 299.751H404.105C401.122 299.751 398.167 299.164 395.41 298.022C392.654 296.88 390.149 295.206 388.039 293.097L365.682 270.74C364.592 269.649 363.932 268.203 363.822 266.665C363.713 265.127 364.162 263.601 365.087 262.368L365.48 261.844C366.374 260.652 367.696 259.855 369.167 259.62C370.638 259.385 372.143 259.732 373.363 260.586L386.559 269.822C387.109 270.208 387.755 270.435 388.426 270.479C389.097 270.523 389.767 270.382 390.363 270.071C390.96 269.761 391.459 269.293 391.808 268.718C392.157 268.143 392.341 267.484 392.341 266.812V217.402C392.341 215.53 393.085 213.735 394.409 212.411C395.732 211.088 397.528 210.344 399.4 210.344V210.344Z" fill="black"/>
<path d="M399.4 208.462C400.326 208.462 401.244 208.644 402.101 208.999C402.957 209.354 403.735 209.874 404.391 210.529C405.046 211.184 405.566 211.963 405.921 212.819C406.275 213.675 406.458 214.593 406.458 215.52V249.401C406.458 249.775 406.607 250.134 406.872 250.399C407.136 250.664 407.495 250.813 407.87 250.813H408.34C408.715 250.813 409.074 250.664 409.339 250.399C409.603 250.134 409.752 249.775 409.752 249.401V211.422C409.752 210.63 409.908 209.845 410.211 209.113C410.515 208.381 410.959 207.716 411.519 207.156C412.08 206.595 412.745 206.151 413.477 205.848C414.209 205.544 414.993 205.388 415.786 205.388H416.894C417.686 205.388 418.471 205.544 419.203 205.848C419.935 206.151 420.6 206.595 421.161 207.156C421.721 207.716 422.165 208.381 422.469 209.113C422.772 209.845 422.928 210.63 422.928 211.422V249.401C422.928 249.775 423.077 250.134 423.341 250.399C423.606 250.664 423.965 250.813 424.34 250.813H424.81C425.185 250.813 425.544 250.664 425.808 250.399C426.073 250.134 426.222 249.775 426.222 249.401V211.422C426.222 210.63 426.378 209.845 426.681 209.113C426.984 208.381 427.429 207.716 427.989 207.156C428.549 206.595 429.214 206.151 429.947 205.848C430.679 205.544 431.463 205.388 432.256 205.388H433.364C434.156 205.388 434.941 205.544 435.673 205.848C436.405 206.151 437.07 206.595 437.63 207.156C438.191 207.716 438.635 208.381 438.938 209.113C439.242 209.845 439.398 210.63 439.398 211.422V249.401C439.398 249.775 439.546 250.134 439.811 250.399C440.076 250.664 440.435 250.813 440.809 250.813H441.28C441.654 250.813 442.013 250.664 442.278 250.399C442.543 250.134 442.692 249.775 442.692 249.401V225.936C442.692 225.144 442.848 224.359 443.151 223.627C443.454 222.895 443.899 222.23 444.459 221.67C445.019 221.109 445.684 220.665 446.416 220.362C447.148 220.058 447.933 219.902 448.725 219.902H449.834C450.626 219.902 451.411 220.058 452.143 220.362C452.875 220.665 453.54 221.109 454.1 221.67C454.66 222.23 455.105 222.895 455.408 223.627C455.711 224.359 455.867 225.144 455.867 225.936V283.752C455.867 285.606 455.502 287.442 454.793 289.155C454.083 290.867 453.044 292.423 451.733 293.734C450.422 295.045 448.866 296.085 447.153 296.795C445.44 297.504 443.604 297.869 441.75 297.869H404.105C401.121 297.869 398.167 297.281 395.41 296.14C392.654 294.998 390.149 293.324 388.039 291.214L366.403 269.578C365.133 268.309 364.385 266.61 364.306 264.817C364.226 263.023 364.821 261.265 365.974 259.889L365.977 259.884C367.166 258.464 368.862 257.565 370.704 257.377C372.546 257.19 374.389 257.73 375.839 258.881L386.814 267.598C387.316 267.997 387.92 268.246 388.557 268.316C389.194 268.387 389.838 268.277 390.415 267.998C390.992 267.72 391.479 267.284 391.82 266.741C392.16 266.198 392.341 265.57 392.341 264.93V215.52C392.341 213.648 393.085 211.853 394.408 210.529C395.732 209.205 397.528 208.462 399.4 208.462V208.462Z" fill="#3D3846"/>
<path d="M364.703 262.455C363.765 264.828 364.738 267.885 366.543 269.69L388.039 291.214C392.3 295.475 398.079 297.869 404.105 297.869H441.751C449.547 297.869 455.868 291.549 455.868 283.752V279.047C455.868 286.843 449.547 293.164 441.751 293.164H404.105C398.079 293.164 392.3 290.77 388.039 286.509L366.131 264.631C365.511 264.011 365.025 263.27 364.703 262.455V262.455Z" fill="#241F31"/>
<path d="M457.768 206.58C461.235 208.582 464.114 211.461 466.116 214.928C468.118 218.395 469.172 222.328 469.172 226.332" stroke="#5E5C64" stroke-width="3.76218" stroke-linecap="round"/>
<path d="M463.084 192.076C469.398 195.548 474.641 200.541 478.287 206.554C481.932 212.567 483.851 219.388 483.851 226.332" stroke="#9A9996" stroke-width="3.76218" stroke-linecap="round"/>
<path d="M355.137 238.845C351.669 240.847 348.79 243.726 346.789 247.193C344.787 250.66 343.733 254.593 343.733 258.597C343.733 262.6 344.787 266.533 346.789 270C348.79 273.467 351.669 276.346 355.137 278.348" stroke="#5E5C64" stroke-width="3.76218" stroke-linecap="round"/>
<path d="M349.82 224.341C343.507 227.813 338.263 232.806 334.618 238.819C330.973 244.832 329.054 251.653 329.054 258.597C329.054 265.54 330.973 272.361 334.618 278.374C338.263 284.387 343.507 289.381 349.82 292.852" stroke="#9A9996" stroke-width="3.76218" stroke-linecap="round"/>
<path d="M237.61 59.4153H332.039C337.47 59.4153 341.842 63.7874 341.842 69.2181V140.84C341.842 146.271 337.47 150.643 332.039 150.643H319.035V155.965H237.61C232.179 155.965 227.807 151.593 227.807 146.162V69.2181C227.807 63.7874 232.179 59.4153 237.61 59.4153Z" fill="black" fill-opacity="0.102362"/>
<path d="M332.039 55.614H237.61C232.196 55.614 227.807 60.0029 227.807 65.4169V137.039C227.807 142.453 232.196 146.842 237.61 146.842H332.039C337.453 146.842 341.842 142.453 341.842 137.039V65.4169C341.842 60.0029 337.453 55.614 332.039 55.614Z" fill="#E01B24"/>
<path d="M276.511 86.7404C273.675 86.7404 270.956 87.8669 268.95 89.8721C266.945 91.8773 265.819 94.5969 265.819 97.4327C265.819 98.8583 266.104 100.27 266.657 101.583C267.211 102.897 268.021 104.087 269.041 105.083L268.922 105.144L284.772 120.994L300.622 105.144L300.582 105.124C301.614 104.127 302.436 102.932 302.996 101.61C303.557 100.289 303.846 98.8682 303.846 97.4326C303.846 94.5969 302.72 91.8772 300.715 89.8721C298.709 87.8669 295.99 86.7404 293.154 86.7404C291.558 86.7404 289.982 87.0978 288.542 87.7864C287.102 88.4749 285.835 89.477 284.833 90.7193C283.83 89.477 282.563 88.4749 281.123 87.7864C279.683 87.0978 278.107 86.7404 276.511 86.7404V86.7404Z" fill="white"/>
</g>
<defs>
<linearGradient id="paint0_linear_4_2" x1="250.614" y1="374.912" x2="524.298" y2="215.263" gradientUnits="userSpaceOnUse">
<stop stop-color="#E66100"/>
<stop offset="1" stop-color="#9141AC"/>
</linearGradient>
<linearGradient id="paint1_linear_4_2" x1="615.526" y1="329.298" x2="303.846" y2="120.994" gradientUnits="userSpaceOnUse">
<stop stop-color="#E01B24"/>
<stop offset="1" stop-color="#DD5D13"/>
</linearGradient>
<linearGradient id="paint2_linear_4_2" x1="487.08" y1="78.421" x2="508.571" y2="126.316" gradientUnits="userSpaceOnUse">
<stop stop-color="#A34888"/>
<stop offset="1" stop-color="#E66100"/>
</linearGradient>
<clipPath id="clip0_4_2">
<rect width="390" height="390" fill="white" transform="translate(205 10)"/>
</clipPath>
</defs>
</svg>
