<svg width="1144" height="409" viewBox="0 0 1144 409" fill="none" xmlns="http://www.w3.org/2000/svg">
<path d="M289.156 17.725C211.569 17.725 197.015 128.233 240.662 128.233C284.302 128.233 366.745 17.725 289.156 17.725Z" fill="white"/>
<path d="M160.325 114.539C183.565 115.958 209.062 25.8519 165.384 31.519C121.721 37.1862 137.077 113.12 160.325 114.539Z" fill="white"/>
<path d="M53.82 170.529C70.3484 163.254 55.9488 92.0915 27.8433 111.499C-0.24953 130.91 37.2917 177.802 53.82 170.529Z" fill="white"/>
<path d="M100.39 133.282C120.066 129.27 121.145 48.5616 86.0569 63.04C50.9629 77.5217 80.7304 137.299 100.39 133.282Z" fill="white"/>
<path d="M203.133 313.895C206.624 340.556 183.574 353.723 161 336.535C89.1377 281.822 279.985 254.527 267.405 179.779C256.963 117.734 66.5922 136.836 44.9139 233.918C30.2399 299.581 105.316 390.677 183.653 390.677C222.191 390.677 266.642 355.88 274.958 311.798C281.309 278.183 200.219 291.652 203.133 313.895Z" fill="white"/>
<path d="M685.481 148.328C665.943 148.854 650.514 155.876 639.167 169.343C627.416 183.357 621.506 202.722 621.506 227.417C621.506 252.045 627.417 271.356 639.167 285.37C650.975 299.385 667.187 306.385 687.865 306.385C708.601 306.385 724.854 299.385 736.604 285.37C748.354 271.356 754.224 252.045 754.224 227.417C754.224 202.722 748.354 183.357 736.604 169.343C724.854 155.328 708.601 148.328 687.865 148.328C687.057 148.328 686.275 148.306 685.481 148.328ZM686.936 176.779C687.248 176.77 687.548 176.779 687.865 176.779C698.06 176.779 705.96 181.191 711.548 190.034C717.135 198.879 719.953 211.362 719.954 227.417C719.954 243.405 717.134 255.794 711.548 264.638C705.96 273.482 698.06 277.934 687.865 277.934C677.727 277.934 669.891 273.482 664.304 264.638C658.717 255.794 655.898 243.405 655.898 227.417C655.898 211.362 658.717 198.879 664.304 190.034C669.717 181.467 677.252 177.047 686.936 176.779Z" fill="white"/>
<path d="M464.769 292.099C447.559 306.552 421.954 306.386 411.287 306.386C389.802 306.386 372.781 299.31 360.225 285.16C347.668 270.941 341.389 251.688 341.389 227.401C341.389 202.842 347.783 183.521 360.57 169.438C373.357 155.356 390.868 148.315 413.101 148.315C421.684 148.315 429.892 149.267 437.725 151.172C445.616 153.077 453.047 155.9 460.017 159.642L451.066 186.102C447.148 183.957 442.662 181.843 438.503 180.357C431.418 177.976 424.304 176.786 417.162 176.786C403.914 176.786 393.69 181.174 386.49 189.95C379.347 198.658 375.777 211.142 375.777 227.401C375.777 243.525 379.232 255.974 386.145 264.75C393.056 273.526 403.444 277.914 415.607 277.914C427.963 277.914 435.617 274.8 439.699 271.518V245.157H412.928V218.829H464.769" fill="white"/>
<path d="M487.505 151.07H508.492L574.806 242.634V151.07H603.109V303.426H582.122L515.808 211.862V303.426H487.505V151.07Z" fill="white"/>
<path d="M776.059 151.07H818.395L847.771 246.185L877.32 151.07H913.103L929.269 303.426H897.819L888.12 208.156L858.398 303.883H837.317L807.595 204.923L797.896 303.426H766.36L782.525 151.07" fill="white"/>
<path d="M951.969 151.07H1041.74V180.766H985.233V212.368H1028.67V238.83H985.233V273.73H1043.64V303.426H951.969V151.07Z" fill="white"/>
<path d="M1073.2 122.56V119.459H1094.85V122.56H1085.77V148.324H1082.27V122.56H1073.2ZM1100.24 119.459H1104.41L1114.22 143.419H1114.56L1124.37 119.459H1128.54V148.324H1125.27V126.393H1124.99L1115.97 148.324H1112.81L1103.79 126.393H1103.51V148.324H1100.24V119.459Z" fill="white"/>
</svg>
