<?xml version="1.0" encoding="UTF-8" standalone="no"?>
<svg
   inkscape:export-ydpi="96"
   inkscape:export-xdpi="96"
   inkscape:export-filename="/var/home/jimmac/SparkleShare/app-illustrations/assets/gtk/wall-docs.png"
   width="800"
   height="400"
   version="1.1"
   id="svg26"
   sodipodi:docname="wall-community.svg"
   inkscape:version="1.2.1 (9c6d41e410, 2022-07-14)"
   xmlns:inkscape="http://www.inkscape.org/namespaces/inkscape"
   xmlns:sodipodi="http://sodipodi.sourceforge.net/DTD/sodipodi-0.dtd"
   xmlns:xlink="http://www.w3.org/1999/xlink"
   xmlns="http://www.w3.org/2000/svg"
   xmlns:svg="http://www.w3.org/2000/svg"
   xmlns:rdf="http://www.w3.org/1999/02/22-rdf-syntax-ns#"
   xmlns:cc="http://creativecommons.org/ns#"
   xmlns:dc="http://purl.org/dc/elements/1.1/">
  <metadata
     id="metadata32">
    <rdf:RDF>
      <cc:Work
         rdf:about="">
        <dc:format>image/svg+xml</dc:format>
        <dc:type
           rdf:resource="http://purl.org/dc/dcmitype/StillImage" />
      </cc:Work>
    </rdf:RDF>
  </metadata>
  <defs
     id="defs30">
    <inkscape:path-effect
       effect="fillet_chamfer"
       id="path-effect177"
       is_visible="true"
       lpeversion="1"
       satellites_param="F,0,0,1,0,0,0,1 @ F,0,0,1,0,124.88338,0,1 @ F,0,0,1,0,0,0,1 @ F,0,0,1,0,133.12805,0,1"
       unit="px"
       method="auto"
       mode="F"
       radius="0"
       chamfer_steps="1"
       flexible="false"
       use_knot_distance="true"
       apply_no_radius="true"
       apply_with_radius="true"
       only_selected="false"
       hide_knots="false"
       nodesatellites_param="F,0,0,1,0,0,0,1 @ F,0,0,1,0,124.88338,0,1 @ F,0,0,1,0,0,0,1 @ F,0,0,1,0,133.12805,0,1" />
    <inkscape:path-effect
       effect="fillet_chamfer"
       id="path-effect172"
       is_visible="true"
       lpeversion="1"
       satellites_param="F,0,0,1,0,0,0,1 @ F,0,0,1,0,124.88338,0,1 @ F,0,0,1,0,0,0,1 @ F,0,0,1,0,133.12805,0,1"
       unit="px"
       method="auto"
       mode="F"
       radius="0"
       chamfer_steps="1"
       flexible="false"
       use_knot_distance="true"
       apply_no_radius="true"
       apply_with_radius="true"
       only_selected="false"
       hide_knots="false"
       nodesatellites_param="F,0,0,1,0,0,0,1 @ F,0,0,1,0,124.88338,0,1 @ F,0,0,1,0,0,0,1 @ F,0,0,1,0,133.12805,0,1" />
    <inkscape:path-effect
       effect="fillet_chamfer"
       id="path-effect1200"
       is_visible="true"
       lpeversion="1"
       satellites_param="F,0,0,1,0,0,0,1 @ F,0,0,1,0,0,0,1 @ F,0,0,1,0,0,0,1 @ F,0,0,1,0,0,0,1"
       unit="px"
       method="auto"
       mode="F"
       radius="0"
       chamfer_steps="1"
       flexible="false"
       use_knot_distance="true"
       apply_no_radius="true"
       apply_with_radius="true"
       only_selected="false"
       hide_knots="false"
       nodesatellites_param="F,0,0,1,0,0,0,1 @ F,0,0,1,0,0,0,1 @ F,0,0,1,0,0,0,1 @ F,0,0,1,0,0,0,1" />
    <linearGradient
       inkscape:collect="always"
       id="linearGradient1195">
      <stop
         style="stop-color:#26a269;stop-opacity:1"
         offset="0"
         id="stop1191" />
      <stop
         style="stop-color:#1c71d8;stop-opacity:1"
         offset="1"
         id="stop1193" />
    </linearGradient>
    <inkscape:path-effect
       effect="fillet_chamfer"
       id="path-effect1187"
       is_visible="true"
       lpeversion="1"
       satellites_param="F,0,1,1,0,30.362282,0,1 @ F,0,1,1,0,30.362282,0,1 @ F,0,1,1,0,30.362282,0,1 @ F,0,1,1,0,30.362282,0,1 @ F,0,1,1,0,30.362282,0,1 @ F,0,1,1,0,30.362282,0,1 @ F,0,1,1,0,30.362282,0,1 @ F,0,1,1,0,30.362282,0,1 @ F,0,1,1,0,30.362282,0,1 @ F,0,1,1,0,30.362282,0,1 @ F,0,1,1,0,30.362282,0,1 @ F,0,1,1,0,30.362282,0,1 @ F,0,1,1,0,30.362282,0,1 @ F,0,1,1,0,30.362282,0,1 @ F,0,1,1,0,30.362282,0,1 @ F,0,1,1,0,30.362282,0,1 @ F,0,1,1,0,30.362282,0,1 @ F,0,1,1,0,30.362282,0,1 @ F,0,1,1,0,30.362282,0,1 @ F,0,1,1,0,30.362282,0,1 @ F,0,1,1,0,30.362282,0,1 @ F,0,1,1,0,30.362282,0,1 @ F,0,1,1,0,30.362282,0,1 @ F,0,1,1,0,30.362282,0,1 @ F,0,1,1,0,30.362282,0,1 @ F,0,1,1,0,30.362282,0,1 @ F,0,1,1,0,30.362282,0,1 @ F,0,1,1,0,30.362282,0,1 @ F,0,1,1,0,30.362282,0,1 @ F,0,1,1,0,30.362282,0,1 @ F,0,1,1,0,30.362282,0,1 @ F,0,1,1,0,30.362282,0,1 @ F,0,1,1,0,30.362282,0,1 @ F,0,1,1,0,30.362282,0,1 @ F,0,1,1,0,30.362282,0,1 @ F,0,1,1,0,30.362282,0,1 @ F,0,1,1,0,30.362282,0,1 @ F,0,1,1,0,30.362282,0,1 @ F,0,1,1,0,30.362282,0,1 @ F,0,1,1,0,30.362282,0,1 @ F,0,1,1,0,30.362282,0,1 @ F,0,1,1,0,30.362282,0,1 @ F,0,1,1,0,30.362282,0,1 @ F,0,1,1,0,30.362282,0,1 @ F,0,1,1,0,30.362282,0,1 @ F,0,1,1,0,30.362282,0,1 @ F,0,1,1,0,30.362282,0,1 @ F,0,1,1,0,30.362282,0,1 @ F,0,1,1,0,30.362282,0,1 @ F,0,1,1,0,30.362282,0,1 @ F,0,1,1,0,30.362282,0,1 @ F,0,1,1,0,30.362282,0,1 @ F,0,1,1,0,30.362282,0,1 @ F,0,1,1,0,30.362282,0,1 @ F,0,1,1,0,30.362282,0,1 @ F,0,1,1,0,30.362282,0,1 @ F,0,1,1,0,30.362282,0,1 @ F,0,1,1,0,30.362282,0,1 @ F,0,1,1,0,30.362282,0,1 @ F,0,0,1,0,30.362282,0,1"
       unit="px"
       method="auto"
       mode="F"
       radius="0"
       chamfer_steps="1"
       flexible="false"
       use_knot_distance="true"
       apply_no_radius="true"
       apply_with_radius="true"
       only_selected="false"
       hide_knots="false"
       nodesatellites_param="F,0,1,1,0,30.362282,0,1 @ F,0,1,1,0,30.362282,0,1 @ F,0,1,1,0,30.362282,0,1 @ F,0,1,1,0,30.362282,0,1 @ F,0,1,1,0,30.362282,0,1 @ F,0,1,1,0,30.362282,0,1 @ F,0,1,1,0,30.362282,0,1 @ F,0,1,1,0,30.362282,0,1 @ F,0,1,1,0,30.362282,0,1 @ F,0,1,1,0,30.362282,0,1 @ F,0,1,1,0,30.362282,0,1 @ F,0,1,1,0,30.362282,0,1 @ F,0,1,1,0,30.362282,0,1 @ F,0,1,1,0,30.362282,0,1 @ F,0,1,1,0,30.362282,0,1 @ F,0,1,1,0,30.362282,0,1 @ F,0,1,1,0,30.362282,0,1 @ F,0,1,1,0,30.362282,0,1 @ F,0,1,1,0,30.362282,0,1 @ F,0,1,1,0,30.362282,0,1 @ F,0,1,1,0,30.362282,0,1 @ F,0,1,1,0,30.362282,0,1 @ F,0,1,1,0,30.362282,0,1 @ F,0,1,1,0,30.362282,0,1 @ F,0,1,1,0,30.362282,0,1 @ F,0,1,1,0,30.362282,0,1 @ F,0,1,1,0,30.362282,0,1 @ F,0,1,1,0,30.362282,0,1 @ F,0,1,1,0,30.362282,0,1 @ F,0,1,1,0,30.362282,0,1 @ F,0,1,1,0,30.362282,0,1 @ F,0,1,1,0,30.362282,0,1 @ F,0,1,1,0,30.362282,0,1 @ F,0,1,1,0,30.362282,0,1 @ F,0,1,1,0,30.362282,0,1 @ F,0,1,1,0,30.362282,0,1 @ F,0,1,1,0,30.362282,0,1 @ F,0,1,1,0,30.362282,0,1 @ F,0,1,1,0,30.362282,0,1 @ F,0,1,1,0,30.362282,0,1 @ F,0,1,1,0,30.362282,0,1 @ F,0,1,1,0,30.362282,0,1 @ F,0,1,1,0,30.362282,0,1 @ F,0,1,1,0,30.362282,0,1 @ F,0,1,1,0,30.362282,0,1 @ F,0,1,1,0,30.362282,0,1 @ F,0,1,1,0,30.362282,0,1 @ F,0,1,1,0,30.362282,0,1 @ F,0,1,1,0,30.362282,0,1 @ F,0,1,1,0,30.362282,0,1 @ F,0,1,1,0,30.362282,0,1 @ F,0,1,1,0,30.362282,0,1 @ F,0,1,1,0,30.362282,0,1 @ F,0,1,1,0,30.362282,0,1 @ F,0,1,1,0,30.362282,0,1 @ F,0,1,1,0,30.362282,0,1 @ F,0,1,1,0,30.362282,0,1 @ F,0,1,1,0,30.362282,0,1 @ F,0,1,1,0,30.362282,0,1 @ F,0,0,1,0,30.362282,0,1" />
    <inkscape:path-effect
       effect="fillet_chamfer"
       id="path-effect1156"
       is_visible="true"
       lpeversion="1"
       satellites_param="F,0,1,1,0,30.362282,0,1 @ F,0,1,1,0,30.362282,0,1 @ F,0,1,1,0,30.362282,0,1 @ F,0,1,1,0,30.362282,0,1 @ F,0,1,1,0,30.362282,0,1 @ F,0,1,1,0,30.362282,0,1 @ F,0,1,1,0,30.362282,0,1 @ F,0,1,1,0,30.362282,0,1 @ F,0,1,1,0,30.362282,0,1 @ F,0,1,1,0,30.362282,0,1 @ F,0,1,1,0,30.362282,0,1 @ F,0,1,1,0,30.362282,0,1 @ F,0,1,1,0,30.362282,0,1 @ F,0,1,1,0,30.362282,0,1 @ F,0,1,1,0,30.362282,0,1 @ F,0,1,1,0,30.362282,0,1 @ F,0,1,1,0,30.362282,0,1 @ F,0,1,1,0,30.362282,0,1 @ F,0,1,1,0,30.362282,0,1 @ F,0,1,1,0,30.362282,0,1 @ F,0,1,1,0,30.362282,0,1 @ F,0,1,1,0,30.362282,0,1 @ F,0,1,1,0,30.362282,0,1 @ F,0,1,1,0,30.362282,0,1 @ F,0,1,1,0,30.362282,0,1 @ F,0,1,1,0,30.362282,0,1 @ F,0,1,1,0,30.362282,0,1 @ F,0,1,1,0,30.362282,0,1 @ F,0,1,1,0,30.362282,0,1 @ F,0,1,1,0,30.362282,0,1 @ F,0,1,1,0,30.362282,0,1 @ F,0,1,1,0,30.362282,0,1 @ F,0,1,1,0,30.362282,0,1 @ F,0,1,1,0,30.362282,0,1 @ F,0,1,1,0,30.362282,0,1 @ F,0,1,1,0,30.362282,0,1 @ F,0,1,1,0,30.362282,0,1 @ F,0,1,1,0,30.362282,0,1 @ F,0,1,1,0,30.362282,0,1 @ F,0,1,1,0,30.362282,0,1 @ F,0,1,1,0,30.362282,0,1 @ F,0,1,1,0,30.362282,0,1 @ F,0,1,1,0,30.362282,0,1 @ F,0,1,1,0,30.362282,0,1 @ F,0,1,1,0,30.362282,0,1 @ F,0,1,1,0,30.362282,0,1 @ F,0,1,1,0,30.362282,0,1 @ F,0,1,1,0,30.362282,0,1 @ F,0,1,1,0,30.362282,0,1 @ F,0,1,1,0,30.362282,0,1 @ F,0,1,1,0,30.362282,0,1 @ F,0,1,1,0,30.362282,0,1 @ F,0,1,1,0,30.362282,0,1 @ F,0,1,1,0,30.362282,0,1 @ F,0,1,1,0,30.362282,0,1 @ F,0,1,1,0,30.362282,0,1 @ F,0,1,1,0,30.362282,0,1 @ F,0,1,1,0,30.362282,0,1 @ F,0,1,1,0,30.362282,0,1 @ F,0,0,1,0,30.362282,0,1"
       unit="px"
       method="auto"
       mode="F"
       radius="0"
       chamfer_steps="1"
       flexible="false"
       use_knot_distance="true"
       apply_no_radius="true"
       apply_with_radius="true"
       only_selected="false"
       hide_knots="false"
       nodesatellites_param="F,0,1,1,0,30.362282,0,1 @ F,0,1,1,0,30.362282,0,1 @ F,0,1,1,0,30.362282,0,1 @ F,0,1,1,0,30.362282,0,1 @ F,0,1,1,0,30.362282,0,1 @ F,0,1,1,0,30.362282,0,1 @ F,0,1,1,0,30.362282,0,1 @ F,0,1,1,0,30.362282,0,1 @ F,0,1,1,0,30.362282,0,1 @ F,0,1,1,0,30.362282,0,1 @ F,0,1,1,0,30.362282,0,1 @ F,0,1,1,0,30.362282,0,1 @ F,0,1,1,0,30.362282,0,1 @ F,0,1,1,0,30.362282,0,1 @ F,0,1,1,0,30.362282,0,1 @ F,0,1,1,0,30.362282,0,1 @ F,0,1,1,0,30.362282,0,1 @ F,0,1,1,0,30.362282,0,1 @ F,0,1,1,0,30.362282,0,1 @ F,0,1,1,0,30.362282,0,1 @ F,0,1,1,0,30.362282,0,1 @ F,0,1,1,0,30.362282,0,1 @ F,0,1,1,0,30.362282,0,1 @ F,0,1,1,0,30.362282,0,1 @ F,0,1,1,0,30.362282,0,1 @ F,0,1,1,0,30.362282,0,1 @ F,0,1,1,0,30.362282,0,1 @ F,0,1,1,0,30.362282,0,1 @ F,0,1,1,0,30.362282,0,1 @ F,0,1,1,0,30.362282,0,1 @ F,0,1,1,0,30.362282,0,1 @ F,0,1,1,0,30.362282,0,1 @ F,0,1,1,0,30.362282,0,1 @ F,0,1,1,0,30.362282,0,1 @ F,0,1,1,0,30.362282,0,1 @ F,0,1,1,0,30.362282,0,1 @ F,0,1,1,0,30.362282,0,1 @ F,0,1,1,0,30.362282,0,1 @ F,0,1,1,0,30.362282,0,1 @ F,0,1,1,0,30.362282,0,1 @ F,0,1,1,0,30.362282,0,1 @ F,0,1,1,0,30.362282,0,1 @ F,0,1,1,0,30.362282,0,1 @ F,0,1,1,0,30.362282,0,1 @ F,0,1,1,0,30.362282,0,1 @ F,0,1,1,0,30.362282,0,1 @ F,0,1,1,0,30.362282,0,1 @ F,0,1,1,0,30.362282,0,1 @ F,0,1,1,0,30.362282,0,1 @ F,0,1,1,0,30.362282,0,1 @ F,0,1,1,0,30.362282,0,1 @ F,0,1,1,0,30.362282,0,1 @ F,0,1,1,0,30.362282,0,1 @ F,0,1,1,0,30.362282,0,1 @ F,0,1,1,0,30.362282,0,1 @ F,0,1,1,0,30.362282,0,1 @ F,0,1,1,0,30.362282,0,1 @ F,0,1,1,0,30.362282,0,1 @ F,0,1,1,0,30.362282,0,1 @ F,0,0,1,0,30.362282,0,1" />
    <inkscape:path-effect
       effect="fillet_chamfer"
       id="path-effect1071"
       is_visible="true"
       lpeversion="1"
       satellites_param="F,0,0,1,0,0,0,1 @ F,0,0,1,0,59.087891,0,1 @ F,0,0,1,0,59.087891,0,1 @ F,0,0,1,0,60.533204,0,1 @ F,0,1,1,0,60.533204,0,1 @ F,0,0,1,0,0,0,1 @ F,0,0,1,0,0,0,1"
       unit="px"
       method="auto"
       mode="F"
       radius="0"
       chamfer_steps="1"
       flexible="false"
       use_knot_distance="true"
       apply_no_radius="true"
       apply_with_radius="true"
       only_selected="false"
       hide_knots="false"
       nodesatellites_param="F,0,0,1,0,0,0,1 @ F,0,0,1,0,59.087891,0,1 @ F,0,0,1,0,59.087891,0,1 @ F,0,0,1,0,60.533204,0,1 @ F,0,1,1,0,60.533204,0,1 @ F,0,0,1,0,0,0,1 @ F,0,0,1,0,0,0,1" />
    <inkscape:path-effect
       effect="fillet_chamfer"
       id="path-effect1067"
       is_visible="true"
       lpeversion="1"
       satellites_param="F,0,0,1,0,0,0,1 @ F,0,1,1,0,81.27344,0,1 @ F,0,0,1,0,89.958985,0,1 @ F,0,0,1,0,60.181641,0,1 @ F,0,0,1,0,60.181641,0,1 @ F,0,0,1,0,0,0,1"
       unit="px"
       method="auto"
       mode="F"
       radius="0"
       chamfer_steps="1"
       flexible="false"
       use_knot_distance="true"
       apply_no_radius="true"
       apply_with_radius="true"
       only_selected="false"
       hide_knots="false"
       nodesatellites_param="F,0,0,1,0,0,0,1 @ F,0,1,1,0,81.27344,0,1 @ F,0,0,1,0,89.958985,0,1 @ F,0,0,1,0,60.181641,0,1 @ F,0,0,1,0,60.181641,0,1 @ F,0,0,1,0,0,0,1" />
    <inkscape:path-effect
       effect="fillet_chamfer"
       id="path-effect5879"
       is_visible="true"
       lpeversion="1"
       satellites_param="F,0,0,1,0,0,0,1 @ F,0,0,1,0,15,0,1 @ F,0,0,1,0,15,0,1 @ F,0,0,1,0,15,0,1 @ F,0,0,1,0,15,0,1 @ F,0,0,1,0,15,0,1 @ F,0,0,1,0,15,0,1 @ F,0,0,1,0,15,0,1 @ F,0,0,1,0,15,0,1 @ F,0,0,1,0,15,0,1 @ F,0,0,1,0,15,0,1 @ F,0,0,1,0,0,0,1"
       unit="px"
       method="auto"
       mode="F"
       radius="15"
       chamfer_steps="1"
       flexible="false"
       use_knot_distance="true"
       apply_no_radius="true"
       apply_with_radius="true"
       only_selected="false"
       hide_knots="false"
       nodesatellites_param="F,0,0,1,0,0,0,1 @ F,0,0,1,0,15,0,1 @ F,0,0,1,0,15,0,1 @ F,0,0,1,0,15,0,1 @ F,0,0,1,0,15,0,1 @ F,0,0,1,0,15,0,1 @ F,0,0,1,0,15,0,1 @ F,0,0,1,0,15,0,1 @ F,0,0,1,0,15,0,1 @ F,0,0,1,0,15,0,1 @ F,0,0,1,0,15,0,1 @ F,0,0,1,0,0,0,1" />
    <inkscape:path-effect
       effect="fillet_chamfer"
       id="path-effect5877"
       is_visible="true"
       lpeversion="1"
       satellites_param="F,0,0,1,0,0,0,1 @ F,0,0,1,0,15,0,1 @ F,0,0,1,0,15,0,1 @ F,0,0,1,0,15,0,1 @ F,0,0,1,0,15,0,1 @ F,0,0,1,0,0,0,1"
       unit="px"
       method="auto"
       mode="F"
       radius="15"
       chamfer_steps="1"
       flexible="false"
       use_knot_distance="true"
       apply_no_radius="true"
       apply_with_radius="true"
       only_selected="false"
       hide_knots="false"
       nodesatellites_param="F,0,0,1,0,0,0,1 @ F,0,0,1,0,15,0,1 @ F,0,0,1,0,15,0,1 @ F,0,0,1,0,15,0,1 @ F,0,0,1,0,15,0,1 @ F,0,0,1,0,0,0,1" />
    <inkscape:path-effect
       hide_knots="false"
       only_selected="false"
       apply_with_radius="true"
       apply_no_radius="true"
       use_knot_distance="true"
       flexible="false"
       chamfer_steps="1"
       radius="15"
       mode="F"
       method="auto"
       unit="px"
       satellites_param="F,0,0,1,0,0,0,1 @ F,0,0,1,0,15,0,1 @ F,0,0,1,0,15,0,1 @ F,0,0,1,0,15,0,1 @ F,0,0,1,0,15,0,1 @ F,0,0,1,0,15,0,1"
       lpeversion="1"
       is_visible="true"
       id="path-effect5844"
       effect="fillet_chamfer"
       nodesatellites_param="F,0,0,1,0,0,0,1 @ F,0,0,1,0,15,0,1 @ F,0,0,1,0,15,0,1 @ F,0,0,1,0,15,0,1 @ F,0,0,1,0,15,0,1 @ F,0,0,1,0,15,0,1" />
    <inkscape:path-effect
       effect="fillet_chamfer"
       id="path-effect5824"
       is_visible="true"
       lpeversion="1"
       satellites_param="F,0,0,1,0,0,0,1 @ F,0,0,1,0,15,0,1 @ F,0,0,1,0,15,0,1 @ F,0,0,1,0,15,0,1 @ F,0,0,1,0,15,0,1 @ F,0,0,1,0,15,0,1 @ F,0,0,1,0,15,0,1 @ F,0,0,1,0,15,0,1 @ F,0,0,1,0,15,0,1 @ F,0,0,1,0,15,0,1 @ F,0,0,1,0,15,0,1 @ F,0,0,1,0,15,0,1"
       unit="px"
       method="auto"
       mode="F"
       radius="15"
       chamfer_steps="1"
       flexible="false"
       use_knot_distance="true"
       apply_no_radius="true"
       apply_with_radius="true"
       only_selected="false"
       hide_knots="false"
       nodesatellites_param="F,0,0,1,0,0,0,1 @ F,0,0,1,0,15,0,1 @ F,0,0,1,0,15,0,1 @ F,0,0,1,0,15,0,1 @ F,0,0,1,0,15,0,1 @ F,0,0,1,0,15,0,1 @ F,0,0,1,0,15,0,1 @ F,0,0,1,0,15,0,1 @ F,0,0,1,0,15,0,1 @ F,0,0,1,0,15,0,1 @ F,0,0,1,0,15,0,1 @ F,0,0,1,0,15,0,1" />
    <inkscape:path-effect
       hide_knots="false"
       only_selected="false"
       apply_with_radius="true"
       apply_no_radius="true"
       use_knot_distance="true"
       flexible="false"
       chamfer_steps="1"
       radius="15"
       mode="F"
       method="auto"
       unit="px"
       satellites_param="F,0,0,1,0,0,0,1 @ F,0,0,1,0,15,0,1 @ F,0,0,1,0,15,0,1 @ F,0,0,1,0,15,0,1 @ F,0,0,1,0,15,0,1 @ F,0,0,1,0,15,0,1 @ F,0,0,1,0,15,0,1 @ F,0,0,1,0,15,0,1 @ F,0,0,1,0,15,0,1 @ F,0,0,1,0,15,0,1 @ F,0,0,1,0,15,0,1 @ F,0,0,1,0,15,0,1"
       lpeversion="1"
       is_visible="true"
       id="path-effect5820"
       effect="fillet_chamfer"
       nodesatellites_param="F,0,0,1,0,0,0,1 @ F,0,0,1,0,15,0,1 @ F,0,0,1,0,15,0,1 @ F,0,0,1,0,15,0,1 @ F,0,0,1,0,15,0,1 @ F,0,0,1,0,15,0,1 @ F,0,0,1,0,15,0,1 @ F,0,0,1,0,15,0,1 @ F,0,0,1,0,15,0,1 @ F,0,0,1,0,15,0,1 @ F,0,0,1,0,15,0,1 @ F,0,0,1,0,15,0,1" />
    <clipPath
       clipPathUnits="userSpaceOnUse"
       id="clipPath11679">
      <circle
         r="19.711458"
         cy="77.263527"
         cx="239.05104"
         id="circle11681"
         style="opacity:1;vector-effect:none;fill:#9141ac;fill-opacity:1;stroke:none;stroke-width:0.529167;stroke-linecap:round;stroke-linejoin:miter;stroke-miterlimit:4;stroke-dasharray:none;stroke-dashoffset:0;stroke-opacity:1;marker:none;marker-start:none;marker-mid:none;marker-end:none;paint-order:normal" />
    </clipPath>
    <clipPath
       clipPathUnits="userSpaceOnUse"
       id="clipPath2997">
      <path
         sodipodi:nodetypes="ssccccs"
         d="m 620.87951,127.24609 c -8.64563,0 -15.65429,7.00867 -15.65429,15.6543 0,8.64563 7.00866,15.6543 15.65429,15.6543 0.23969,-3.6e-4 0.47933,-0.006 0.71875,-0.0176 h 226.75772 v -31.29102 z"
         style="opacity:1;fill:#f66151;fill-opacity:1;stroke-width:6;stroke-linecap:round;stop-color:#000000"
         id="path2999" />
    </clipPath>
    <clipPath
       id="clipPath11679-3"
       clipPathUnits="userSpaceOnUse">
      <circle
         style="opacity:1;vector-effect:none;fill:#9141ac;fill-opacity:1;stroke:none;stroke-width:0.529167;stroke-linecap:round;stroke-linejoin:miter;stroke-miterlimit:4;stroke-dasharray:none;stroke-dashoffset:0;stroke-opacity:1;marker:none;marker-start:none;marker-mid:none;marker-end:none;paint-order:normal"
         id="circle11681-6"
         cx="239.05104"
         cy="77.263527"
         r="19.711458" />
    </clipPath>
    <clipPath
       id="clipPath1046"
       clipPathUnits="userSpaceOnUse">
      <circle
         style="fill:#1a5fb4;fill-opacity:1;stroke-width:10.5293;stroke-linecap:round;stop-color:#000000"
         id="circle1048"
         cx="343.91562"
         cy="358.41229"
         r="130.41228" />
    </clipPath>
    <clipPath
       id="clipPath1147"
       clipPathUnits="userSpaceOnUse">
      <circle
         style="fill:#1a5fb4;fill-opacity:1;stroke-width:8.77403;stroke-linecap:round;stop-color:#000000"
         id="circle1149"
         cx="583"
         cy="597.49664"
         r="108.6721" />
    </clipPath>
    <clipPath
       id="clipPath1200"
       clipPathUnits="userSpaceOnUse">
      <circle
         style="fill:#1a5fb4;fill-opacity:1;stroke-width:3.2322;stroke-linecap:round;stop-color:#000000"
         id="circle1202"
         cx="450.31772"
         cy="793.7005"
         r="40.03297" />
    </clipPath>
    <clipPath
       id="clipPath1214"
       clipPathUnits="userSpaceOnUse">
      <circle
         style="fill:#1a5fb4;fill-opacity:1;stroke-width:3.08057;stroke-linecap:round;stop-color:#000000"
         id="circle1216"
         cx="319.34473"
         cy="652.46106"
         r="38.150566" />
    </clipPath>
    <clipPath
       id="clipPath1246"
       clipPathUnits="userSpaceOnUse">
      <circle
         r="32.585896"
         cy="649.54431"
         cx="858.4187"
         id="circle1248"
         style="fill:#1a5fb4;fill-opacity:1;stroke-width:2.63066;stroke-linecap:round;stop-color:#000000" />
    </clipPath>
    <clipPath
       id="clipPath1297"
       clipPathUnits="userSpaceOnUse">
      <circle
         r="73.727577"
         cy="352.65491"
         cx="751.521"
         id="circle1299"
         style="fill:#1a5fb4;fill-opacity:1;stroke-width:5.95265;stroke-linecap:round;stop-color:#000000" />
    </clipPath>
    <linearGradient
       xlink:href="#h"
       id="i"
       x1="342.914"
       y1="17.349001"
       x2="342.914"
       y2="201.142"
       gradientUnits="userSpaceOnUse"
       gradientTransform="matrix(0.76808629,0,0,0.76808629,480.73756,616.23615)" />
    <linearGradient
       id="h">
      <stop
         offset="0"
         stop-color="#051224"
         id="stop2" />
      <stop
         offset="1"
         stop-color="#3584e4"
         id="stop4" />
    </linearGradient>
    <linearGradient
       inkscape:collect="always"
       xlink:href="#linearGradient1195"
       id="linearGradient1183"
       gradientUnits="userSpaceOnUse"
       gradientTransform="matrix(0.39096893,0,0,-0.39096893,657.74097,496.05408)"
       x1="-1101.6094"
       y1="339.32809"
       x2="-332.27734"
       y2="1108.6602" />
  </defs>
  <sodipodi:namedview
     pagecolor="#ffffff"
     bordercolor="#666666"
     borderopacity="1"
     objecttolerance="10"
     gridtolerance="10"
     guidetolerance="10"
     inkscape:pageopacity="1"
     inkscape:pageshadow="2"
     inkscape:window-width="2560"
     inkscape:window-height="1376"
     id="namedview28"
     showgrid="false"
     inkscape:zoom="0.5"
     inkscape:cx="424.63316"
     inkscape:cy="556.92959"
     inkscape:window-x="26"
     inkscape:window-y="23"
     inkscape:window-maximized="0"
     inkscape:current-layer="layer1"
     inkscape:document-rotation="0"
     inkscape:pagecheckerboard="false"
     inkscape:snap-global="true"
     inkscape:snap-nodes="true"
     inkscape:snap-bbox="true"
     inkscape:snap-bbox-midpoints="false"
     inkscape:bbox-paths="true"
     inkscape:bbox-nodes="true"
     showguides="false"
     inkscape:guide-bbox="true"
     inkscape:showpageshadow="false"
     inkscape:deskcolor="#d1d1d1">
    <inkscape:grid
       opacity="0.04705882"
       color="#3f3fff"
       spacingy="2"
       spacingx="2"
       type="xygrid"
       id="grid4934"
       empspacing="30"
       originx="0"
       originy="0" />
    <sodipodi:guide
       position="280,-306"
       orientation="1,0"
       id="guide1056"
       inkscape:locked="false" />
  </sodipodi:namedview>
  <g
     inkscape:groupmode="layer"
     id="layer3"
     inkscape:label="bg" />
  <g
     inkscape:groupmode="layer"
     id="layer1"
     inkscape:label="vectors"
     style="display:inline">
    <g
       id="g462"
       transform="matrix(1.1160065,0,0,1.1160065,-31.857168,-17.132505)">
      <path
         id="rect1085"
         style="font-variation-settings:normal;opacity:1;vector-effect:none;fill:url(#linearGradient1183);fill-opacity:1;stroke:none;stroke-width:0.534369;stroke-linecap:butt;stroke-linejoin:miter;stroke-miterlimit:4;stroke-dasharray:none;stroke-dashoffset:0;stroke-opacity:1;marker:none;stop-color:#000000;stop-opacity:1"
         d="m 251.13328,30.496757 a 11.729923,11.729923 0 0 0 11.87071,11.587427 h 140.46553 a 11.870709,11.870709 0 0 1 11.87071,11.870708 11.729923,11.729923 0 0 1 -11.87071,11.587428 11.729923,11.729923 0 0 0 -11.58742,11.87071 11.729923,11.729923 0 0 0 11.8707,11.58743 11.729923,11.729923 0 0 1 11.58743,11.8707 11.729923,11.729923 0 0 1 -11.87071,11.58743 h -187.3818 a 11.870709,11.870709 0 0 0 -11.87071,11.87071 11.729923,11.729923 0 0 0 11.87071,11.58743 h 46.63299 a 11.870709,11.870709 0 0 1 11.8707,11.87071 11.729923,11.729923 0 0 1 -11.8707,11.58742 h -46.63299 a 11.870709,11.870709 0 0 0 -11.87071,11.87071 11.729923,11.729923 0 0 0 11.87071,11.58743 h 23.17485 a 11.870709,11.870709 0 0 1 11.87071,11.87071 11.729923,11.729923 0 0 1 -11.87071,11.58743 11.729923,11.729923 0 0 0 -11.58743,11.8707 11.729923,11.729923 0 0 0 11.87071,11.58743 11.729923,11.729923 0 0 1 11.58743,11.87071 11.729923,11.729923 0 0 1 -11.87071,11.58743 h -23.17485 a 11.870709,11.870709 0 0 0 -11.87071,11.87071 11.729923,11.729923 0 0 0 11.87071,11.58742 11.729923,11.729923 0 0 1 11.58742,11.87071 11.729923,11.729923 0 0 1 -11.87071,11.58743 11.729923,11.729923 0 0 0 -11.58742,11.87071 11.729923,11.729923 0 0 0 11.87071,11.58743 11.729923,11.729923 0 0 1 11.58742,11.8707 11.729923,11.729923 0 0 1 -11.87071,11.58743 11.729923,11.729923 0 0 0 -11.58742,11.87071 11.729923,11.729923 0 0 0 11.87071,11.58743 h 328.13062 a 11.870709,11.870709 0 0 0 11.87071,-11.87071 11.729923,11.729923 0 0 0 -11.87071,-11.58743 h -46.63299 a 11.870709,11.870709 0 0 1 -11.87071,-11.87071 11.729923,11.729923 0 0 1 11.87071,-11.58742 11.729923,11.729923 0 0 0 11.58743,-11.87071 11.729923,11.729923 0 0 0 -11.87071,-11.58743 11.729923,11.729923 0 0 1 -11.58743,-11.87071 11.729923,11.729923 0 0 1 11.87071,-11.58743 h 46.63299 a 11.870709,11.870709 0 0 0 11.87071,-11.8707 11.729923,11.729923 0 0 0 -11.87071,-11.58743 11.729923,11.729923 0 0 1 -11.58743,-11.87071 11.729923,11.729923 0 0 1 11.87071,-11.58743 11.729923,11.729923 0 0 0 11.58743,-11.87071 11.729923,11.729923 0 0 0 -11.87071,-11.58742 h -70.09113 a 11.870709,11.870709 0 0 1 -11.87071,-11.87071 11.729923,11.729923 0 0 1 11.87071,-11.58743 11.729923,11.729923 0 0 0 11.58743,-11.87071 11.729923,11.729923 0 0 0 -11.87071,-11.58743 11.729923,11.729923 0 0 1 -11.58743,-11.8707 11.729923,11.729923 0 0 1 11.87071,-11.58743 h 70.09113 A 11.870709,11.870709 0 0 0 556.08905,124.04602 11.729923,11.729923 0 0 0 544.21834,112.45859 11.729923,11.729923 0 0 1 532.63091,100.58788 11.729923,11.729923 0 0 1 544.50162,89.00046 11.729923,11.729923 0 0 0 556.08905,77.12975 11.729923,11.729923 0 0 0 544.21834,65.54232 11.729923,11.729923 0 0 1 532.63091,53.671612 11.729923,11.729923 0 0 1 544.50162,42.084184 11.729923,11.729923 0 0 0 556.08905,30.213475 11.729923,11.729923 0 0 0 544.21834,18.626048 H 263.00399 a 11.870709,11.870709 0 0 0 -11.87071,11.870709 z" />
      <g
         style="display:inline;opacity:1"
         id="g2378"
         transform="matrix(1.5285862,0,0,1.5285862,235.7281,39.260896)">
        <path
           id="rect2246"
           style="opacity:1;vector-effect:none;stroke-width:1.5875;stroke-linecap:round;marker:none;marker-start:none;marker-mid:none;marker-end:none"
           d="m 50.508821,84.666664 h 89.482359 c 1.59764,0 2.88382,1.286184 2.88382,2.883821 v 52.440695 c 0,1.59764 -1.28618,2.88382 -2.88382,2.88382 H 50.508821 c -1.597637,0 -2.883821,-1.28618 -2.883821,-2.88382 V 87.550485 c 0,-1.597637 1.286184,-2.883821 2.883821,-2.883821 z" />
        <path
           id="rect2404"
           style="opacity:1;vector-effect:none;fill-opacity:0.102362;stroke-width:1.5875;stroke-linecap:round;marker:none;marker-start:none;marker-mid:none;marker-end:none"
           d="m 50.508821,145.25624 h 89.482359 c 1.59764,0 2.88382,1.28619 2.88382,2.88382 v 52.4407 c 0,1.59763 -1.28618,2.88382 -2.88382,2.88382 H 50.508821 c -1.597637,0 -2.883821,-1.28619 -2.883821,-2.88382 v -52.4407 c 0,-1.59763 1.286184,-2.88382 2.883821,-2.88382 z" />
        <path
           id="rect2250"
           style="opacity:1;vector-effect:none;fill:#deddda;stroke-width:1.5875;stroke-linecap:round;marker:none;marker-start:none;marker-mid:none;marker-end:none"
           d="m 50.508821,144.19792 h 89.482359 c 1.59764,0 2.88382,1.28619 2.88382,2.88382 v 52.4407 c 0,1.59763 -1.28618,2.88382 -2.88382,2.88382 H 50.508821 c -1.597637,0 -2.883821,-1.28619 -2.883821,-2.88382 v -52.4407 c 0,-1.59763 1.286184,-2.88382 2.883821,-2.88382 z" />
        <path
           id="rect2248"
           style="opacity:1;vector-effect:none;fill:#f6f5f4;stroke-width:1.5875;stroke-linecap:round;marker:none;marker-start:none;marker-mid:none;marker-end:none"
           d="m 50.508821,142.875 h 89.482359 c 1.59764,0 2.88382,1.28618 2.88382,2.88382 v 52.44069 c 0,1.59764 -1.28618,2.88383 -2.88382,2.88383 H 50.508821 c -1.597637,0 -2.883821,-1.28619 -2.883821,-2.88383 v -52.44069 c 0,-1.59764 1.286184,-2.88382 2.883821,-2.88382 z" />
        <path
           id="rect2252"
           style="opacity:1;vector-effect:none;fill:#c0bfbc;stroke-width:1.5875;stroke-linecap:round;marker:none;marker-start:none;marker-mid:none;marker-end:none"
           d="m 54.874442,148.16667 h 80.751108 c 1.08461,0 1.95778,0.87317 1.95778,1.95778 v 25.18861 c 0,1.08461 -0.87317,1.95778 -1.95778,1.95778 H 54.874442 c -1.084609,0 -1.957778,-0.87317 -1.957778,-1.95778 v -25.18861 c 0,-1.08461 0.873169,-1.95778 1.957778,-1.95778 z" />
        <path
           id="rect2332"
           style="opacity:1;vector-effect:none;fill:#deddda;stroke-width:1.5875;stroke-linecap:round;marker:none;marker-start:none;marker-mid:none;marker-end:none"
           d="m 54.874442,148.69583 h 80.751108 c 1.08461,0 1.95778,0.87317 1.95778,1.95778 v 25.18861 c 0,1.08461 -0.87317,1.95778 -1.95778,1.95778 H 54.874442 c -1.084609,0 -1.957778,-0.87317 -1.957778,-1.95778 v -25.18861 c 0,-1.08461 0.873169,-1.95778 1.957778,-1.95778 z" />
        <path
           id="rect2258"
           style="opacity:1;vector-effect:none;stroke-width:1.5875;stroke-linecap:round;marker:none;marker-start:none;marker-mid:none;marker-end:none"
           d="m 64.325844,137.58334 h 61.848316 c 0.45751,0 0.82584,0.36833 0.82584,0.82585 v 5.75664 c 0,0.45752 -0.36833,0.82584 -0.82584,0.82584 H 64.325844 c -0.457517,0 -0.825844,-0.36832 -0.825844,-0.82584 v -5.75664 c 0,-0.45752 0.368327,-0.82585 0.825844,-0.82585 z" />
        <path
           id="rect2254"
           style="opacity:1;vector-effect:none;fill:#deddda;stroke-width:1.5875;stroke-linecap:round;marker:none;marker-start:none;marker-mid:none;marker-end:none"
           d="m 84.904662,179.91667 h 20.690658 c 1.59764,0 2.88383,1.28619 2.88383,2.88383 v 10.10734 c 0,1.59764 -1.28619,2.88383 -2.88383,2.88383 H 84.904662 c -1.59764,0 -2.883826,-1.28619 -2.883826,-2.88383 V 182.8005 c 0,-1.59764 1.286186,-2.88383 2.883826,-2.88383 z" />
        <path
           id="rect2256"
           style="opacity:1;vector-effect:none;fill:#2ec27e;stroke-width:1.5875;stroke-linecap:round;marker:none;marker-start:none;marker-mid:none;marker-end:none"
           d="m 50.732589,86.283562 h 89.034821 c 0.87211,0 1.5742,0.702092 1.5742,1.574199 V 139.6839 c 0,0.87211 -0.70209,1.5742 -1.5742,1.5742 H 50.732589 c -0.872106,0 -1.574199,-0.70209 -1.574199,-1.5742 V 87.857761 c 0,-0.872107 0.702093,-1.574199 1.574199,-1.574199 z" />
        <path
           id="rect2260"
           style="opacity:1;vector-effect:none;fill:#241f31;stroke-width:1.5875;stroke-linecap:round;marker:none;marker-start:none;marker-mid:none;marker-end:none"
           d="m 75.096261,170.65625 h 44.276229 c 0.56116,0 1.01293,0.45177 1.01293,1.01293 v 3.2658 c 0,0.56117 -0.45177,1.01294 -1.01293,1.01294 H 75.096261 c -0.561165,0 -1.012933,-0.45177 -1.012933,-1.01294 v -3.2658 c 0,-0.56116 0.451768,-1.01293 1.012933,-1.01293 z" />
        <path
           id="rect2262"
           style="opacity:1;vector-effect:none;fill:#241f31;stroke-width:1.5875;stroke-linecap:round;marker:none;marker-start:none;marker-mid:none;marker-end:none"
           d="m 122.72128,170.65625 h 4.5887 c 0.56117,0 1.01294,0.45177 1.01294,1.01293 v 3.2658 c 0,0.56117 -0.45177,1.01294 -1.01294,1.01294 h -4.5887 c -0.56117,0 -1.01294,-0.45177 -1.01294,-1.01294 v -3.2658 c 0,-0.56116 0.45177,-1.01293 1.01294,-1.01293 z" />
        <path
           id="rect2264"
           style="opacity:1;vector-effect:none;fill:#241f31;stroke-width:1.5875;stroke-linecap:round;marker:none;marker-start:none;marker-mid:none;marker-end:none"
           d="m 130.65878,170.65625 h 4.5887 c 0.56117,0 1.01294,0.45177 1.01294,1.01293 v 3.2658 c 0,0.56117 -0.45177,1.01294 -1.01294,1.01294 h -4.5887 c -0.56117,0 -1.01294,-0.45177 -1.01294,-1.01294 v -3.2658 c 0,-0.56116 0.45177,-1.01293 1.01294,-1.01293 z" />
        <path
           id="rect2266"
           style="opacity:1;vector-effect:none;fill:#241f31;stroke-width:1.5875;stroke-linecap:round;marker:none;marker-start:none;marker-mid:none;marker-end:none"
           d="m 126.69003,164.04166 h 3.2658 c 0.56116,0 1.01293,0.45176 1.01293,1.01293 v 3.2658 c 0,0.56116 -0.45177,1.01293 -1.01293,1.01293 h -3.2658 c -0.56117,0 -1.01294,-0.45177 -1.01294,-1.01293 v -3.2658 c 0,-0.56117 0.45177,-1.01293 1.01294,-1.01293 z" />
        <path
           id="rect2268"
           style="opacity:1;vector-effect:none;fill:#241f31;stroke-width:1.5875;stroke-linecap:round;marker:none;marker-start:none;marker-mid:none;marker-end:none"
           d="m 118.75253,164.04166 h 4.5887 c 0.56117,0 1.01294,0.45176 1.01294,1.01293 v 3.2658 c 0,0.56116 -0.45177,1.01293 -1.01294,1.01293 h -4.5887 c -0.56117,0 -1.01294,-0.45177 -1.01294,-1.01293 v -3.2658 c 0,-0.56117 0.45177,-1.01293 1.01294,-1.01293 z" />
        <path
           id="rect2270"
           style="opacity:1;vector-effect:none;fill:#241f31;stroke-width:1.5875;stroke-linecap:round;marker:none;marker-start:none;marker-mid:none;marker-end:none"
           d="m 110.81503,164.04166 h 4.5887 c 0.56117,0 1.01294,0.45176 1.01294,1.01293 v 3.2658 c 0,0.56116 -0.45177,1.01293 -1.01294,1.01293 h -4.5887 c -0.56117,0 -1.01294,-0.45177 -1.01294,-1.01293 v -3.2658 c 0,-0.56117 0.45177,-1.01293 1.01294,-1.01293 z" />
        <path
           id="rect2272"
           style="opacity:1;vector-effect:none;fill:#241f31;stroke-width:1.5875;stroke-linecap:round;marker:none;marker-start:none;marker-mid:none;marker-end:none"
           d="m 102.87753,164.04166 h 4.5887 c 0.56117,0 1.01294,0.45176 1.01294,1.01293 v 3.2658 c 0,0.56116 -0.45177,1.01293 -1.01294,1.01293 h -4.5887 c -0.56117,0 -1.01294,-0.45177 -1.01294,-1.01293 v -3.2658 c 0,-0.56117 0.45177,-1.01293 1.01294,-1.01293 z" />
        <path
           id="rect2274"
           style="opacity:1;vector-effect:none;fill:#241f31;stroke-width:1.5875;stroke-linecap:round;marker:none;marker-start:none;marker-mid:none;marker-end:none"
           d="m 94.940019,164.04166 h 4.588706 c 0.561165,0 1.012935,0.45176 1.012935,1.01293 v 3.2658 c 0,0.56116 -0.45177,1.01293 -1.012935,1.01293 h -4.588706 c -0.561165,0 -1.012933,-0.45177 -1.012933,-1.01293 v -3.2658 c 0,-0.56117 0.451768,-1.01293 1.012933,-1.01293 z" />
        <path
           id="rect2276"
           style="opacity:1;vector-effect:none;fill:#241f31;stroke-width:1.5875;stroke-linecap:round;marker:none;marker-start:none;marker-mid:none;marker-end:none"
           d="m 87.002519,164.04166 h 4.588706 c 0.561164,0 1.012932,0.45176 1.012932,1.01293 v 3.2658 c 0,0.56116 -0.451768,1.01293 -1.012932,1.01293 h -4.588706 c -0.561165,0 -1.012933,-0.45177 -1.012933,-1.01293 v -3.2658 c 0,-0.56117 0.451768,-1.01293 1.012933,-1.01293 z" />
        <path
           id="rect2278"
           style="opacity:1;vector-effect:none;fill:#241f31;stroke-width:1.5875;stroke-linecap:round;marker:none;marker-start:none;marker-mid:none;marker-end:none"
           d="m 79.065026,164.04166 h 4.588706 c 0.561165,0 1.012933,0.45176 1.012933,1.01293 v 3.2658 c 0,0.56116 -0.451768,1.01293 -1.012933,1.01293 h -4.588706 c -0.561164,0 -1.012932,-0.45177 -1.012932,-1.01293 v -3.2658 c 0,-0.56117 0.451768,-1.01293 1.012932,-1.01293 z" />
        <path
           id="rect2280"
           style="opacity:1;vector-effect:none;fill:#241f31;stroke-width:1.5875;stroke-linecap:round;marker:none;marker-start:none;marker-mid:none;marker-end:none"
           d="m 71.127519,164.04166 h 4.588706 c 0.561164,0 1.012932,0.45176 1.012932,1.01293 v 3.2658 c 0,0.56116 -0.451768,1.01293 -1.012932,1.01293 h -4.588706 c -0.561165,0 -1.012933,-0.45177 -1.012933,-1.01293 v -3.2658 c 0,-0.56117 0.451768,-1.01293 1.012933,-1.01293 z" />
        <path
           id="rect2282"
           style="opacity:1;vector-effect:none;fill:#241f31;stroke-width:1.5875;stroke-linecap:round;marker:none;marker-start:none;marker-mid:none;marker-end:none"
           d="m 63.190015,164.04166 h 4.588706 c 0.561165,0 1.012933,0.45176 1.012933,1.01293 v 3.2658 c 0,0.56116 -0.451768,1.01293 -1.012933,1.01293 h -4.588706 c -0.561165,0 -1.012933,-0.45177 -1.012933,-1.01293 v -3.2658 c 0,-0.56117 0.451768,-1.01293 1.012933,-1.01293 z" />
        <path
           id="rect2284"
           style="opacity:1;vector-effect:none;fill:#241f31;stroke-width:1.5875;stroke-linecap:round;marker:none;marker-start:none;marker-mid:none;marker-end:none"
           d="m 122.72128,157.42708 h 4.58871 c 0.56116,0 1.01293,0.45177 1.01293,1.01293 v 3.2658 c 0,0.56117 -0.45177,1.01293 -1.01293,1.01293 h -4.58871 c -0.56116,0 -1.01293,-0.45176 -1.01293,-1.01293 v -3.2658 c 0,-0.56116 0.45177,-1.01293 1.01293,-1.01293 z" />
        <path
           id="rect2286"
           style="opacity:1;vector-effect:none;fill:#241f31;stroke-width:1.5875;stroke-linecap:round;marker:none;marker-start:none;marker-mid:none;marker-end:none"
           d="m 114.78378,157.42708 h 4.58871 c 0.56116,0 1.01293,0.45177 1.01293,1.01293 v 3.2658 c 0,0.56117 -0.45177,1.01293 -1.01293,1.01293 h -4.58871 c -0.56116,0 -1.01293,-0.45176 -1.01293,-1.01293 v -3.2658 c 0,-0.56116 0.45177,-1.01293 1.01293,-1.01293 z" />
        <path
           id="rect2288"
           style="opacity:1;vector-effect:none;fill:#241f31;stroke-width:1.5875;stroke-linecap:round;marker:none;marker-start:none;marker-mid:none;marker-end:none"
           d="m 106.84628,157.42708 h 4.58871 c 0.56116,0 1.01293,0.45177 1.01293,1.01293 v 3.2658 c 0,0.56117 -0.45177,1.01293 -1.01293,1.01293 h -4.58871 c -0.56116,0 -1.01293,-0.45176 -1.01293,-1.01293 v -3.2658 c 0,-0.56116 0.45177,-1.01293 1.01293,-1.01293 z" />
        <path
           id="rect2290"
           style="opacity:1;vector-effect:none;fill:#241f31;stroke-width:1.5875;stroke-linecap:round;marker:none;marker-start:none;marker-mid:none;marker-end:none"
           d="m 98.908784,157.42708 h 4.588706 c 0.56116,0 1.01293,0.45177 1.01293,1.01293 v 3.2658 c 0,0.56117 -0.45177,1.01293 -1.01293,1.01293 h -4.588706 c -0.561165,0 -1.012933,-0.45176 -1.012933,-1.01293 v -3.2658 c 0,-0.56116 0.451768,-1.01293 1.012933,-1.01293 z" />
        <path
           id="rect2292"
           style="opacity:1;vector-effect:none;fill:#241f31;stroke-width:1.5875;stroke-linecap:round;marker:none;marker-start:none;marker-mid:none;marker-end:none"
           d="m 90.971276,157.42708 h 4.588706 c 0.561165,0 1.012933,0.45177 1.012933,1.01293 v 3.2658 c 0,0.56117 -0.451768,1.01293 -1.012933,1.01293 h -4.588706 c -0.561164,0 -1.012932,-0.45176 -1.012932,-1.01293 v -3.2658 c 0,-0.56116 0.451768,-1.01293 1.012932,-1.01293 z" />
        <path
           id="rect2294"
           style="opacity:1;vector-effect:none;fill:#241f31;stroke-width:1.5875;stroke-linecap:round;marker:none;marker-start:none;marker-mid:none;marker-end:none"
           d="m 83.033776,157.42708 h 4.588706 c 0.561165,0 1.012933,0.45177 1.012933,1.01293 v 3.2658 c 0,0.56117 -0.451768,1.01293 -1.012933,1.01293 h -4.588706 c -0.561164,0 -1.012932,-0.45176 -1.012932,-1.01293 v -3.2658 c 0,-0.56116 0.451768,-1.01293 1.012932,-1.01293 z" />
        <path
           id="rect2296"
           style="opacity:1;vector-effect:none;fill:#241f31;stroke-width:1.5875;stroke-linecap:round;marker:none;marker-start:none;marker-mid:none;marker-end:none"
           d="m 75.096284,157.42708 h 4.588706 c 0.561165,0 1.012933,0.45177 1.012933,1.01293 v 3.2658 c 0,0.56117 -0.451768,1.01293 -1.012933,1.01293 h -4.588706 c -0.561165,0 -1.012933,-0.45176 -1.012933,-1.01293 v -3.2658 c 0,-0.56116 0.451768,-1.01293 1.012933,-1.01293 z" />
        <path
           id="rect2298"
           style="opacity:1;vector-effect:none;fill:#241f31;stroke-width:1.5875;stroke-linecap:round;marker:none;marker-start:none;marker-mid:none;marker-end:none"
           d="m 67.158776,157.42708 h 4.588706 c 0.561165,0 1.012933,0.45177 1.012933,1.01293 v 3.2658 c 0,0.56117 -0.451768,1.01293 -1.012933,1.01293 h -4.588706 c -0.561164,0 -1.012932,-0.45176 -1.012932,-1.01293 v -3.2658 c 0,-0.56116 0.451768,-1.01293 1.012932,-1.01293 z" />
        <path
           id="rect2300"
           style="opacity:1;vector-effect:none;fill:#241f31;stroke-width:1.5875;stroke-linecap:round;marker:none;marker-start:none;marker-mid:none;marker-end:none"
           d="m 55.252515,157.42708 h 8.557466 c 0.561165,0 1.012933,0.45177 1.012933,1.01293 v 3.2658 c 0,0.56117 -0.451768,1.01293 -1.012933,1.01293 h -8.557466 c -0.561165,0 -1.012933,-0.45176 -1.012933,-1.01293 v -3.2658 c 0,-0.56116 0.451768,-1.01293 1.012933,-1.01293 z" />
        <path
           id="rect2302"
           style="opacity:1;vector-effect:none;fill:#241f31;stroke-width:1.5875;stroke-linecap:round;marker:none;marker-start:none;marker-mid:none;marker-end:none"
           d="m 126.69003,150.8125 h 8.55746 c 0.56116,0 1.01293,0.45177 1.01293,1.01293 v 3.2658 c 0,0.56117 -0.45177,1.01294 -1.01293,1.01294 h -8.55746 c -0.56116,0 -1.01293,-0.45177 -1.01293,-1.01294 v -3.2658 c 0,-0.56116 0.45177,-1.01293 1.01293,-1.01293 z" />
        <path
           id="rect2304"
           style="opacity:1;vector-effect:none;fill:#241f31;stroke-width:1.5875;stroke-linecap:round;marker:none;marker-start:none;marker-mid:none;marker-end:none"
           d="m 118.75253,150.8125 h 4.58871 c 0.56116,0 1.01293,0.45177 1.01293,1.01293 v 3.2658 c 0,0.56117 -0.45177,1.01294 -1.01293,1.01294 h -4.58871 c -0.56116,0 -1.01293,-0.45177 -1.01293,-1.01294 v -3.2658 c 0,-0.56116 0.45177,-1.01293 1.01293,-1.01293 z" />
        <path
           id="rect2306"
           style="opacity:1;vector-effect:none;fill:#241f31;stroke-width:1.5875;stroke-linecap:round;marker:none;marker-start:none;marker-mid:none;marker-end:none"
           d="m 110.81503,150.8125 h 4.58871 c 0.56116,0 1.01293,0.45177 1.01293,1.01293 v 3.2658 c 0,0.56117 -0.45177,1.01294 -1.01293,1.01294 h -4.58871 c -0.56116,0 -1.01293,-0.45177 -1.01293,-1.01294 v -3.2658 c 0,-0.56116 0.45177,-1.01293 1.01293,-1.01293 z" />
        <path
           id="rect2308"
           style="opacity:1;vector-effect:none;fill:#241f31;stroke-width:1.5875;stroke-linecap:round;marker:none;marker-start:none;marker-mid:none;marker-end:none"
           d="m 102.87753,150.8125 h 4.58871 c 0.56116,0 1.01293,0.45177 1.01293,1.01293 v 3.2658 c 0,0.56117 -0.45177,1.01294 -1.01293,1.01294 h -4.58871 c -0.56116,0 -1.01293,-0.45177 -1.01293,-1.01294 v -3.2658 c 0,-0.56116 0.45177,-1.01293 1.01293,-1.01293 z" />
        <path
           id="rect2310"
           style="opacity:1;vector-effect:none;fill:#241f31;stroke-width:1.5875;stroke-linecap:round;marker:none;marker-start:none;marker-mid:none;marker-end:none"
           d="m 94.940026,150.8125 h 4.588706 c 0.561168,0 1.012938,0.45177 1.012938,1.01293 v 3.2658 c 0,0.56117 -0.45177,1.01294 -1.012938,1.01294 h -4.588706 c -0.561164,0 -1.012932,-0.45177 -1.012932,-1.01294 v -3.2658 c 0,-0.56116 0.451768,-1.01293 1.012932,-1.01293 z" />
        <path
           id="rect2312"
           style="opacity:1;vector-effect:none;fill:#241f31;stroke-width:1.5875;stroke-linecap:round;marker:none;marker-start:none;marker-mid:none;marker-end:none"
           d="m 87.002526,150.8125 h 4.588706 c 0.561165,0 1.012933,0.45177 1.012933,1.01293 v 3.2658 c 0,0.56117 -0.451768,1.01294 -1.012933,1.01294 h -4.588706 c -0.561164,0 -1.012932,-0.45177 -1.012932,-1.01294 v -3.2658 c 0,-0.56116 0.451768,-1.01293 1.012932,-1.01293 z" />
        <path
           id="rect2314"
           style="opacity:1;vector-effect:none;fill:#241f31;stroke-width:1.5875;stroke-linecap:round;marker:none;marker-start:none;marker-mid:none;marker-end:none"
           d="m 79.065034,150.8125 h 4.588706 c 0.561165,0 1.012933,0.45177 1.012933,1.01293 v 3.2658 c 0,0.56117 -0.451768,1.01294 -1.012933,1.01294 h -4.588706 c -0.561165,0 -1.012933,-0.45177 -1.012933,-1.01294 v -3.2658 c 0,-0.56116 0.451768,-1.01293 1.012933,-1.01293 z" />
        <path
           id="rect2316"
           style="opacity:1;vector-effect:none;fill:#241f31;stroke-width:1.5875;stroke-linecap:round;marker:none;marker-start:none;marker-mid:none;marker-end:none"
           d="m 71.127526,150.8125 h 4.588706 c 0.561165,0 1.012933,0.45177 1.012933,1.01293 v 3.2658 c 0,0.56117 -0.451768,1.01294 -1.012933,1.01294 h -4.588706 c -0.561164,0 -1.012932,-0.45177 -1.012932,-1.01294 v -3.2658 c 0,-0.56116 0.451768,-1.01293 1.012932,-1.01293 z" />
        <path
           id="rect2318"
           style="opacity:1;vector-effect:none;fill:#241f31;stroke-width:1.5875;stroke-linecap:round;marker:none;marker-start:none;marker-mid:none;marker-end:none"
           d="m 63.190015,150.8125 h 4.588706 c 0.561165,0 1.012933,0.45177 1.012933,1.01293 v 3.2658 c 0,0.56117 -0.451768,1.01294 -1.012933,1.01294 h -4.588706 c -0.561165,0 -1.012933,-0.45177 -1.012933,-1.01294 v -3.2658 c 0,-0.56116 0.451768,-1.01293 1.012933,-1.01293 z" />
        <path
           id="rect2320"
           style="opacity:1;vector-effect:none;fill:#241f31;stroke-width:1.5875;stroke-linecap:round;marker:none;marker-start:none;marker-mid:none;marker-end:none"
           d="m 55.252515,150.8125 h 4.588706 c 0.561165,0 1.012933,0.45177 1.012933,1.01293 v 3.2658 c 0,0.56117 -0.451768,1.01294 -1.012933,1.01294 h -4.588706 c -0.561165,0 -1.012933,-0.45177 -1.012933,-1.01294 v -3.2658 c 0,-0.56116 0.451768,-1.01293 1.012933,-1.01293 z" />
        <path
           id="rect2322"
           style="opacity:1;vector-effect:none;fill:#241f31;stroke-width:1.5875;stroke-linecap:round;marker:none;marker-start:none;marker-mid:none;marker-end:none"
           d="m 55.252526,164.04166 h 4.588706 c 0.561165,0 1.012933,0.45176 1.012933,1.01293 v 3.2658 c 0,0.56116 -0.451768,1.01293 -1.012933,1.01293 h -4.588706 c -0.561164,0 -1.012932,-0.45177 -1.012932,-1.01293 v -3.2658 c 0,-0.56117 0.451768,-1.01293 1.012932,-1.01293 z" />
        <path
           id="rect2324"
           style="opacity:1;vector-effect:none;fill:#241f31;stroke-width:1.5875;stroke-linecap:round;marker:none;marker-start:none;marker-mid:none;marker-end:none"
           d="m 67.158776,170.65625 h 4.588706 c 0.561165,0 1.012933,0.45177 1.012933,1.01293 v 3.2658 c 0,0.56117 -0.451768,1.01294 -1.012933,1.01294 h -4.588706 c -0.561164,0 -1.012932,-0.45177 -1.012932,-1.01294 v -3.2658 c 0,-0.56116 0.451768,-1.01293 1.012932,-1.01293 z" />
        <path
           id="rect2326"
           style="opacity:1;vector-effect:none;fill:#241f31;stroke-width:1.5875;stroke-linecap:round;marker:none;marker-start:none;marker-mid:none;marker-end:none"
           d="M 55.252515,170.65625 H 63.81 c 0.561165,0 1.012933,0.45177 1.012933,1.01293 v 3.2658 c 0,0.56117 -0.451768,1.01294 -1.012933,1.01294 h -8.557485 c -0.561165,0 -1.012933,-0.45177 -1.012933,-1.01294 v -3.2658 c 0,-0.56116 0.451768,-1.01293 1.012933,-1.01293 z" />
        <path
           id="rect2328"
           style="opacity:1;vector-effect:none;fill:#241f31;stroke-width:1.5875;stroke-linecap:round;marker:none;marker-start:none;marker-mid:none;marker-end:none"
           d="m 130.65876,157.42708 h 4.58871 c 0.56116,0 1.01293,0.45177 1.01293,1.01293 v 3.2658 c 0,0.56117 -0.45177,1.01293 -1.01293,1.01293 h -4.58871 c -0.56116,0 -1.01293,-0.45176 -1.01293,-1.01293 v -3.2658 c 0,-0.56116 0.45177,-1.01293 1.01293,-1.01293 z" />
        <path
           id="rect2330"
           style="opacity:1;vector-effect:none;fill:#241f31;stroke-width:1.5875;stroke-linecap:round;marker:none;marker-start:none;marker-mid:none;marker-end:none"
           d="m 133.3046,157.42708 h 1.94287 c 0.56116,0 1.01293,0.45177 1.01293,1.01293 v 9.88038 c 0,0.56116 -0.45177,1.01293 -1.01293,1.01293 h -1.94287 c -0.56116,0 -1.01293,-0.45177 -1.01293,-1.01293 v -9.88038 c 0,-0.56116 0.45177,-1.01293 1.01293,-1.01293 z" />
      </g>
      <path
         id="rect240"
         style="fill:#26a269;stroke-width:4.1259;stop-color:#000000"
         d="m 378.72508,200 h 3.98681 v 55.18607 h -3.98681 z" />
      <path
         id="path214"
         style="fill:#deddda;stroke-width:3.90969;stop-color:#000000"
         d="m 418.57285,186.61953 c -4.23394,7.49408 10.26351,14.0655 4.23422,20.2084 -6.02929,6.1429 -12.87017,-8.22937 -20.28391,-3.85628 -7.41375,4.37309 1.8557,17.31284 -6.43726,19.6181 -8.29296,2.30526 -7.03121,-13.56193 -15.63825,-13.4816 -8.60703,0.0803 -7.04933,15.92121 -15.38387,13.77115 -8.33456,-2.15007 0.69174,-15.26059 -6.80232,-19.49453 -7.49408,-4.23395 -14.06551,10.2635 -20.2084,4.23422 -6.14291,-6.02929 8.22937,-12.87018 3.85628,-20.28392 -4.37309,-7.41374 -17.31284,1.85571 -19.6181,-6.43726 -2.30526,-8.29296 13.56193,-7.03121 13.48159,-15.63824 -0.0803,-8.60704 -15.92121,-7.04933 -13.77114,-15.38388 2.15007,-8.33455 15.26058,0.69174 19.49453,-6.80232 4.23394,-7.49408 -10.26351,-14.06551 -4.23422,-20.20841 6.02929,-6.14289 12.87017,8.22938 20.28392,3.85629 7.41374,-4.37309 -1.85571,-17.31284 6.43725,-19.6181 8.29297,-2.30526 7.03121,13.56193 15.63825,13.4816 8.60703,-0.0803 7.04933,-15.92121 15.38388,-13.77115 8.33455,2.15007 -0.69175,15.26059 6.80232,19.49453 7.49407,4.23395 14.0655,-10.26351 20.2084,-4.23422 6.1429,6.02929 -8.22937,12.87017 -3.85628,20.28392 4.37308,7.41374 17.31283,-1.85571 19.6181,6.43726 2.30526,8.29296 -13.56194,7.03121 -13.4816,15.63824 0.0803,8.60703 15.92121,7.04933 13.77114,15.38388 -2.15007,8.33455 -15.26058,-0.69174 -19.49453,6.80232 z" />
      <path
         id="path238"
         style="fill:#ffffff;stroke-width:3.90969;stop-color:#000000"
         d="m 418.57285,185.05565 c -4.23394,7.49408 10.26351,14.06551 4.23422,20.2084 -6.02929,6.1429 -12.87017,-8.22937 -20.28391,-3.85628 -7.41375,4.37309 1.8557,17.31284 -6.43726,19.6181 -8.29296,2.30526 -7.03121,-13.56193 -15.63825,-13.4816 -8.60703,0.0803 -7.04933,15.92122 -15.38387,13.77115 -8.33456,-2.15007 0.69174,-15.26059 -6.80232,-19.49453 -7.49408,-4.23395 -14.06551,10.26351 -20.2084,4.23422 -6.14291,-6.02929 8.22937,-12.87017 3.85628,-20.28392 -4.37309,-7.41374 -17.31284,1.85571 -19.6181,-6.43726 -2.30526,-8.29296 13.56193,-7.0312 13.48159,-15.63824 -0.0803,-8.60703 -15.92121,-7.04933 -13.77114,-15.38388 2.15007,-8.33455 15.26058,0.69175 19.49453,-6.80232 4.23394,-7.49407 -10.26351,-14.0655 -4.23422,-20.2084 6.02929,-6.1429 12.87017,8.22937 20.28392,3.85628 7.41374,-4.37308 -1.85571,-17.31283 6.43725,-19.6181 8.29297,-2.30526 7.03121,13.56194 15.63825,13.4816 8.60703,-0.0803 7.04933,-15.92121 15.38388,-13.77114 8.33455,2.15007 -0.69175,15.26058 6.80232,19.49452 7.49407,4.23395 14.0655,-10.2635 20.2084,-4.23421 6.1429,6.02928 -8.22937,12.87017 -3.85628,20.28391 4.37308,7.41375 17.31283,-1.8557 19.6181,6.43726 2.30526,8.29296 -13.56194,7.03121 -13.4816,15.63824 0.0803,8.60704 15.92121,7.04934 13.77114,15.38388 -2.15007,8.33455 -15.26058,-0.69174 -19.49453,6.80232 z" />
      <path
         id="path236"
         style="fill:#f5c211;stroke-width:8.7968;stop-color:#000000"
         d="m 415.34024,164.8128 a 35.187207,35.187207 0 0 1 -35.18721,35.18721 35.187207,35.187207 0 0 1 -35.18721,-35.18721 35.187207,35.187207 0 0 1 35.18721,-35.1872 35.187207,35.187207 0 0 1 35.18721,35.1872 z" />
      <path
         style="fill:none;stroke:#26a269;stroke-width:3.90969;stroke-linecap:butt;stroke-linejoin:miter;stroke-miterlimit:4;stroke-dasharray:none;stroke-opacity:1"
         d="m 415.34023,255.23353 a 31.77539,31.77539 0 0 1 31.77539,-31.77539 h 3.42785 a 35.171168,35.171168 0 0 1 35.17117,35.17117 v 11.67409 a 23.529152,23.529152 0 0 0 23.52915,23.52915 23.458244,23.458244 0 0 0 23.38712,-23.52915 v -93.76153"
         id="path242"
         sodipodi:nodetypes="cccccc" />
      <path
         id="path185"
         style="fill:#26a269;stroke-width:1.33522;stop-color:#000000"
         d="m 556.08905,246.91628 a 11.729068,11.729068 0 0 1 -5.86454,10.15767 11.729068,11.729068 0 0 1 -11.72906,0 11.729068,11.729068 0 0 1 -5.86454,-10.15767" />
      <path
         id="path187"
         style="fill:#26a269;stroke-width:1.33522;stop-color:#000000"
         d="m 532.63091,223.45814 a 11.729068,11.729068 0 0 1 -5.86453,10.15767 11.729068,11.729068 0 0 1 -11.72907,0 11.729068,11.729068 0 0 1 -5.86453,-10.15767" />
      <path
         id="path189"
         style="fill:#26a269;stroke-width:1.33522;stop-color:#000000"
         d="m 556.08905,200 a 11.729068,11.729068 0 0 1 -5.86454,10.15768 11.729068,11.729068 0 0 1 -11.72906,0 A 11.729068,11.729068 0 0 1 532.63091,200" />
      <path
         id="path191"
         style="fill:#26a269;stroke-width:1.33522;stop-color:#000000"
         d="m 402.18321,223.45814 a 11.729068,11.729068 0 0 1 -5.86453,10.15767 11.729068,11.729068 0 0 1 -11.72907,0 11.729068,11.729068 0 0 1 -5.86453,-10.15767" />
      <path
         id="path193"
         style="fill:#26a269;stroke-width:1.33522;stop-color:#000000"
         d="m 378.72508,235.18721 a 11.729068,11.729068 0 0 1 -5.86454,10.15767 11.729068,11.729068 0 0 1 -11.72907,0 11.729068,11.729068 0 0 1 -5.86453,-10.15767" />
      <path
         id="circle216"
         style="fill:#e5a50a;stroke-width:3.90969;stop-color:#000000"
         d="m 579.54718,131.18947 a 46.916272,46.916272 0 0 1 -46.91627,46.91627 46.916272,46.916272 0 0 1 -46.91627,-46.91627 46.916272,46.916272 0 0 1 46.91627,-46.91627 46.916272,46.916272 0 0 1 46.91627,46.91627 z" />
      <path
         id="path220"
         style="fill:#f5c211;stroke-width:3.90969;stop-color:#000000"
         d="m 579.54718,129.6256 a 46.916272,46.916272 0 0 1 -46.91627,46.91627 46.916272,46.916272 0 0 1 -46.91627,-46.91627 46.916272,46.916272 0 0 1 46.91627,-46.91628 46.916272,46.916272 0 0 1 46.91627,46.91628 z" />
      <path
         style="fill:none;stroke:#f9f06b;stroke-width:7.81938;stroke-linecap:round;stroke-linejoin:miter;stroke-miterlimit:4;stroke-dasharray:none;stroke-opacity:1"
         d="m 532.63092,98.3481 v 62.555"
         id="path222" />
      <path
         style="fill:none;stroke:#f9f06b;stroke-width:7.81938;stroke-linecap:round;stroke-linejoin:miter;stroke-miterlimit:4;stroke-dasharray:none;stroke-opacity:1"
         d="m 548.26967,102.53849 -31.2775,54.17422"
         id="path1047" />
      <path
         style="fill:none;stroke:#f9f06b;stroke-width:7.81938;stroke-linecap:round;stroke-linejoin:miter;stroke-miterlimit:4;stroke-dasharray:none;stroke-opacity:1"
         d="m 559.71803,113.98685 -54.17422,31.2775"
         id="path1049" />
      <path
         style="fill:none;stroke:#f9f06b;stroke-width:7.81938;stroke-linecap:round;stroke-linejoin:miter;stroke-miterlimit:4;stroke-dasharray:none;stroke-opacity:1"
         d="m 563.90843,129.62561 -62.55501,-1e-5"
         id="path1051" />
      <path
         style="fill:none;stroke:#f9f06b;stroke-width:7.81938;stroke-linecap:round;stroke-linejoin:miter;stroke-miterlimit:4;stroke-dasharray:none;stroke-opacity:1"
         d="M 559.71803,145.26436 505.54381,113.98685"
         id="path1053" />
      <path
         style="fill:none;stroke:#f9f06b;stroke-width:7.81938;stroke-linecap:round;stroke-linejoin:miter;stroke-miterlimit:4;stroke-dasharray:none;stroke-opacity:1"
         d="m 548.26967,156.71272 -31.2775,-54.17423"
         id="path1055" />
      <path
         id="path1057"
         style="fill:#e5a50a;stroke-width:7.81938;stroke-linecap:round;stop-color:#000000"
         d="m 509.17278,180.45156 a 3.9096893,3.9096893 0 0 1 -3.90969,3.90969 3.9096893,3.9096893 0 0 1 -3.90969,-3.90969 3.9096893,3.9096893 0 0 1 3.90969,-3.90969 3.9096893,3.9096893 0 0 1 3.90969,3.90969 z" />
      <path
         id="circle1059"
         style="fill:#ff7800;stroke-width:7.81938;stroke-linecap:round;stop-color:#000000"
         d="M 485.71464,196.09031 A 3.9096893,3.9096893 0 0 1 481.80495,200 a 3.9096893,3.9096893 0 0 1 -3.90969,-3.90969 3.9096893,3.9096893 0 0 1 3.90969,-3.90968 3.9096893,3.9096893 0 0 1 3.90969,3.90968 z" />
      <path
         id="circle1061"
         style="fill:#e66100;stroke-width:7.81938;stroke-linecap:round;stop-color:#000000"
         d="m 470.07588,172.63218 a 3.9096893,3.9096893 0 0 1 -3.90969,3.90969 3.9096893,3.9096893 0 0 1 -3.90969,-3.90969 3.9096893,3.9096893 0 0 1 3.90969,-3.90969 3.9096893,3.9096893 0 0 1 3.90969,3.90969 z" />
      <path
         id="circle1063"
         style="fill:#e5a50a;stroke-width:7.81938;stroke-linecap:round;stop-color:#000000"
         d="m 462.2565,133.53529 a 3.9096893,3.9096893 0 0 1 -3.90969,3.90968 3.9096893,3.9096893 0 0 1 -3.90969,-3.90968 3.9096893,3.9096893 0 0 1 3.90969,-3.90969 3.9096893,3.9096893 0 0 1 3.90969,3.90969 z" />
      <path
         id="circle1065"
         style="fill:#ffbe6f;stroke-width:7.81938;stroke-linecap:round;stop-color:#000000"
         d="m 446.61775,110.07715 a 3.9096893,3.9096893 0 0 1 -3.90969,3.90969 3.9096893,3.9096893 0 0 1 -3.90969,-3.90969 3.9096893,3.9096893 0 0 1 3.90969,-3.90969 3.9096893,3.9096893 0 0 1 3.90969,3.90969 z" />
      <path
         id="path1067"
         style="fill:#26a269;stroke-width:1.33522;stop-color:#000000"
         d="m 532.63091,270.37441 a 11.729068,11.729068 0 0 1 -5.86453,10.15768 11.729068,11.729068 0 0 1 -11.72907,0 11.729068,11.729068 0 0 1 -5.86453,-10.15768" />
      <path
         style="fill:none;stroke:#26a269;stroke-width:3.90969;stroke-linecap:butt;stroke-linejoin:miter;stroke-miterlimit:4;stroke-dasharray:none;stroke-opacity:1"
         d="m 344.96582,255.17202 v -21.8599 a 23.10153,23.10153 0 0 0 -23.10153,-23.10153 h -0.71321 a 23.10153,23.10153 0 0 0 -23.10153,23.10153 v 36.85383 a 23.666602,23.666602 0 0 1 -23.6666,23.6666 23.459062,23.459062 0 0 1 -23.24967,-23.6666 V 248.80961 145.54384"
         id="path1069"
         sodipodi:nodetypes="ccccccc" />
      <g
         id="g9633"
         transform="matrix(0.42949697,0,0,0.42949697,-73.44143,-3.071346)">
        <path
           id="path1007"
           style="fill:#e01b24;fill-opacity:1;stroke:none;stroke-width:9.56005;stroke-linecap:round;stroke-linejoin:round;stroke-dasharray:9.56005, 38.2402;stop-color:#000000"
           d="m 643.47655,166.33789 c -11.02141,0 -19.89258,11.53791 -19.89258,25.86914 v 117.66992 c 0,14.33123 8.87119,24.26412 19.89258,24.24414 h 68.95899 l 42.71093,42.71289 42.7129,-42.71289 h 66.39648 c 11.02142,0 19.89453,-9.91291 19.89453,-24.24414 V 192.20703 c 0,-14.33123 -8.87311,-25.86914 -19.89453,-25.86914 z"
           sodipodi:nodetypes="sssscccsssss" />
        <path
           d="m 643.47655,166.08789 c -11.02141,0 -19.89258,7.78791 -19.89258,22.11914 v 117.66992 c 0,14.33123 8.87117,24.24414 19.89258,24.24414 h 68.95899 l 42.71093,42.71289 42.7129,-42.71289 h 66.39648 c 11.02142,0 19.89453,-9.91291 19.89453,-24.24414 V 188.20703 c 0,-14.33123 -8.87311,-22.11914 -19.89453,-22.11914 z"
           style="fill:#ed333b;fill-opacity:1;stroke:none;stroke-width:9.56005;stroke-linecap:round;stroke-linejoin:round;stroke-dasharray:9.56005, 38.2402;stop-color:#000000"
           id="rect987"
           sodipodi:nodetypes="sssscccsssss" />
        <path
           d="m 731.97069,210.5293 a 30.724609,30.724609 0 0 0 -30.72461,30.72461 30.724609,30.724609 0 0 0 9.25977,21.98437 l -0.3418,0.17578 45.54492,45.54492 45.54492,-45.54492 -0.11523,-0.0586 a 30.724609,30.724609 0 0 0 9.38086,-22.10156 30.724609,30.724609 0 0 0 -30.72461,-30.72461 30.724609,30.724609 0 0 0 -23.91211,11.43359 30.724609,30.724609 0 0 0 -23.91211,-11.43359 z"
           style="fill:#ffffff;fill-opacity:1;stroke:none;stroke-width:9.23552;stroke-linecap:round;stroke-linejoin:round;stroke-dasharray:9.23552, 36.9421;stop-color:#000000"
           id="path994" />
      </g>
      <path
         style="fill:#33d17a;fill-opacity:1;stroke:none;stroke-width:0.390969px;stroke-linecap:butt;stroke-linejoin:miter;stroke-opacity:1"
         d="m 344.96582,18.626048 v 23.458136 h 23.45814 z"
         id="path218" />
      <path
         style="fill:#33d17a;fill-opacity:1;stroke:none;stroke-width:0.390969px;stroke-linecap:butt;stroke-linejoin:miter;stroke-opacity:1"
         d="M 344.96582,65.54232 V 42.084184 h -23.45813 z"
         id="path1043" />
      <path
         style="fill:#33d17a;fill-opacity:1;stroke:none;stroke-width:0.390969px;stroke-linecap:butt;stroke-linejoin:miter;stroke-opacity:1"
         d="M 368.42396,89.00046 V 65.54232 h -23.45814 z"
         id="path1045" />
      <path
         id="circle1047"
         style="fill:#ff7800;stroke-width:7.81938;stroke-linecap:round;stop-color:#000000"
         d="m 204.21701,219.54845 a 3.9096893,3.9096893 0 0 1 -3.90969,3.90969 3.9096893,3.9096893 0 0 1 -3.90969,-3.90969 3.9096893,3.9096893 0 0 1 3.90969,-3.90969 3.9096893,3.9096893 0 0 1 3.90969,3.90969 z" />
      <path
         id="circle1049"
         style="fill:#ff7800;stroke-width:7.81938;stroke-linecap:round;stop-color:#000000"
         d="m 204.21701,243.00659 a 3.9096893,3.9096893 0 0 1 -3.90969,3.90969 3.9096893,3.9096893 0 0 1 -3.90969,-3.90969 3.9096893,3.9096893 0 0 1 3.90969,-3.90969 3.9096893,3.9096893 0 0 1 3.90969,3.90969 z" />
      <path
         id="circle1051"
         style="fill:#ff7800;stroke-width:7.81938;stroke-linecap:round;stop-color:#000000"
         d="m 227.67514,243.00659 a 3.9096893,3.9096893 0 0 1 -3.90969,3.90969 3.9096893,3.9096893 0 0 1 -3.90969,-3.90969 3.9096893,3.9096893 0 0 1 3.90969,-3.90969 3.9096893,3.9096893 0 0 1 3.90969,3.90969 z" />
      <path
         id="rect1197"
         style="font-variation-settings:normal;vector-effect:none;fill:#26a269;fill-opacity:1;stroke:none;stroke-width:0.534369;stroke-linecap:butt;stroke-linejoin:miter;stroke-miterlimit:4;stroke-dasharray:none;stroke-dashoffset:0;stroke-opacity:1;marker:none;stop-color:#000000"
         d="m 204.21701,158.77771 6.29098,4.19398 a 75.349531,75.349531 0 0 1 40.62529,58.36105 l -3.60895,-2.40596 a 78.538164,78.538164 0 0 1 -43.30732,-60.14907 z"
         sodipodi:nodetypes="ccccc" />
      <path
         id="path175"
         style="font-variation-settings:normal;vector-effect:none;fill:#26a269;fill-opacity:1;stroke:none;stroke-width:0.534369;stroke-linecap:butt;stroke-linejoin:miter;stroke-miterlimit:4;stroke-dasharray:none;stroke-dashoffset:0;stroke-opacity:1;marker:none;stop-color:#000000"
         d="m 298.04955,190.65238 -6.29098,4.19399 a 75.349531,75.349531 0 0 0 -40.62529,58.36104 l 3.60894,-2.40596 a 78.538164,78.538164 0 0 0 43.30733,-60.14907 z"
         sodipodi:nodetypes="ccccc" />
    </g>
  </g>
  <g
     inkscape:groupmode="layer"
     id="layer2"
     inkscape:label="sketch"
     style="display:none;opacity:0.257233;mix-blend-mode:multiply"
     sodipodi:insensitive="true">
    <image
       width="1227.0327"
       height="1227.0327"
       preserveAspectRatio="none"
       xlink:href="file:///run/user/1000/gvfs/smb-share%3Aserver=cockpit,share=megadrive/Temp/Sketches/People_Of_Gnome%201.png"
       id="image232"
       x="-59.297577"
       y="-120.03976" />
  </g>
</svg>
