<svg xmlns="http://www.w3.org/2000/svg" width="16" height="16">
    <g fill="#241f31">
        <path d="M3.715 1A2.732 2.732 0 0 0 1 3.715v8.57A2.732 2.732 0 0 0 3.715 15h8.57A2.732 2.732 0 0 0 15 12.285v-8.57A2.732 2.732 0 0 0 12.285 1zm0 2h8.57c.413 0 .715.302.715.715v3.62L12.336 8l.664.664v3.621a.693.693 0 0 1-.715.715h-8.57A.693.693 0 0 1 3 12.285V8.707L3.707 8 3 7.293V3.715C3 3.302 3.302 3 3.715 3z" style="line-height:normal;font-variant-ligatures:normal;font-variant-position:normal;font-variant-caps:normal;font-variant-numeric:normal;font-variant-alternates:normal;font-feature-settings:normal;text-indent:0;text-align:start;text-decoration-line:none;text-decoration-style:solid;text-decoration-color:#000;text-transform:none;text-orientation:mixed;shape-padding:0;isolation:auto;mix-blend-mode:normal" color="#000" font-weight="400" font-family="sans-serif" white-space="normal" overflow="visible"/>
        <path d="M4.518 5L4 6.036h1.014V11H7V5zm3.437 0v3.213c0 1.036.777 1.036 1.295 1.036h.756V11H12V5h-1.994v3H9.28c-.259 0-.259-.259-.259-.259V5z" style="line-height:1.25;-inkscape-font-specification:'Montserrat, Bold';font-variant-ligatures:normal;font-variant-caps:normal;font-variant-numeric:normal;font-feature-settings:normal;text-align:start" font-weight="700" font-family="Montserrat" letter-spacing="0" word-spacing="0"/>
    </g>
</svg>
