<?xml version='1.0' encoding='UTF-8' standalone='no'?>
<!-- Created with Inkscape (http://www.inkscape.org/) -->

<svg xmlns:cc='http://creativecommons.org/ns#' xmlns:dc='http://purl.org/dc/elements/1.1/' sodipodi:docname='recipes-dairy-symbolic.svg' height='16' id='svg7384' xmlns:inkscape='http://www.inkscape.org/namespaces/inkscape' xmlns:osb='http://www.openswatchbook.org/uri/2009/osb' xmlns:rdf='http://www.w3.org/1999/02/22-rdf-syntax-ns#' xmlns:sodipodi='http://sodipodi.sourceforge.net/DTD/sodipodi-0.dtd' xmlns:svg='http://www.w3.org/2000/svg' version='1.1' inkscape:version='0.92+devel unknown' viewBox='0 0 16 16' width='16' xmlns='http://www.w3.org/2000/svg'>
  <metadata id='metadata90'>
    <rdf:RDF>
      <cc:Work rdf:about=''>
        <dc:format>image/svg+xml</dc:format>
        <dc:type rdf:resource='http://purl.org/dc/dcmitype/StillImage'/>
        <dc:title>Gnome Symbolic Icon Theme</dc:title>
      </cc:Work>
    </rdf:RDF>
  </metadata>
  <sodipodi:namedview inkscape:bbox-nodes='true' inkscape:bbox-paths='true' bordercolor='#666666' borderopacity='1' inkscape:current-layer='layer9' inkscape:cx='2.3734964' inkscape:cy='96.539724' inkscape:document-rotation='0' gridtolerance='10' inkscape:guide-bbox='true' guidetolerance='10' id='namedview88' inkscape:measure-end='0,0' inkscape:measure-start='56,310.597' inkscape:object-nodes='false' inkscape:object-paths='false' objecttolerance='10' pagecolor='#555753' inkscape:pageopacity='1' inkscape:pageshadow='2' showborder='false' showgrid='false' showguides='true' inkscape:snap-bbox='true' inkscape:snap-bbox-edge-midpoints='true' inkscape:snap-bbox-midpoints='true' inkscape:snap-global='true' inkscape:snap-grids='true' inkscape:snap-nodes='true' inkscape:snap-others='true' inkscape:snap-to-guides='true' inkscape:window-height='1376' inkscape:window-maximized='1' inkscape:window-width='3440' inkscape:window-x='0' inkscape:window-y='27' inkscape:zoom='1'>
    <inkscape:grid empspacing='2' enabled='true' id='grid4866' originx='-122.00001' originy='-301.99999' snapvisiblegridlinesonly='true' spacingx='1px' spacingy='1px' type='xygrid' visible='true'/>
  </sodipodi:namedview>
  <title id='title9167'>Gnome Symbolic Icon Theme</title>
  <defs id='defs7386'>
    <linearGradient id='linearGradient7212' osb:paint='solid'>
      <stop id='stop7214' offset='0' style='stop-color:#000000;stop-opacity:1;'/>
    </linearGradient>
  </defs>
  <g inkscape:groupmode='layer' id='layer9' inkscape:label='apps' style='display:inline' transform='translate(-363.00021,84.999986)'>
    
    <path inkscape:connector-curvature='0' d='m 368.52626,-83.92063 c -0.46137,0 -0.87696,0.40482 -0.87696,1 0,0.58739 0.41514,1 0.82032,1 L 367.06532,-78 v 3 h 0.0117 c -0.002,0.0374 -0.0117,0.0733 -0.0117,0.11133 v 3.10547 c 0,0.97038 0.78157,1.75195 1.75195,1.75195 h 4.44801 c 0.97038,0 1.75195,-0.78157 1.75195,-1.75195 v -3.10547 c 0,-0.038 -0.009,-0.0739 -0.0117,-0.11133 h 0.0117 v -3 l -1.50977,-3.92063 c 0.51003,0 0.93555,-0.39122 0.93555,-1 0,-0.56776 -0.42669,-1 -0.92187,-1 z m 0.91015,2 c 1.04504,-0.38848 2.12966,-0.30799 3.18434,0 L 374.01723,-78 c 0,0 0.16959,1.16647 -0.27371,1.56615 -0.4433,0.39968 -2.1292,-0.0525 -2.73792,0.29892 -0.62663,0.36178 -2.00526,0.70796 -2.52137,0.30876 C 367.96812,-76.22538 368.06532,-78 368.06532,-78 Z' id='rect1898' sodipodi:nodetypes='ssccccssssssccccsssccczszcc' style='color:#000000;overflow:visible;vector-effect:none;fill:#bebebe;fill-opacity:1;stroke:none;stroke-width:2;stroke-opacity:1'/>
  </g>
</svg>
