<?xml version="1.0" encoding="UTF-8" standalone="no"?>
<!-- Created with Inkscape (http://www.inkscape.org/) -->

<svg
   xmlns:dc="http://purl.org/dc/elements/1.1/"
   xmlns:cc="http://creativecommons.org/ns#"
   xmlns:rdf="http://www.w3.org/1999/02/22-rdf-syntax-ns#"
   xmlns:svg="http://www.w3.org/2000/svg"
   xmlns="http://www.w3.org/2000/svg"
   xmlns:sodipodi="http://sodipodi.sourceforge.net/DTD/sodipodi-0.dtd"
   xmlns:inkscape="http://www.inkscape.org/namespaces/inkscape"
   width="800"
   height="800"
   viewBox="0 0 800 800"
   version="1.1"
   id="svg1323"
   inkscape:version="0.92.4 5da689c313, 2019-01-14"
   sodipodi:docname="mouse.svg">
  <defs
     id="defs1317" />
  <sodipodi:namedview
     id="base"
     pagecolor="#ffffff"
     bordercolor="#666666"
     borderopacity="1.0"
     inkscape:pageopacity="0.0"
     inkscape:pageshadow="2"
     inkscape:zoom="0.70710678"
     inkscape:cx="364.04393"
     inkscape:cy="474.7486"
     inkscape:document-units="px"
     inkscape:current-layer="layer1"
     showgrid="false"
     units="px" />
  <metadata
     id="metadata1320">
    <rdf:RDF>
      <cc:Work
         rdf:about="">
        <dc:format>image/svg+xml</dc:format>
        <dc:type
           rdf:resource="http://purl.org/dc/dcmitype/StillImage" />
        <dc:title></dc:title>
      </cc:Work>
    </rdf:RDF>
  </metadata>
  <g
     inkscape:label="Layer 1"
     inkscape:groupmode="layer"
     id="layer1"
     transform="translate(0,-85.333325)">
    <path
       style="color:#000000;font-style:normal;font-variant:normal;font-weight:normal;font-stretch:normal;font-size:medium;line-height:normal;font-family:sans-serif;font-variant-ligatures:normal;font-variant-position:normal;font-variant-caps:normal;font-variant-numeric:normal;font-variant-alternates:normal;font-feature-settings:normal;text-indent:0;text-align:start;text-decoration:none;text-decoration-line:none;text-decoration-style:solid;text-decoration-color:#000000;letter-spacing:normal;word-spacing:normal;text-transform:none;writing-mode:lr-tb;direction:ltr;text-orientation:mixed;dominant-baseline:auto;baseline-shift:baseline;text-anchor:start;white-space:normal;shape-padding:0;clip-rule:nonzero;display:inline;overflow:visible;visibility:visible;opacity:1;isolation:auto;mix-blend-mode:normal;color-interpolation:sRGB;color-interpolation-filters:linearRGB;solid-color:#000000;solid-opacity:1;vector-effect:none;fill:#98c1f1;fill-opacity:1;fill-rule:nonzero;stroke:none;stroke-width:27.94018745;stroke-linecap:butt;stroke-linejoin:round;stroke-miterlimit:4;stroke-dasharray:none;stroke-dashoffset:0;stroke-opacity:1;marker:none;color-rendering:auto;image-rendering:auto;shape-rendering:auto;text-rendering:auto;enable-background:accumulate"
       d="m 411.56145,188.30559 c -1.19813,0 -2.54086,0.052 -3.70336,-0.007 -103.62344,0 -156.92371,54.10408 -176.50758,105.72171 -13.33671,35.15181 -7.95883,73.46396 -3.32617,110.11523 1.70552,13.4932 3.83848,27.8637 6.18555,42.5957 0.13015,3.83903 0.23151,7.50042 0.16211,10.03125 -1.26284,45.98762 -18.93504,105.02443 -17.78906,146.79297 2.01325,73.37885 43.74195,124.11981 97.66211,148.99219 0.4809,0.22183 1.3062,0.63033 2.40039,1.12109 60.63087,28.62195 133.23026,30.99365 192.57226,-5.89257 50.95206,-26.50367 89.21875,-76.30097 89.21875,-144.60352 0,-41.11537 -16.52526,-100.23172 -17.79297,-146.41211 -0.46888,-17.08062 3.80085,-56.35847 3.88282,-57.11133 4.33036,-20.09171 7.54849,-41.96377 6.66015,-63.95898 v -0.004 c 0.0336,0.83435 0.0477,0.33596 -0.006,-0.89453 -0.3553,-11.45447 -1.97576,-22.71842 -5.3164,-33.49805 -0.393,-1.26815 -0.80241,-2.48388 -1.22071,-3.66601 l 0.14063,0.41797 c -0.0508,-0.15937 -0.26976,-1.16461 -0.90039,-2.97852 -1.98319,-5.70411 -4.55316,-11.22542 -7.44727,-16.56836 -0.43519,-0.83851 -0.75833,-1.40973 -0.54492,-0.99219 -35.51369,-69.48319 -99.22596,-89.20117 -164.33008,-89.20117 z m 2.57617,28.02539 c 58.85406,0.41599 106.75932,14.96875 136.875,73.89063 0.63591,1.24419 0.84477,1.57127 0.56836,1.02148 0.0669,0.13391 0.13589,0.26674 0.20703,0.39844 2.36957,4.35831 4.3284,8.6419 5.70508,12.60156 -0.021,-0.0603 0.15744,0.6791 0.66992,2.28711 0.0447,0.14005 0.0916,0.2794 0.14063,0.41797 0.32009,0.90459 0.60784,1.75945 0.87305,2.61523 2.48141,8.00706 3.80707,16.81804 4.08789,26.25 0.003,0.0938 0.007,0.18755 0.0117,0.28126 -0.0512,-1.02642 -0.0674,-0.78458 -0.008,0.70898 l 0.002,0.008 c 0.75931,18.78012 -2.09217,38.84063 -6.23243,57.84571 -0.0991,0.45489 -0.17533,0.91445 -0.22851,1.37695 0,0 -4.71406,38.9682 -4.0957,61.49414 1.42193,51.79889 17.78125,112.8127 17.78125,145.64453 0,58.28797 -30.61449,97.26946 -74.41602,119.95508 -0.34242,0.17747 -0.67734,0.36904 -1.00391,0.57422 -50.35014,31.61812 -112.97891,30.02346 -166.65039,4.63476 -0.10165,-0.0475 -0.20387,-0.0937 -0.30664,-0.13867 -0.39102,-0.1736 -1.10372,-0.52967 -2.16992,-1.02148 -46.16824,-21.29657 -79.69372,-60.90077 -81.43555,-124.38672 -0.88212,-32.15173 16.36186,-93.27033 17.78907,-145.26172 0.10915,-3.98032 -0.0301,-8.2017 -0.17774,-12.41797 -0.0206,-0.57518 -0.0767,-1.14854 -0.16797,-1.7168 -2.38465,-14.91386 -4.5172,-29.34623 -6.21289,-42.76172 -4.62612,-36.59951 -8.17853,-70.58188 1.73047,-96.69921 16.12177,-42.49251 55.6348,-87.11691 149.12695,-87.48438 0.38715,0.0331 0.77551,0.0501 1.16407,0.0508 0.16299,-4.7e-4 0.1449,0.003 -0.11328,-0.002 l -0.13672,-0.002 c 1.45778,0.0401 2.62234,0.0405 3.43164,0.0762 1.06949,0.0424 2.14031,-0.0382 3.1914,-0.24024 z"
       id="use3906-7-3-6-7"
       inkscape:connector-curvature="0"
       sodipodi:nodetypes="ccssccssccssccccccccccccccccccccccccccsscccccscccssccccccc" />
    <path
       style="color:#000000;font-style:normal;font-variant:normal;font-weight:normal;font-stretch:normal;font-size:medium;line-height:normal;font-family:sans-serif;font-variant-ligatures:normal;font-variant-position:normal;font-variant-caps:normal;font-variant-numeric:normal;font-variant-alternates:normal;font-feature-settings:normal;text-indent:0;text-align:start;text-decoration:none;text-decoration-line:none;text-decoration-style:solid;text-decoration-color:#000000;letter-spacing:normal;word-spacing:normal;text-transform:none;writing-mode:lr-tb;direction:ltr;text-orientation:mixed;dominant-baseline:auto;baseline-shift:baseline;text-anchor:start;white-space:normal;shape-padding:0;clip-rule:nonzero;display:inline;overflow:visible;visibility:visible;opacity:1;isolation:auto;mix-blend-mode:normal;color-interpolation:sRGB;color-interpolation-filters:linearRGB;solid-color:#000000;solid-opacity:1;vector-effect:none;fill:#98c1f1;fill-opacity:1;fill-rule:nonzero;stroke:none;stroke-width:4.65669775;stroke-linecap:butt;stroke-linejoin:miter;stroke-miterlimit:4;stroke-dasharray:none;stroke-dashoffset:0;stroke-opacity:1;marker:none;color-rendering:auto;image-rendering:auto;shape-rendering:auto;text-rendering:auto;enable-background:accumulate"
       d="m 411.1513,209.25286 -3.58008,0.13672 c -91.0052,0.0316 -134.90906,47.53923 -152.04883,93.36914 l -0.0566,0.002 -0.5332,1.47852 c -10.97791,30.34441 -6.72094,65.62576 -2.45313,101.03515 6.94707,57.63895 20.76194,131.16337 33.53711,193.28516 l 4.5625,-0.93945 c -12.76259,-62.06043 -26.56105,-135.52489 -33.4766,-192.9024 -4.26682,-35.40114 -8.24046,-70.00891 2.20898,-98.89258 16.22539,-44.84906 57.92573,-91.77929 148.34766,-91.77929 h 0.0449 l 3.51758,-0.13672 c 30.62932,0.003 59.40998,4.67523 84.07812,18.35742 24.67501,13.686 45.36463,36.3706 59.84961,72.9668 11.23343,28.3816 5.66357,66.0732 -0.36718,99.34765 l -49.41993,266.23438 4.57813,0.84961 49.42187,-266.25 0.002,-0.004 c 6.04854,-33.37256 12.05186,-71.73432 0.11523,-101.89258 -14.80295,-37.39953 -36.29751,-61.11166 -61.92187,-75.32422 -25.62436,-14.21256 -55.24989,-18.9414 -86.36133,-18.9414 z"
       id="path3896-9-7-7"
       inkscape:connector-curvature="0" />
    <path
       style="color:#000000;font-style:normal;font-variant:normal;font-weight:normal;font-stretch:normal;font-size:medium;line-height:normal;font-family:sans-serif;font-variant-ligatures:normal;font-variant-position:normal;font-variant-caps:normal;font-variant-numeric:normal;font-variant-alternates:normal;font-feature-settings:normal;text-indent:0;text-align:start;text-decoration:none;text-decoration-line:none;text-decoration-style:solid;text-decoration-color:#000000;letter-spacing:normal;word-spacing:normal;text-transform:none;writing-mode:lr-tb;direction:ltr;text-orientation:mixed;dominant-baseline:auto;baseline-shift:baseline;text-anchor:start;white-space:normal;shape-padding:0;clip-rule:nonzero;display:inline;overflow:visible;visibility:visible;opacity:1;isolation:auto;mix-blend-mode:normal;color-interpolation:sRGB;color-interpolation-filters:linearRGB;solid-color:#000000;solid-opacity:1;vector-effect:none;fill:#98c1f1;fill-opacity:1;fill-rule:nonzero;stroke:none;stroke-width:2.01753354;stroke-linecap:butt;stroke-linejoin:miter;stroke-miterlimit:4;stroke-dasharray:none;stroke-dashoffset:0;stroke-opacity:1;color-rendering:auto;image-rendering:auto;shape-rendering:auto;text-rendering:auto;enable-background:accumulate"
       d="m 405.15716,202.41887 v 40.20899 h 4.65624 v -40.20899 z"
       id="path5509-8-0"
       inkscape:connector-curvature="0" />
    <path
       style="color:#000000;font-style:normal;font-variant:normal;font-weight:normal;font-stretch:normal;font-size:medium;line-height:normal;font-family:sans-serif;font-variant-ligatures:normal;font-variant-position:normal;font-variant-caps:normal;font-variant-numeric:normal;font-variant-alternates:normal;font-feature-settings:normal;text-indent:0;text-align:start;text-decoration:none;text-decoration-line:none;text-decoration-style:solid;text-decoration-color:#000000;letter-spacing:normal;word-spacing:normal;text-transform:none;writing-mode:lr-tb;direction:ltr;text-orientation:mixed;dominant-baseline:auto;baseline-shift:baseline;text-anchor:start;white-space:normal;shape-padding:0;clip-rule:nonzero;display:inline;overflow:visible;visibility:visible;opacity:1;isolation:auto;mix-blend-mode:normal;color-interpolation:sRGB;color-interpolation-filters:linearRGB;solid-color:#000000;solid-opacity:1;vector-effect:none;fill:#98c1f1;fill-opacity:1;fill-rule:nonzero;stroke:none;stroke-width:16.1392746;stroke-linecap:square;stroke-linejoin:round;stroke-miterlimit:4;stroke-dasharray:none;stroke-dashoffset:0;stroke-opacity:1;marker:none;color-rendering:auto;image-rendering:auto;shape-rendering:auto;text-rendering:auto;enable-background:accumulate"
       d="m 407.0302,230.84075 c -21.59398,0 -39.23047,17.63649 -39.23047,39.23047 v 101.25586 c 0,21.59397 17.63649,39.23047 39.23047,39.23047 h 0.91016 c 21.59398,0 39.23047,-17.6365 39.23047,-39.23047 V 270.07122 c 0,-21.59398 -17.63649,-39.23047 -39.23047,-39.23047 z m 0,16.13867 h 0.91016 c 12.93198,0 23.0918,10.15981 23.0918,23.0918 v 101.25586 c 0,12.93198 -10.15982,23.08984 -23.0918,23.08984 h -0.91016 c -12.93198,0 -23.0918,-10.15786 -23.0918,-23.08984 V 270.07122 c 0,-12.93199 10.15982,-23.0918 23.0918,-23.0918 z"
       id="rect5511-3-8"
       inkscape:connector-curvature="0" />
    <path
       style="color:#000000;font-style:normal;font-variant:normal;font-weight:normal;font-stretch:normal;font-size:medium;line-height:normal;font-family:sans-serif;font-variant-ligatures:normal;font-variant-position:normal;font-variant-caps:normal;font-variant-numeric:normal;font-variant-alternates:normal;font-feature-settings:normal;text-indent:0;text-align:start;text-decoration:none;text-decoration-line:none;text-decoration-style:solid;text-decoration-color:#000000;letter-spacing:normal;word-spacing:normal;text-transform:none;writing-mode:lr-tb;direction:ltr;text-orientation:mixed;dominant-baseline:auto;baseline-shift:baseline;text-anchor:start;white-space:normal;shape-padding:0;clip-rule:nonzero;display:inline;overflow:visible;visibility:visible;opacity:1;isolation:auto;mix-blend-mode:normal;color-interpolation:sRGB;color-interpolation-filters:linearRGB;solid-color:#000000;solid-opacity:1;vector-effect:none;fill:#98c1f1;fill-opacity:1;fill-rule:nonzero;stroke:none;stroke-width:4.65669775;stroke-linecap:butt;stroke-linejoin:miter;stroke-miterlimit:4;stroke-dasharray:none;stroke-dashoffset:0;stroke-opacity:1;color-rendering:auto;image-rendering:auto;shape-rendering:auto;text-rendering:auto;enable-background:accumulate"
       d="m 407.41692,414.29973 c -61.36274,-0.0403 -106.2575,11.17815 -154.17578,23.35352 l 1.14648,4.51367 c 47.90843,-12.17286 92.2327,-23.25137 153.0293,-23.21094 h 0.002 0.002 c 60.79667,-0.0408 105.12084,11.03808 153.02929,23.21094 l 1.14649,-4.51367 C 513.67833,425.47789 468.78367,414.25904 407.42083,414.29973 Z"
       id="path5509-2-7-36-7"
       inkscape:connector-curvature="0" />
    <path
       inkscape:connector-curvature="0"
       id="path2033"
       d="m 405.15716,402.41887 v 14.20899 h 4.65624 v -14.20899 z"
       style="color:#000000;font-style:normal;font-variant:normal;font-weight:normal;font-stretch:normal;font-size:medium;line-height:normal;font-family:sans-serif;font-variant-ligatures:normal;font-variant-position:normal;font-variant-caps:normal;font-variant-numeric:normal;font-variant-alternates:normal;font-feature-settings:normal;text-indent:0;text-align:start;text-decoration:none;text-decoration-line:none;text-decoration-style:solid;text-decoration-color:#000000;letter-spacing:normal;word-spacing:normal;text-transform:none;writing-mode:lr-tb;direction:ltr;text-orientation:mixed;dominant-baseline:auto;baseline-shift:baseline;text-anchor:start;white-space:normal;shape-padding:0;clip-rule:nonzero;display:inline;overflow:visible;visibility:visible;opacity:1;isolation:auto;mix-blend-mode:normal;color-interpolation:sRGB;color-interpolation-filters:linearRGB;solid-color:#000000;solid-opacity:1;vector-effect:none;fill:#98c1f1;fill-opacity:1;fill-rule:nonzero;stroke:none;stroke-width:1.19933581;stroke-linecap:butt;stroke-linejoin:miter;stroke-miterlimit:4;stroke-dasharray:none;stroke-dashoffset:0;stroke-opacity:1;color-rendering:auto;image-rendering:auto;shape-rendering:auto;text-rendering:auto;enable-background:accumulate" />
  </g>
</svg>
