<?xml version="1.0" encoding="UTF-8" standalone="no"?>
<!-- Created with Inkscape (http://www.inkscape.org/) -->

<svg
   width="1110"
   height="1800"
   viewBox="0 0 293.6875 476.25001"
   version="1.1"
   id="svg46043"
   inkscape:version="1.1.1 (3bf5ae0d25, 2021-09-20)"
   sodipodi:docname="src.svg"
   inkscape:export-filename="personalization.png"
   inkscape:export-xdpi="96"
   inkscape:export-ydpi="96"
   xmlns:inkscape="http://www.inkscape.org/namespaces/inkscape"
   xmlns:sodipodi="http://sodipodi.sourceforge.net/DTD/sodipodi-0.dtd"
   xmlns:xlink="http://www.w3.org/1999/xlink"
   xmlns="http://www.w3.org/2000/svg"
   xmlns:svg="http://www.w3.org/2000/svg"
   xmlns:rdf="http://www.w3.org/1999/02/22-rdf-syntax-ns#"
   xmlns:cc="http://creativecommons.org/ns#"
   xmlns:dc="http://purl.org/dc/elements/1.1/">
  <defs
     id="defs46037">
    <rect
       x="1065.9341"
       y="1118.2587"
       width="709.224"
       height="731.7323"
       id="rect24258" />
    <linearGradient
       inkscape:collect="always"
       xlink:href="#linearGradient9530"
       id="linearGradient8344"
       gradientUnits="userSpaceOnUse"
       gradientTransform="matrix(0.15306003,0,0,0.2645833,-253.72753,284.38253)"
       x1="2697.0312"
       y1="2801.6377"
       x2="3163.0312"
       y2="2801.6377" />
    <linearGradient
       inkscape:collect="always"
       id="linearGradient9530">
      <stop
         style="stop-color:#f8e45c;stop-opacity:1"
         offset="0"
         id="stop9526" />
      <stop
         style="stop-color:#ff7800;stop-opacity:1"
         offset="1"
         id="stop9528" />
    </linearGradient>
    <clipPath
       clipPathUnits="userSpaceOnUse"
       id="clipPath59049">
      <rect
         ry="1.5875"
         rx="1.5875"
         y="2735.6648"
         x="4507.7046"
         height="25.929165"
         width="41.804169"
         id="rect59051"
         style="vector-effect:none;fill:#f5f4f4;fill-opacity:1;stroke:#f5f4f4;stroke-width:0.529164;stroke-linecap:butt;stroke-linejoin:miter;stroke-miterlimit:4;stroke-dasharray:none;stroke-dashoffset:0;stroke-opacity:1;marker:none" />
    </clipPath>
    <clipPath
       clipPathUnits="userSpaceOnUse"
       id="clipPath2064">
      <rect
         ry="1.5875"
         rx="1.5875"
         y="2735.6648"
         x="4507.7046"
         height="25.929165"
         width="41.804169"
         id="rect2062"
         style="vector-effect:none;fill:#f5f4f4;fill-opacity:1;stroke:#f5f4f4;stroke-width:0.529164;stroke-linecap:butt;stroke-linejoin:miter;stroke-miterlimit:4;stroke-dasharray:none;stroke-dashoffset:0;stroke-opacity:1;marker:none" />
    </clipPath>
  </defs>
  <sodipodi:namedview
     id="base"
     pagecolor="#ffffff"
     bordercolor="#666666"
     borderopacity="1.0"
     inkscape:pageopacity="1"
     inkscape:pageshadow="2"
     inkscape:zoom="1"
     inkscape:cx="564"
     inkscape:cy="428"
     inkscape:document-units="px"
     inkscape:current-layer="layer1"
     showgrid="false"
     units="px"
     borderlayer="true"
     inkscape:showpageshadow="false"
     inkscape:window-width="1920"
     inkscape:window-height="1011"
     inkscape:window-x="0"
     inkscape:window-y="0"
     inkscape:window-maximized="1"
     inkscape:snap-bbox="true"
     inkscape:bbox-paths="true"
     inkscape:bbox-nodes="true"
     inkscape:snap-nodes="true"
     inkscape:pagecheckerboard="0">
    <inkscape:grid
       type="xygrid"
       id="grid48341" />
  </sodipodi:namedview>
  <metadata
     id="metadata46040">
    <rdf:RDF>
      <cc:Work
         rdf:about="">
        <dc:format>image/svg+xml</dc:format>
        <dc:type
           rdf:resource="http://purl.org/dc/dcmitype/StillImage" />
      </cc:Work>
    </rdf:RDF>
  </metadata>
  <g
     inkscape:groupmode="layer"
     id="layer2"
     inkscape:label="window"
     style="display:inline"
     sodipodi:insensitive="true">
    <rect
       style="display:inline;fill:#e6e4e1;fill-opacity:1;stroke:#c1bab5;stroke-width:0.264526;stroke-linecap:round;stroke-miterlimit:4;stroke-dasharray:none;stroke-opacity:1;enable-background:new"
       id="rect74956"
       width="251.35423"
       height="42.068806"
       x="21.288754"
       y="52.785259"
       rx="3.1750002"
       ry="3.1750002" />
    <rect
       inkscape:export-ydpi="90"
       inkscape:export-xdpi="90"
       inkscape:export-filename="/home/lapo.fedora/SparkleShare/gnome-mockups/content selection/content-selection.png"
       ry="1.5875"
       rx="1.5875"
       y="54.62645"
       x="23.151051"
       height="8.7312822"
       width="9.260417"
       id="rect74958"
       style="color:#000000;display:inline;overflow:visible;visibility:visible;fill:#f8f7f7;fill-opacity:1;fill-rule:nonzero;stroke:#c1bab5;stroke-width:0.264583;stroke-linecap:butt;stroke-linejoin:miter;stroke-miterlimit:4;stroke-dasharray:none;stroke-dashoffset:0;stroke-opacity:1;marker:none;enable-background:accumulate" />
    <path
       inkscape:export-ydpi="90"
       inkscape:export-xdpi="90"
       inkscape:export-filename="/home/aday/Dropbox/Public/settings/sound.png"
       inkscape:connector-curvature="0"
       id="path74960"
       d="m 77.12696,53.034598 v 11.9124"
       style="display:inline;fill:#dddad6;fill-opacity:1;fill-rule:evenodd;stroke:#b7b7b7;stroke-width:0.264583;stroke-linecap:square;stroke-linejoin:miter;stroke-miterlimit:4;stroke-dasharray:none;stroke-opacity:1" />
    <g
       style="display:inline;fill:#2e3436;fill-opacity:1"
       transform="matrix(0.26458333,0,0,0.26458333,247.38678,-80.178203)"
       id="g74966">
      <g
         transform="translate(19,-242)"
         id="g74964"
         style="display:inline;fill:#2e3436;fill-opacity:1">
        <path
           inkscape:connector-curvature="0"
           d="m 45,764 h 1 c 0.01037,-1.2e-4 0.02079,-4.6e-4 0.03125,0 0.254951,0.0112 0.50987,0.12858 0.6875,0.3125 L 49,766.59375 51.3125,764.3125 C 51.578125,764.082 51.759172,764.007 52,764 h 1 v 1 c 0,0.28647 -0.03434,0.55065 -0.25,0.75 l -2.28125,2.28125 2.25,2.25 C 52.906938,770.46942 52.999992,770.7347 53,771 v 1 h -1 c -0.265301,-10e-6 -0.530586,-0.0931 -0.71875,-0.28125 L 49,769.4375 46.71875,771.71875 C 46.530586,771.90694 46.26529,772 46,772 h -1 v -1 c -3e-6,-0.26529 0.09306,-0.53058 0.28125,-0.71875 l 2.28125,-2.25 L 45.28125,765.75 C 45.070508,765.55537 44.97809,765.28075 45,765 Z"
           id="path74962"
           style="color:#bebebe;font-style:normal;font-variant:normal;font-weight:normal;font-stretch:normal;font-size:medium;line-height:normal;font-family:'Andale Mono';-inkscape-font-specification:'Andale Mono';text-indent:0;text-align:start;text-decoration:none;text-decoration-line:none;letter-spacing:normal;word-spacing:normal;text-transform:none;writing-mode:lr-tb;direction:ltr;text-anchor:start;display:inline;overflow:visible;visibility:visible;fill:#2e3436;fill-opacity:1;fill-rule:nonzero;stroke:none;stroke-width:1.78125;marker:none;enable-background:new" />
      </g>
    </g>
    <g
       inkscape:export-ydpi="90"
       inkscape:export-xdpi="90"
       inkscape:export-filename="/home/aday/Dropbox/Public/settings/sound.png"
       style="display:inline"
       transform="matrix(0.26458333,0,0,0.26458333,-1.0583857,-140.76882)"
       id="g74972"
       inkscape:label="go-next">
      <rect
         width="16"
         height="16"
         x="-116.0002"
         y="747"
         id="rect74968"
         style="color:#bebebe;display:inline;overflow:visible;visibility:visible;fill:none;stroke:none;stroke-width:1;marker:none;enable-background:new"
         transform="scale(-1,1)" />
      <path
         sodipodi:nodetypes="ccscsccsscscc"
         inkscape:connector-curvature="0"
         id="path74970"
         d="m 104.5627,755 5.71875,5.71875 C 110.47732,760.91462 110.74458,761 111.0002,761 h 1 v -1 c 0,-0.25562 -0.0854,-0.52288 -0.28125,-0.71875 L 107.4377,755 l 4.28125,-4.28125 c 0.19587,-0.19587 0.28125,-0.46313 0.28125,-0.71875 v -1 h -1 c -0.25562,0 -0.52288,0.0854 -0.71875,0.28125 z"
         style="display:inline;fill:#241f31;fill-opacity:1;stroke:none" />
    </g>
    <text
       xml:space="preserve"
       style="font-style:normal;font-variant:normal;font-weight:normal;font-stretch:normal;font-size:3.88056px;line-height:0%;font-family:Cantarell;-inkscape-font-specification:Cantarell;text-align:center;letter-spacing:0px;word-spacing:0px;text-anchor:middle;display:inline;fill:#2e3436;fill-opacity:1;stroke:none;stroke-width:0.264583"
       x="49.200764"
       y="60.406483"
       id="text74976"
       inkscape:export-filename="/home/aday/Dropbox/Public/settings/sound.png"
       inkscape:export-xdpi="90"
       inkscape:export-ydpi="90"><tspan
         style="font-weight:bold;font-size:3.88056px;line-height:1.25;text-align:center;text-anchor:middle;stroke-width:0.264583"
         sodipodi:role="line"
         id="tspan74974"
         x="49.200764"
         y="60.406483">Settings</tspan></text>
    <rect
       inkscape:export-ydpi="90"
       inkscape:export-xdpi="90"
       inkscape:export-filename="/home/lapo.fedora/SparkleShare/gnome-mockups/content selection/content-selection.png"
       ry="1.5875"
       rx="1.5875"
       y="54.62645"
       x="66.01355"
       height="8.7312822"
       width="9.260417"
       id="rect74978"
       style="color:#000000;display:inline;overflow:visible;visibility:visible;fill:#f8f7f7;fill-opacity:1;fill-rule:nonzero;stroke:#c1bab5;stroke-width:0.264583;stroke-linecap:butt;stroke-linejoin:miter;stroke-miterlimit:4;stroke-dasharray:none;stroke-dashoffset:0;stroke-opacity:1;marker:none;enable-background:accumulate" />
    <g
       inkscape:label="open-menu"
       id="g74988"
       transform="matrix(0.26458333,0,0,0.26458333,63.235425,-16.149601)"
       style="display:inline;enable-background:new">
      <rect
         style="color:#bebebe;display:inline;overflow:visible;visibility:visible;fill:none;stroke:none;stroke-width:1;marker:none"
         id="rect74980"
         width="16"
         height="16"
         x="20"
         y="276" />
      <rect
         style="color:#bebebe;display:inline;overflow:visible;visibility:visible;fill:#2e3436;fill-opacity:1;stroke:none;stroke-width:1;marker:none"
         id="rect74982"
         width="9.9996014"
         height="2.0002136"
         x="23.000198"
         y="278.99979" />
      <rect
         style="color:#bebebe;display:inline;overflow:visible;visibility:visible;fill:#2e3436;fill-opacity:1;stroke:none;stroke-width:1;marker:none"
         id="rect74984"
         width="9.9996014"
         height="2.0002136"
         x="23.000198"
         y="282.99979" />
      <rect
         style="color:#bebebe;display:inline;overflow:visible;visibility:visible;fill:#2e3436;fill-opacity:1;stroke:none;stroke-width:1;marker:none"
         id="rect74986"
         width="9.9996014"
         height="2.0002136"
         x="23.000198"
         y="286.99979" />
    </g>
    <path
       id="path74990"
       style="display:inline;fill:#ffffff;stroke:#c1bab5;stroke-width:0.264526;stroke-linecap:round;enable-background:new"
       d="m 24.473948,65.211498 h 49.477141 3.175 v 168.010482 3.175 H 24.473948 c -1.75895,0 -3.175,-1.416 -3.175,-3.175 V 65.211498 Z"
       sodipodi:nodetypes="cccccsscc" />
    <rect
       inkscape:export-ydpi="90"
       inkscape:export-xdpi="90"
       y="119.8455"
       x="23.018751"
       height="10.583319"
       width="52.387501"
       id="rect74992"
       style="display:inline;fill:#e6e4e1;fill-opacity:1;stroke:none;stroke-width:0.264668;stroke-linecap:square;stroke-miterlimit:4;stroke-dasharray:none;stroke-dashoffset:0;stroke-opacity:1"
       rx="1.5875"
       ry="1.5875001" />
    <text
       xml:space="preserve"
       style="font-style:normal;font-variant:normal;font-weight:bold;font-stretch:normal;font-size:3.88056px;line-height:0%;font-family:Cantarell;-inkscape-font-specification:'Cantarell Bold';text-align:start;letter-spacing:0px;word-spacing:0px;text-anchor:start;display:inline;fill:#2e3436;fill-opacity:1;stroke:none;stroke-width:0.264583"
       x="32.808361"
       y="126.49332"
       id="text74996"
       inkscape:export-filename="/home/aday/Dropbox/Public/settings/sound.png"
       inkscape:export-xdpi="90"
       inkscape:export-ydpi="90"><tspan
         style="font-style:normal;font-variant:normal;font-weight:normal;font-stretch:normal;font-size:3.88056px;line-height:1.25;font-family:Cantarell;-inkscape-font-specification:Cantarell;fill:#2e3436;fill-opacity:1;stroke-width:0.264583"
         sodipodi:role="line"
         id="tspan74994"
         x="32.808361"
         y="126.49332">Personalization</tspan></text>
    <path
       id="path75086"
       style="display:inline;fill:#fafafa;fill-opacity:1;stroke:#c1bab5;stroke-width:0.264526;stroke-linecap:round;enable-background:new"
       d="m 269.47908,65.211498 h -189.177144 -3.175 v 168.010482 3.175 H 269.47908 c 1.75895,0 3.175,-1.416 3.175,-3.175 V 65.211498 Z"
       sodipodi:nodetypes="cccccsscc" />
    <path
       inkscape:export-ydpi="90"
       inkscape:export-xdpi="90"
       inkscape:export-filename="/home/aday/Dropbox/Public/settings/sound.png"
       inkscape:connector-curvature="0"
       id="path18968"
       d="m 77.126969,53.043998 v 11.9124"
       style="display:inline;fill:#dddad6;fill-opacity:1;fill-rule:evenodd;stroke:#b7b7b7;stroke-width:0.264583;stroke-linecap:square;stroke-linejoin:miter;stroke-miterlimit:4;stroke-dasharray:none;stroke-opacity:1" />
    <g
       inkscape:export-ydpi="90"
       inkscape:export-xdpi="90"
       inkscape:export-filename="/home/aday/Dropbox/Public/settings/sound.png"
       style="display:inline"
       transform="matrix(0.26458333,0,0,0.26458333,-1.0583615,-140.75902)"
       id="g18980"
       inkscape:label="go-next">
      <rect
         width="16"
         height="16"
         x="-116.0002"
         y="747"
         id="rect18976"
         style="color:#bebebe;display:inline;overflow:visible;visibility:visible;fill:none;stroke:none;stroke-width:1;marker:none;enable-background:new"
         transform="scale(-1,1)" />
      <path
         sodipodi:nodetypes="ccscsccsscscc"
         inkscape:connector-curvature="0"
         id="path18978"
         d="m 104.5627,755 5.71875,5.71875 C 110.47732,760.91462 110.74458,761 111.0002,761 h 1 v -1 c 0,-0.25562 -0.0854,-0.52288 -0.28125,-0.71875 L 107.4377,755 l 4.28125,-4.28125 c 0.19587,-0.19587 0.28125,-0.46313 0.28125,-0.71875 v -1 h -1 c -0.25562,0 -0.52288,0.0854 -0.71875,0.28125 z"
         style="display:inline;fill:#241f31;fill-opacity:1;stroke:none" />
    </g>
    <g
       inkscape:label="open-menu"
       id="g18996"
       transform="matrix(0.26458333,0,0,0.26458333,63.500029,-16.140301)"
       style="display:inline;enable-background:new">
      <rect
         style="color:#bebebe;display:inline;overflow:visible;visibility:visible;fill:none;stroke:none;stroke-width:1;marker:none"
         id="rect18988"
         width="16"
         height="16"
         x="20"
         y="276" />
      <rect
         style="color:#bebebe;display:inline;overflow:visible;visibility:visible;fill:#2e3436;fill-opacity:1;stroke:none;stroke-width:1;marker:none"
         id="rect18990"
         width="9.9996014"
         height="2.0002136"
         x="23.000198"
         y="278.99979" />
      <rect
         style="color:#bebebe;display:inline;overflow:visible;visibility:visible;fill:#2e3436;fill-opacity:1;stroke:none;stroke-width:1;marker:none"
         id="rect18992"
         width="9.9996014"
         height="2.0002136"
         x="23.000198"
         y="282.99979" />
      <rect
         style="color:#bebebe;display:inline;overflow:visible;visibility:visible;fill:#2e3436;fill-opacity:1;stroke:none;stroke-width:1;marker:none"
         id="rect18994"
         width="9.9996014"
         height="2.0002136"
         x="23.000198"
         y="286.99979" />
    </g>
    <text
       xml:space="preserve"
       style="font-style:normal;font-variant:normal;font-weight:bold;font-stretch:normal;font-size:3.88056px;line-height:0%;font-family:Cantarell;-inkscape-font-specification:'Cantarell Bold';text-align:start;letter-spacing:0px;word-spacing:0px;text-anchor:start;display:inline;fill:#2e3436;fill-opacity:1;stroke:none;stroke-width:0.264583"
       x="32.808361"
       y="115.90999"
       id="text72033"
       inkscape:export-filename="/home/aday/Dropbox/Public/settings/sound.png"
       inkscape:export-xdpi="90"
       inkscape:export-ydpi="90"><tspan
         style="font-style:normal;font-variant:normal;font-weight:normal;font-stretch:normal;font-size:3.88056px;line-height:1.25;font-family:Cantarell;-inkscape-font-specification:Cantarell;fill:#2e3436;fill-opacity:1;stroke-width:0.264583"
         sodipodi:role="line"
         id="tspan72031"
         x="32.808361"
         y="115.90999">Background</tspan></text>
    <g
       style="display:inline;enable-background:new"
       id="g4346"
       inkscape:label="preferences-desktop-wallpaper"
       transform="matrix(0.26458333,0,0,0.26458333,13.758333,6.8791663)">
      <rect
         y="398"
         x="48"
         height="16"
         width="16"
         id="rect4338"
         style="color:#bebebe;display:inline;overflow:visible;visibility:visible;opacity:0.514644;fill:none;stroke:none;stroke-width:3;marker:none;enable-background:accumulate" />
      <path
         style="color:#000000;display:inline;overflow:visible;visibility:visible;fill:none;stroke:#2e3436;stroke-width:2;stroke-linejoin:round;stroke-miterlimit:4;stroke-dasharray:none;stroke-opacity:1;marker:none;enable-background:new"
         d="m 49.0625,400.03125 h 13.96875 v 12 H 49.0625 Z"
         id="rect4340"
         inkscape:connector-curvature="0"
         sodipodi:nodetypes="ccccc" />
      <path
         style="color:#000000;font-style:normal;font-variant:normal;font-weight:normal;font-stretch:normal;font-size:medium;line-height:normal;font-family:sans-serif;font-variant-ligatures:normal;font-variant-position:normal;font-variant-caps:normal;font-variant-numeric:normal;font-variant-alternates:normal;font-feature-settings:normal;text-indent:0;text-align:start;text-decoration:none;text-decoration-line:none;text-decoration-style:solid;text-decoration-color:#000000;letter-spacing:normal;word-spacing:normal;text-transform:none;writing-mode:lr-tb;direction:ltr;text-orientation:mixed;dominant-baseline:auto;baseline-shift:baseline;text-anchor:start;white-space:normal;shape-padding:0;clip-rule:nonzero;display:inline;overflow:visible;visibility:visible;opacity:1;isolation:auto;mix-blend-mode:normal;color-interpolation:sRGB;color-interpolation-filters:linearRGB;solid-color:#000000;solid-opacity:1;vector-effect:none;fill:#2e3436;fill-opacity:1;fill-rule:nonzero;stroke:none;stroke-width:1;stroke-linecap:butt;stroke-linejoin:miter;stroke-miterlimit:4;stroke-dasharray:none;stroke-dashoffset:0;stroke-opacity:1;marker:none;color-rendering:auto;image-rendering:auto;shape-rendering:auto;text-rendering:auto;enable-background:accumulate"
         d="m 57.40625,405.96875 c -0.5648,-0.003 -1.10627,0.24128 -1.474609,0.67578 -0.199163,0.23494 -0.314912,0.47469 -0.417969,0.66406 -0.101727,0.18692 -0.199977,0.34268 -0.304688,0.44922 -0.102026,0.10381 -0.229896,0.18253 -0.363281,0.22266 h -0.002 c -0.132401,0.0401 -0.312354,0.0508 -0.53125,0.0508 l -5.281203,-2e-5 v 1 l 5.281203,2e-5 c 0.23591,0 0.51749,-0.002 0.820312,-0.0937 0.302675,-0.0911 0.573842,-0.25755 0.791016,-0.47852 0.214469,-0.21821 0.352797,-0.45881 0.46875,-0.67187 0.114603,-0.21059 0.205484,-0.38172 0.300781,-0.49414 0.166121,-0.19596 0.447264,-0.32549 0.708985,-0.32422 0.263163,0.001 0.546658,0.13158 0.724609,0.33203 0.10513,0.11843 0.204661,0.29648 0.330078,0.50977 0.12676,0.21558 0.278172,0.45563 0.501953,0.67187 0.226359,0.21875 0.502604,0.38324 0.810547,0.47266 0.307991,0.0894 0.595487,0.0918 0.839844,0.0918 l 2.421922,-0.0157 v -1 l -2.421922,0.0157 c -0.226218,0.001 -0.416637,-0.011 -0.560547,-0.0527 -0.143976,-0.0418 -0.28251,-0.12221 -0.394531,-0.23047 -0.114619,-0.11076 -0.222224,-0.27086 -0.333985,-0.46094 -0.113102,-0.19234 -0.239995,-0.43252 -0.447265,-0.66601 -0.370769,-0.41765 -0.90346,-0.66524 -1.466797,-0.66797 z"
         id="path4342"
         inkscape:connector-curvature="0"
         sodipodi:nodetypes="ccccccsccscccccccccsccscccccc" />
      <circle
         r="1"
         cy="404.53125"
         cx="53.53125"
         id="circle4344"
         style="color:#000000;display:inline;overflow:visible;visibility:visible;fill:none;stroke:#2e3436;stroke-width:1;stroke-linecap:round;stroke-linejoin:miter;stroke-miterlimit:4;stroke-dasharray:none;stroke-dashoffset:0;stroke-opacity:1;marker:none;enable-background:accumulate" />
    </g>
    <text
       xml:space="preserve"
       style="font-style:normal;font-variant:normal;font-weight:bold;font-stretch:normal;font-size:3.88056px;line-height:0%;font-family:Cantarell;-inkscape-font-specification:'Cantarell Bold';text-align:start;letter-spacing:0px;word-spacing:0px;text-anchor:start;display:inline;fill:#2e3436;fill-opacity:1;stroke:none;stroke-width:0.264583"
       x="32.808361"
       y="137.07666"
       id="text73105"
       inkscape:export-filename="/home/aday/Dropbox/Public/settings/sound.png"
       inkscape:export-xdpi="90"
       inkscape:export-ydpi="90"><tspan
         style="font-style:normal;font-variant:normal;font-weight:normal;font-stretch:normal;font-size:3.88056px;line-height:1.25;font-family:Cantarell;-inkscape-font-specification:Cantarell;fill:#2e3436;fill-opacity:1;stroke-width:0.264583"
         sodipodi:role="line"
         id="tspan73103"
         x="32.808361"
         y="137.07666">Notifications</tspan></text>
    <g
       inkscape:label="preferences system notifications bell notification ring alarm feedback control"
       id="g2982"
       style="display:inline;enable-background:new"
       transform="matrix(0.26458333,0,0,0.26458333,23.28795,-43.128294)">
      <title
         id="title2975">preferences-system-notifications</title>
      <rect
         style="color:#bebebe;display:inline;overflow:visible;visibility:visible;opacity:0.514644;fill:none;stroke:none;stroke-width:3;marker:none;enable-background:accumulate"
         id="rect2977"
         width="16"
         height="16"
         x="11.982551"
         y="668.00458" />
      <g
         id="g3014"
         transform="translate(0.28081117,-5.4690528)">
        <circle
           style="display:inline;fill:#2e3436;stroke-width:2;stroke-linecap:square;stroke-linejoin:round;stroke-dasharray:8, 8"
           id="path2984-3"
           cx="19.701799"
           cy="679.97363"
           r="5" />
        <rect
           style="display:inline;fill:#2e3436;stroke-width:2;stroke-linecap:square;stroke-linejoin:round;stroke-dasharray:8, 8"
           id="rect2986"
           width="9.9998779"
           height="6"
           x="14.7018"
           y="679.97363" />
        <rect
           style="display:inline;fill:#2e3436;stroke-width:1.99999;stroke-linecap:square;stroke-linejoin:round;stroke-dasharray:8.00002, 8.00002"
           id="rect2988"
           width="13"
           height="2"
           x="13.201738"
           y="-686.47363"
           transform="scale(1,-1)"
           rx="1"
           ry="1" />
        <path
           style="display:inline;fill:#2e3436;stroke-width:2;stroke-linecap:square;stroke-linejoin:round;stroke-dasharray:8, 8"
           id="circle3018"
           sodipodi:type="arc"
           sodipodi:cx="19.701799"
           sodipodi:cy="687.47363"
           sodipodi:rx="2"
           sodipodi:ry="2"
           sodipodi:start="0"
           sodipodi:end="3.1415927"
           sodipodi:open="true"
           sodipodi:arc-type="arc"
           d="m 21.701799,687.47363 a 2,2 0 0 1 -1,1.73205 2,2 0 0 1 -2,0 2,2 0 0 1 -1,-1.73205" />
        <circle
           style="display:inline;fill:#2e3436;stroke-width:2;stroke-linecap:square;stroke-linejoin:round;stroke-dasharray:8.00002, 8.00002"
           id="circle3020"
           cx="19.701799"
           cy="674.97363"
           r="1.5" />
      </g>
    </g>
    <g
       id="g5375"
       inkscape:label="preferences-desktop-remote-desktop"
       transform="matrix(0.26458333,0,0,0.26458333,4.4978645,-53.710416)"
       style="enable-background:new">
      <rect
         transform="scale(-1,1)"
         y="667"
         x="-99.000198"
         height="16"
         width="16"
         id="rect5339"
         style="color:#bebebe;display:inline;overflow:visible;visibility:visible;opacity:0.02;fill-opacity:1;fill-rule:nonzero;stroke:none;stroke-width:2;marker:none;enable-background:accumulate" />
      <path
         id="path5341"
         d="m 95.000204,668 c 1.662,0 3,1.338 3,3 v 6 c 0,1.662 -1.338,3 -3,3 h -8 c -1.662,0 -3,-1.338 -3,-3 v -6 c 0,-1.662 1.338,-3 3,-3 z m 0,2 h -8 c -0.554,0 -1,0.446 -1,1 v 6 c 0,0.554 0.446,1 1,1 h 8 c 0.554,0 1,-0.446 1,-1 v -6 c 0,-0.554 -0.446,-1 -1,-1 z"
         style="color:#bebebe;display:inline;overflow:visible;visibility:visible;fill:#2e3436;fill-opacity:1;fill-rule:nonzero;stroke:none;stroke-width:2;marker:none;enable-background:accumulate"
         inkscape:connector-curvature="0" />
      <path
         sodipodi:nodetypes="sscccs"
         inkscape:connector-curvature="0"
         id="path5343"
         d="m 91.000204,681 c -5,0 -5,1 -5,1 0,1 1,1 1,1 h 8 c 1,0 1,-1 1,-1 0,0 0,-1 -5,-1 z"
         style="color:#bebebe;display:inline;overflow:visible;visibility:visible;fill:#2e3436;fill-opacity:1;fill-rule:nonzero;stroke:none;stroke-width:2;marker:none;enable-background:accumulate" />
    </g>
    <circle
       style="opacity:1;fill:#2e3436;fill-opacity:1;stroke:none;stroke-width:2.11667;stroke-linecap:round;stroke-linejoin:round;stroke-opacity:1"
       id="path76050"
       cx="28.310413"
       cy="124.88331"
       r="0.5291667" />
    <rect
       style="opacity:1;fill:#2e3436;fill-opacity:1;stroke:none;stroke-width:2.11667;stroke-linecap:round;stroke-linejoin:round;stroke-opacity:1"
       id="rect76202"
       width="0.5291667"
       height="0.52916801"
       x="27.78125"
       y="124.88331" />
    <path
       style="fill:#e6e4e1;fill-opacity:1;stroke:#e6e4e1;stroke-width:1.05833;stroke-linecap:round;stroke-linejoin:miter;stroke-miterlimit:4;stroke-dasharray:none;stroke-opacity:1"
       d="m 29.36875,123.82498 0.79375,-0.79375"
       id="path77160"
       sodipodi:nodetypes="cc" />
    <path
       style="fill:none;stroke:#2e3436;stroke-width:0.529167;stroke-linecap:round;stroke-linejoin:miter;stroke-miterlimit:4;stroke-dasharray:none;stroke-opacity:1"
       d="M 29.104167,124.08956 30.1625,123.03123"
       id="path76600"
       sodipodi:nodetypes="cc" />
  </g>
  <g
     inkscape:label="panel"
     inkscape:groupmode="layer"
     id="layer1"
     transform="translate(0,1306.3751)">
    <rect
       ry="2.3812501"
       rx="2.3812501"
       y="-1077.9161"
       x="114.16862"
       height="63.235416"
       width="121.44375"
       id="rect43163"
       style="display:inline;fill:#ffffff;fill-opacity:1;stroke:#d0d0d0;stroke-width:0.264583;stroke-linecap:square;stroke-miterlimit:4;stroke-dasharray:none;stroke-dashoffset:0;stroke-opacity:1" />
    <text
       inkscape:export-ydpi="90"
       inkscape:export-xdpi="90"
       inkscape:export-filename="/home/aday/Dropbox/Public/settings/sound.png"
       id="text48284"
       y="-1278.2797"
       x="21.148022"
       style="font-style:normal;font-variant:normal;font-weight:normal;font-stretch:normal;font-size:9.87778px;line-height:0%;font-family:Cantarell;-inkscape-font-specification:Cantarell;text-align:start;letter-spacing:0px;word-spacing:0px;text-anchor:start;display:inline;opacity:1;fill:#2e3436;fill-opacity:1;stroke:none;stroke-width:0.264583"
       xml:space="preserve"><tspan
         y="-1278.2797"
         x="21.148022"
         id="tspan48282"
         sodipodi:role="line"
         style="font-style:normal;font-variant:normal;font-weight:800;font-stretch:normal;font-size:9.87778px;line-height:1.25;font-family:Cantarell;-inkscape-font-specification:'Cantarell Ultra-Bold';text-align:start;text-anchor:start;stroke-width:0.264583">Personalization</tspan></text>
    <flowRoot
       transform="matrix(0.26458335,0,0,0.26458335,-11.779684,-1295.8316)"
       style="font-style:normal;font-weight:normal;font-size:40px;line-height:32.5%;font-family:sans-serif;letter-spacing:0px;word-spacing:0px;fill:#2e3436;fill-opacity:1;stroke:none"
       id="flowRoot48292"
       xml:space="preserve"><flowRegion
         style="fill:#2e3436;fill-opacity:1"
         id="flowRegion48288"><rect
           style="fill:#2e3436;fill-opacity:1;stroke-width:1"
           y="91.473892"
           x="124.45079"
           height="101.80598"
           width="776.81604"
           id="rect48286" /></flowRegion><flowPara
         style="font-style:normal;font-variant:normal;font-weight:normal;font-stretch:normal;font-size:14.6667px;font-family:Cantarell;-inkscape-font-specification:Cantarell;fill:#2e3436;fill-opacity:1"
         id="flowPara97325">Options to change and adjust aspects of the desktop to accommodate a user's personal preferences or needs.</flowPara></flowRoot>
    <filter
       id="a"
       height="1"
       width="1"
       x="0"
       y="0">
      <feColorMatrix
         in="SourceGraphic"
         type="matrix"
         values="0 0 0 0 1 0 0 0 0 1 0 0 0 0 1 0 0 0 1 0"
         id="feColorMatrix76781" />
    </filter>
    <mask
       id="b">
      <g
         filter="url(#a)"
         id="g76786">
        <path
           d="M 0,0 H 16 V 16 H 0 Z"
           fill-opacity="0.3"
           id="path76784" />
      </g>
    </mask>
    <clipPath
       id="c">
      <path
         d="M 0,0 H 1024 V 800 H 0 Z"
         id="path76789" />
    </clipPath>
    <mask
       id="d">
      <g
         filter="url(#a)"
         id="g76794">
        <path
           d="M 0,0 H 16 V 16 H 0 Z"
           fill-opacity="0.05"
           id="path76792" />
      </g>
    </mask>
    <clipPath
       id="e">
      <path
         d="M 0,0 H 1024 V 800 H 0 Z"
         id="path76797" />
    </clipPath>
    <mask
       id="f">
      <g
         filter="url(#a)"
         id="g76802">
        <path
           d="M 0,0 H 16 V 16 H 0 Z"
           fill-opacity="0.05"
           id="path76800" />
      </g>
    </mask>
    <clipPath
       id="g">
      <path
         d="M 0,0 H 1024 V 800 H 0 Z"
         id="path76805" />
    </clipPath>
    <mask
       id="h">
      <g
         filter="url(#a)"
         id="g76810">
        <path
           d="M 0,0 H 16 V 16 H 0 Z"
           fill-opacity="0.05"
           id="path76808" />
      </g>
    </mask>
    <clipPath
       id="i">
      <path
         d="M 0,0 H 1024 V 800 H 0 Z"
         id="path76813" />
    </clipPath>
    <mask
       id="j">
      <g
         filter="url(#a)"
         id="g76818">
        <path
           d="M 0,0 H 16 V 16 H 0 Z"
           fill-opacity="0.05"
           id="path76816" />
      </g>
    </mask>
    <clipPath
       id="k">
      <path
         d="M 0,0 H 1024 V 800 H 0 Z"
         id="path76821" />
    </clipPath>
    <mask
       id="l">
      <g
         filter="url(#a)"
         id="g76826">
        <path
           d="M 0,0 H 16 V 16 H 0 Z"
           fill-opacity="0.05"
           id="path76824" />
      </g>
    </mask>
    <clipPath
       id="m">
      <path
         d="M 0,0 H 1024 V 800 H 0 Z"
         id="path76829" />
    </clipPath>
    <mask
       id="n">
      <g
         filter="url(#a)"
         id="g76834">
        <path
           d="M 0,0 H 16 V 16 H 0 Z"
           fill-opacity="0.05"
           id="path76832" />
      </g>
    </mask>
    <clipPath
       id="o">
      <path
         d="M 0,0 H 1024 V 800 H 0 Z"
         id="path76837" />
    </clipPath>
    <mask
       id="p">
      <g
         filter="url(#a)"
         id="g76842">
        <path
           d="M 0,0 H 16 V 16 H 0 Z"
           fill-opacity="0.3"
           id="path76840" />
      </g>
    </mask>
    <clipPath
       id="q">
      <path
         d="M 0,0 H 1024 V 800 H 0 Z"
         id="path76845" />
    </clipPath>
    <mask
       id="r">
      <g
         filter="url(#a)"
         id="g76850">
        <path
           d="M 0,0 H 16 V 16 H 0 Z"
           fill-opacity="0.5"
           id="path76848" />
      </g>
    </mask>
    <clipPath
       id="s">
      <path
         d="M 0,0 H 1024 V 800 H 0 Z"
         id="path76853" />
    </clipPath>
    <mask
       id="t">
      <g
         filter="url(#a)"
         id="g76858">
        <path
           d="M 0,0 H 16 V 16 H 0 Z"
           fill-opacity="0.4"
           id="path76856" />
      </g>
    </mask>
    <clipPath
       id="u">
      <path
         d="M 0,0 H 1024 V 800 H 0 Z"
         id="path76861" />
    </clipPath>
    <mask
       id="v">
      <g
         filter="url(#a)"
         id="g76866">
        <path
           d="M 0,0 H 16 V 16 H 0 Z"
           fill-opacity="0.4"
           id="path76864" />
      </g>
    </mask>
    <clipPath
       id="w">
      <path
         d="M 0,0 H 1024 V 800 H 0 Z"
         id="path76869" />
    </clipPath>
    <mask
       id="x">
      <g
         filter="url(#a)"
         id="g76874">
        <path
           d="M 0,0 H 16 V 16 H 0 Z"
           fill-opacity="0.5"
           id="path76872" />
      </g>
    </mask>
    <clipPath
       id="y">
      <path
         d="M 0,0 H 1024 V 800 H 0 Z"
         id="path76877" />
    </clipPath>
    <mask
       id="z">
      <g
         filter="url(#a)"
         id="g76882">
        <path
           d="M 0,0 H 16 V 16 H 0 Z"
           fill-opacity="0.5"
           id="path76880" />
      </g>
    </mask>
    <clipPath
       id="A">
      <path
         d="M 0,0 H 1024 V 800 H 0 Z"
         id="path76885" />
    </clipPath>
    <g
       clip-path="url(#c)"
       mask="url(#b)"
       transform="matrix(0.26458334,0,0,0.26458334,114.30724,-0.25631973)"
       id="g76894">
      <path
         d="m 562.46094,212.05859 h 10.44922 c -1.1836,0.49219 -1.29688,2.46094 0,3 h -10.44922 z m 0,0"
         fill="#2e3436"
         id="path76892" />
    </g>
    <g
       clip-path="url(#e)"
       mask="url(#d)"
       transform="matrix(0.26458334,0,0,0.26458334,114.30724,-0.25631973)"
       id="g76898">
      <path
         d="m 16,632 h 1 v 1 h -1 z m 0,0"
         fill="#2e3436"
         fill-rule="evenodd"
         id="path76896" />
    </g>
    <g
       clip-path="url(#g)"
       mask="url(#f)"
       transform="matrix(0.26458334,0,0,0.26458334,114.30724,-0.25631973)"
       id="g76902">
      <path
         d="m 17,631 h 1 v 1 h -1 z m 0,0"
         fill="#2e3436"
         fill-rule="evenodd"
         id="path76900" />
    </g>
    <g
       clip-path="url(#i)"
       mask="url(#h)"
       transform="matrix(0.26458334,0,0,0.26458334,114.30724,-0.25631973)"
       id="g76906">
      <path
         d="m 18,634 h 1 v 1 h -1 z m 0,0"
         fill="#2e3436"
         fill-rule="evenodd"
         id="path76904" />
    </g>
    <g
       clip-path="url(#k)"
       mask="url(#j)"
       transform="matrix(0.26458334,0,0,0.26458334,114.30724,-0.25631973)"
       id="g76910">
      <path
         d="m 16,634 h 1 v 1 h -1 z m 0,0"
         fill="#2e3436"
         fill-rule="evenodd"
         id="path76908" />
    </g>
    <g
       clip-path="url(#m)"
       mask="url(#l)"
       transform="matrix(0.26458334,0,0,0.26458334,114.30724,-0.25631973)"
       id="g76914">
      <path
         d="m 17,635 h 1 v 1 h -1 z m 0,0"
         fill="#2e3436"
         fill-rule="evenodd"
         id="path76912" />
    </g>
    <g
       clip-path="url(#o)"
       mask="url(#n)"
       transform="matrix(0.26458334,0,0,0.26458334,114.30724,-0.25631973)"
       id="g76918">
      <path
         d="m 19,635 h 1 v 1 h -1 z m 0,0"
         fill="#2e3436"
         fill-rule="evenodd"
         id="path76916" />
    </g>
    <g
       clip-path="url(#q)"
       mask="url(#p)"
       transform="matrix(0.26458334,0,0,0.26458334,114.30724,-0.25631973)"
       id="g76922">
      <path
         d="m 136,660 v 7 h 7 v -7 z m 0,0"
         fill="#2e3436"
         id="path76920" />
    </g>
    <g
       clip-path="url(#s)"
       mask="url(#r)"
       transform="matrix(0.26458334,0,0,0.26458334,114.30724,-0.25631973)"
       id="g76926">
      <path
         d="m 199,642 h 3 v 12 h -3 z m 0,0"
         fill="#2e3436"
         id="path76924" />
    </g>
    <g
       clip-path="url(#u)"
       mask="url(#t)"
       transform="matrix(0.26458334,0,0,0.26458334,114.30724,-0.25631973)"
       id="g76930">
      <path
         d="m 209.5,144.16016 c 0.27734,0 0.5,0.22265 0.5,0.5 v 1 c 0,0.27734 -0.22266,0.5 -0.5,0.5 -0.27734,0 -0.5,-0.22266 -0.5,-0.5 v -1 c 0,-0.27735 0.22266,-0.5 0.5,-0.5 z m 0,0"
         fill="#2e3436"
         id="path76928" />
    </g>
    <g
       clip-path="url(#w)"
       mask="url(#v)"
       transform="matrix(0.26458334,0,0,0.26458334,114.30724,-0.25631973)"
       id="g76934">
      <path
         d="m 206.5,144.16016 c 0.27734,0 0.5,0.22265 0.5,0.5 v 1 c 0,0.27734 -0.22266,0.5 -0.5,0.5 -0.27734,0 -0.5,-0.22266 -0.5,-0.5 v -1 c 0,-0.27735 0.22266,-0.5 0.5,-0.5 z m 0,0"
         fill="#2e3436"
         id="path76932" />
    </g>
    <g
       clip-path="url(#y)"
       mask="url(#x)"
       transform="matrix(0.26458334,0,0,0.26458334,114.30724,-0.25631973)"
       id="g76938">
      <path
         d="m 229.5,143.16016 c -0.54688,0 -1,0.45703 -1,1 0,0.54687 0.45312,1 1,1 0.54687,0 1,-0.45313 1,-1 0,-0.54297 -0.45313,-1 -1,-1 z m 0,0"
         fill="#2e3436"
         id="path76936" />
    </g>
    <g
       clip-path="url(#A)"
       mask="url(#z)"
       transform="matrix(0.26458334,0,0,0.26458334,114.30724,-0.25631973)"
       id="g76942">
      <path
         d="m 226.45312,143.16016 c -0.51953,0 -0.95312,0.43359 -0.95312,0.95312 v 0.0937 c 0,0.51953 0.43359,0.95313 0.95312,0.95313 h 0.0937 c 0.51954,0 0.95313,-0.4336 0.95313,-0.95313 v -0.0937 c 0,-0.51953 -0.43359,-0.95312 -0.95313,-0.95312 z m 0,0"
         fill="#2e3436"
         id="path76940" />
    </g>
    <text
       xml:space="preserve"
       transform="matrix(0.26458333,0,0,0.26458333,0,-1306.3751)"
       id="text24256"
       style="font-style:normal;font-weight:normal;font-size:40px;line-height:1.25;font-family:sans-serif;white-space:pre;shape-inside:url(#rect24258);fill:#000000;fill-opacity:1;stroke:none" />
    <text
       inkscape:export-ydpi="90"
       inkscape:export-xdpi="90"
       inkscape:export-filename="/home/aday/Dropbox/Public/settings/sound.png"
       id="text19000"
       y="-1245.9587"
       x="174.79399"
       style="font-style:normal;font-variant:normal;font-weight:normal;font-stretch:normal;font-size:3.88056px;line-height:0%;font-family:Cantarell;-inkscape-font-specification:Cantarell;text-align:center;letter-spacing:0px;word-spacing:0px;text-anchor:middle;display:inline;opacity:1;fill:#2e3436;fill-opacity:1;stroke:none;stroke-width:0.264583"
       xml:space="preserve"><tspan
         y="-1245.9587"
         x="174.79399"
         id="tspan18998"
         sodipodi:role="line"
         style="font-weight:bold;font-size:3.88056px;line-height:1.25;text-align:center;text-anchor:middle;stroke-width:0.264583">Personalization</tspan></text>
    <text
       inkscape:export-ydpi="90"
       inkscape:export-xdpi="90"
       inkscape:export-filename="/home/aday/Dropbox/Public/settings/sound.png"
       id="text19346"
       y="-1097.7982"
       x="114.3"
       style="font-style:normal;font-variant:normal;font-weight:bold;font-stretch:normal;font-size:3.88056px;line-height:0%;font-family:Cantarell;-inkscape-font-specification:'Cantarell Bold';text-align:start;letter-spacing:0px;word-spacing:0px;text-anchor:start;display:inline;opacity:1;fill:#2e3436;fill-opacity:1;stroke:none;stroke-width:0.264583"
       xml:space="preserve"><tspan
         y="-1097.7982"
         x="114.3"
         sodipodi:role="line"
         style="font-style:normal;font-variant:normal;font-weight:bold;font-stretch:normal;font-size:3.88056px;line-height:1.25;font-family:Cantarell;-inkscape-font-specification:Cantarell;fill:#2e3436;fill-opacity:1;stroke-width:0.264583"
         id="tspan31676">Night Light</tspan></text>
    <text
       inkscape:export-ydpi="90"
       inkscape:export-xdpi="90"
       inkscape:export-filename="/home/aday/Dropbox/Public/settings/sound.png"
       id="text24874"
       y="-1228.5013"
       x="114.3"
       style="font-style:normal;font-variant:normal;font-weight:bold;font-stretch:normal;font-size:3.88056px;line-height:0%;font-family:Cantarell;-inkscape-font-specification:'Cantarell Bold';text-align:start;letter-spacing:0px;word-spacing:0px;text-anchor:start;display:inline;opacity:1;fill:#2e3436;fill-opacity:1;stroke:none;stroke-width:0.264583"
       xml:space="preserve"><tspan
         y="-1228.5013"
         x="114.3"
         sodipodi:role="line"
         style="font-style:normal;font-variant:normal;font-weight:bold;font-stretch:normal;font-size:3.88056px;line-height:1.25;font-family:Cantarell;-inkscape-font-specification:Cantarell;fill:#2e3436;fill-opacity:1;stroke-width:0.264583"
         id="tspan24872">Appearance</tspan></text>
    <rect
       ry="2.3812501"
       rx="2.3812501"
       y="-1223.4358"
       x="114.16862"
       height="93.397919"
       width="121.44375"
       id="rect24980"
       style="display:inline;fill:#ffffff;fill-opacity:1;stroke:#d0d0d0;stroke-width:0.264583;stroke-linecap:square;stroke-miterlimit:4;stroke-dasharray:none;stroke-dashoffset:0;stroke-opacity:1" />
    <text
       id="text25083"
       y="-1180.7401"
       x="145.6956"
       style="font-style:normal;font-variant:normal;font-weight:normal;font-stretch:normal;font-size:3.175px;line-height:0%;font-family:Cantarell;-inkscape-font-specification:Cantarell;text-align:center;letter-spacing:0px;word-spacing:0px;text-anchor:middle;display:inline;fill:#2e3436;fill-opacity:1;stroke:none;stroke-width:0.264583"
       xml:space="preserve"><tspan
         y="-1180.7401"
         x="145.6956"
         id="tspan25081"
         sodipodi:role="line"
         style="font-size:3.70417px;line-height:1.25;text-align:center;text-anchor:middle;fill:#2e3436;fill-opacity:1;stroke-width:0.264583">Light</tspan></text>
    <text
       id="text27155"
       y="-1180.7401"
       x="203.37476"
       style="font-style:normal;font-variant:normal;font-weight:normal;font-stretch:normal;font-size:3.175px;line-height:0%;font-family:Cantarell;-inkscape-font-specification:Cantarell;text-align:center;letter-spacing:0px;word-spacing:0px;text-anchor:middle;display:inline;fill:#2e3436;fill-opacity:1;stroke:none;stroke-width:0.264583"
       xml:space="preserve"><tspan
         y="-1180.7401"
         x="203.37476"
         id="tspan27153"
         sodipodi:role="line"
         style="font-size:3.70417px;line-height:1.25;text-align:center;text-anchor:middle;fill:#2e3436;fill-opacity:1;stroke-width:0.264583">Dark</tspan></text>
    <path
       inkscape:connector-curvature="0"
       id="path27261"
       d="M 235.4801,-1175.2774 H 114.30095"
       style="display:inline;fill:none;stroke:#dfdfdf;stroke-width:0.264583px;stroke-linecap:butt;stroke-linejoin:miter;stroke-opacity:1" />
    <g
       style="display:inline"
       transform="translate(-177.53383,-1005.1515)"
       id="g27271">
      <g
         id="g27269"
         transform="translate(-57.679384,85.200487)">
        <g
           transform="translate(31.220471,24.605574)"
           id="g27267">
          <rect
             style="fill:#3584e4;fill-opacity:1;stroke:#144581;stroke-width:0.264583;stroke-linecap:round;stroke-miterlimit:4;stroke-dasharray:none;stroke-opacity:1"
             id="rect27263"
             width="11.377569"
             height="6.614583"
             x="422.93643"
             y="-275.69528"
             rx="3.3822691"
             ry="3.3072915" />
          <rect
             style="display:inline;fill:#fafaf9;fill-opacity:1;stroke:#215d9c;stroke-width:0.264583;stroke-linecap:round;stroke-miterlimit:4;stroke-dasharray:none;stroke-opacity:1"
             id="rect27265"
             width="6.6145835"
             height="6.614583"
             x="427.69943"
             y="-275.69528"
             rx="5.953125"
             ry="3.3072915" />
        </g>
      </g>
    </g>
    <text
       inkscape:export-ydpi="90"
       inkscape:export-xdpi="90"
       inkscape:export-filename="/home/aday/Dropbox/Public/settings/sound.png"
       id="text27277"
       y="-1166.0602"
       x="119.59167"
       style="font-style:normal;font-variant:normal;font-weight:bold;font-stretch:normal;font-size:3.88056px;line-height:0%;font-family:Cantarell;-inkscape-font-specification:'Cantarell Bold';text-align:start;letter-spacing:0px;word-spacing:0px;text-anchor:start;display:inline;opacity:1;fill:#2e3436;fill-opacity:1;stroke:none;stroke-width:0.264583"
       xml:space="preserve"><tspan
         y="-1166.0602"
         x="119.59167"
         sodipodi:role="line"
         style="font-style:normal;font-variant:normal;font-weight:normal;font-stretch:normal;font-size:3.88056px;line-height:1.25;font-family:Cantarell;-inkscape-font-specification:Cantarell;fill:#2e3436;fill-opacity:1;stroke-width:0.264583"
         id="tspan27275">Automatically Switch to Dark mode</tspan></text>
    <g
       id="g28930"
       transform="matrix(0.1336785,0,0,0.13334244,127.46159,-1051.7743)"
       style="stroke-width:7.49006">
      <rect
         style="display:inline;fill:#e6e4e1;fill-opacity:1;stroke:#c1bab5;stroke-width:1.98131;stroke-linecap:round;stroke-miterlimit:4;stroke-dasharray:none;stroke-opacity:1;enable-background:new"
         id="rect28918"
         width="251.35501"
         height="42.068806"
         x="21.288754"
         y="-1221.8398"
         rx="3.9585025"
         ry="3.9684789" />
      <path
         id="path28920"
         style="display:inline;fill:#ffffff;stroke:#c1bab5;stroke-width:1.98131;stroke-linecap:round;enable-background:new"
         d="m 24.473948,-1209.9332 h 49.477141 3.175 v 167.3901 3.175 H 24.473948 c -1.75895,0 -3.175,-1.416 -3.175,-3.175 v -167.3901 z"
         sodipodi:nodetypes="cccccsscc" />
      <path
         id="path28922"
         style="display:inline;fill:#fafafa;fill-opacity:1;stroke:#c1bab5;stroke-width:1.98131;stroke-linecap:round;enable-background:new"
         d="m 269.06016,-1209.9332 h -189.177161 -3.175 v 167.3901 3.175 H 269.06016 c 1.75895,0 3.175,-1.416 3.175,-3.175 v -167.3901 z"
         sodipodi:nodetypes="cccccsscc" />
      <path
         inkscape:export-ydpi="90"
         inkscape:export-xdpi="90"
         inkscape:export-filename="/home/aday/Dropbox/Public/settings/sound.png"
         inkscape:connector-curvature="0"
         id="path28924"
         d="m 76.708032,-1221.5811 v 11.9124"
         style="display:inline;fill:#dddad6;fill-opacity:1;fill-rule:evenodd;stroke:#b7b7b7;stroke-width:1.98174;stroke-linecap:square;stroke-linejoin:miter;stroke-miterlimit:4;stroke-dasharray:none;stroke-opacity:1" />
    </g>
    <g
       id="g29704"
       transform="matrix(0.1336785,0,0,0.13334244,183.55328,-1051.7743)"
       style="stroke-width:7.49006">
      <rect
         style="display:inline;fill:#282828;fill-opacity:1;stroke:#0b0b0b;stroke-width:1.98131;stroke-linecap:round;stroke-miterlimit:4;stroke-dasharray:none;stroke-opacity:1;enable-background:new"
         id="rect29696"
         width="251.35501"
         height="42.068806"
         x="21.288754"
         y="-1221.8398"
         rx="3.9585025"
         ry="3.9684789" />
      <path
         id="path29698"
         style="display:inline;fill:#353535;fill-opacity:1;stroke:#0b0b0b;stroke-width:1.98131;stroke-linecap:round;stroke-opacity:1;enable-background:new"
         d="m 24.473948,-1209.9332 h 49.477141 3.175 v 167.3901 3.175 H 24.473948 c -1.75895,0 -3.175,-1.416 -3.175,-3.175 v -167.3901 z"
         sodipodi:nodetypes="cccccsscc" />
      <path
         id="path29700"
         style="display:inline;fill:#292929;fill-opacity:1;stroke:#0b0b0b;stroke-width:1.98131;stroke-linecap:round;stroke-opacity:1;enable-background:new"
         d="m 269.06016,-1209.9332 h -189.177161 -3.175 v 167.3901 3.175 H 269.06016 c 1.75895,0 3.175,-1.416 3.175,-3.175 v -167.3901 z"
         sodipodi:nodetypes="cccccsscc" />
      <path
         inkscape:export-ydpi="90"
         inkscape:export-xdpi="90"
         inkscape:export-filename="/home/aday/Dropbox/Public/settings/sound.png"
         inkscape:connector-curvature="0"
         id="path29702"
         d="m 76.708032,-1221.5811 v 11.9124"
         style="display:inline;fill:#dddad6;fill-opacity:1;fill-rule:evenodd;stroke:#0b0b0b;stroke-width:1.98174;stroke-linecap:square;stroke-linejoin:miter;stroke-miterlimit:4;stroke-dasharray:none;stroke-opacity:1" />
    </g>
    <path
       inkscape:connector-curvature="0"
       id="path42662"
       d="M 235.4801,-1159.4023 H 114.30095"
       style="display:inline;fill:none;stroke:#dfdfdf;stroke-width:0.264583px;stroke-linecap:butt;stroke-linejoin:miter;stroke-opacity:1" />
    <text
       inkscape:export-ydpi="90"
       inkscape:export-xdpi="90"
       inkscape:export-filename="/home/aday/Dropbox/Public/settings/sound.png"
       id="text42808"
       y="-1150.1853"
       x="119.59167"
       style="font-style:normal;font-variant:normal;font-weight:bold;font-stretch:normal;font-size:3.88056px;line-height:0%;font-family:Cantarell;-inkscape-font-specification:'Cantarell Bold';text-align:start;letter-spacing:0px;word-spacing:0px;text-anchor:start;display:inline;opacity:1;fill:#2e3436;fill-opacity:1;stroke:none;stroke-width:0.264583"
       xml:space="preserve"><tspan
         y="-1150.1853"
         x="119.59167"
         sodipodi:role="line"
         style="font-style:normal;font-variant:normal;font-weight:normal;font-stretch:normal;font-size:3.88056px;line-height:1.25;font-family:Cantarell;-inkscape-font-specification:Cantarell;fill:#2e3436;fill-opacity:1;stroke-width:0.264583"
         id="tspan42806">Schedule</tspan></text>
    <text
       inkscape:export-ydpi="90"
       inkscape:export-xdpi="90"
       inkscape:export-filename="/home/allan/Documents/GnomeDesign/projects/contacts/png/big-landscape.png"
       id="text8266"
       y="-1068.4882"
       x="118.60964"
       style="font-style:normal;font-variant:normal;font-weight:bold;font-stretch:normal;font-size:3.88056px;line-height:9.35026px;font-family:Cantarell;-inkscape-font-specification:'Cantarell Bold';text-align:start;writing-mode:lr-tb;text-anchor:start;display:inline;fill:#2e3436;fill-opacity:1;stroke:none;stroke-width:0.264583"
       xml:space="preserve"><tspan
         y="-1068.4882"
         x="118.60964"
         id="tspan8264"
         sodipodi:role="line"
         style="font-weight:normal;line-height:9.35026px;stroke-width:0.264583">Night Light</tspan></text>
    <g
       transform="translate(-540.80785,-900.37808)"
       id="g8272">
      <rect
         ry="3.3072917"
         rx="3.3072917"
         y="-172.76788"
         x="758.69159"
         height="6.614583"
         width="12.964583"
         id="rect8268"
         style="display:inline;fill:#3584e4;fill-opacity:1;stroke:#1d62b5;stroke-width:0.264583;stroke-linecap:round;stroke-miterlimit:4;stroke-dasharray:none;stroke-opacity:1" />
      <rect
         ry="3.2910602"
         rx="3.2910638"
         y="-172.75168"
         x="765.0578"
         height="6.5821204"
         width="6.5821276"
         id="rect8270"
         style="display:inline;fill:#fefdfd;fill-opacity:1;stroke:#1d62b5;stroke-width:0.297039;stroke-linecap:round;stroke-miterlimit:4;stroke-dasharray:none;stroke-opacity:1" />
    </g>
    <text
       xml:space="preserve"
       style="font-style:normal;font-variant:normal;font-weight:bold;font-stretch:normal;font-size:3.88056px;line-height:9.35026px;font-family:Cantarell;-inkscape-font-specification:'Cantarell Bold';text-align:start;writing-mode:lr-tb;text-anchor:start;display:inline;fill:#2e3436;fill-opacity:1;stroke:none;stroke-width:0.264583"
       x="118.60964"
       y="-1053.936"
       id="text8278"
       inkscape:export-filename="/home/allan/Documents/GnomeDesign/projects/contacts/png/big-landscape.png"
       inkscape:export-xdpi="90"
       inkscape:export-ydpi="90"><tspan
         style="font-weight:normal;line-height:9.35026px;stroke-width:0.264583"
         sodipodi:role="line"
         id="tspan8276"
         x="118.60964"
         y="-1053.936">Schedule Type</tspan></text>
    <path
       style="fill:none;stroke:#dbdbdb;stroke-width:0.264583px;stroke-linecap:butt;stroke-linejoin:miter;stroke-opacity:1"
       d="M 114.30061,-1062.5619 H 235.47979"
       id="path8280"
       inkscape:connector-curvature="0"
       sodipodi:nodetypes="cc" />
    <text
       inkscape:export-ydpi="90"
       inkscape:export-xdpi="90"
       inkscape:export-filename="/home/allan/Documents/GnomeDesign/projects/contacts/png/big-landscape.png"
       id="text8298"
       y="-1039.38"
       x="118.60964"
       style="font-style:normal;font-variant:normal;font-weight:bold;font-stretch:normal;font-size:3.88056px;line-height:9.35026px;font-family:Cantarell;-inkscape-font-specification:'Cantarell Bold';text-align:start;writing-mode:lr-tb;text-anchor:start;display:inline;fill:#2e3436;fill-opacity:1;stroke:none;stroke-width:0.264583"
       xml:space="preserve"><tspan
         y="-1039.38"
         x="118.60964"
         id="tspan8296"
         sodipodi:role="line"
         style="font-weight:normal;line-height:9.35026px;stroke-width:0.264583">Times</tspan></text>
    <g
       id="g8304"
       transform="matrix(0.2645833,0,0,0.2645833,154.58511,-1178.1893)"
       style="fill:#2e3436;fill-opacity:1">
      <text
         xml:space="preserve"
         style="font-style:normal;font-variant:normal;font-weight:normal;font-stretch:normal;font-size:14px;line-height:26px;font-family:Cantarell;-inkscape-font-specification:Cantarell;text-align:start;writing-mode:lr-tb;text-anchor:start;display:inline;fill:#2e3436;fill-opacity:1;stroke:none;stroke-width:1"
         x="16.81909"
         y="524.43561"
         id="text8302"
         inkscape:export-filename="/home/allan/Documents/GnomeDesign/projects/contacts/png/big-landscape.png"
         inkscape:export-xdpi="90"
         inkscape:export-ydpi="90"><tspan
           style="font-style:normal;font-variant:normal;font-weight:normal;font-stretch:normal;font-size:14px;line-height:26px;font-family:Cantarell;-inkscape-font-specification:Cantarell;text-align:start;text-anchor:start;fill:#2e3436;fill-opacity:1;stroke-width:1"
           sodipodi:role="line"
           id="tspan8300"
           x="16.81909"
           y="524.43561">From 8:11 to 16:04 (Boston, United States)</tspan></text>
    </g>
    <path
       inkscape:connector-curvature="0"
       id="path8306"
       d="M 114.30061,-1048.0117 H 235.47979"
       style="fill:none;stroke:#dbdbdb;stroke-width:0.264583px;stroke-linecap:butt;stroke-linejoin:miter;stroke-opacity:1"
       sodipodi:nodetypes="cc" />
    <path
       style="display:inline;fill:none;stroke:#a7aba7;stroke-width:0.264583px;stroke-linecap:square;stroke-linejoin:miter;stroke-opacity:1"
       d="m 194.60002,-1021.2839 c 0,2.3864 0,2.3864 0,2.3864"
       id="path8310"
       inkscape:connector-curvature="0" />
    <flowRoot
       xml:space="preserve"
       id="flowRoot8318"
       style="font-style:normal;font-weight:normal;font-size:40px;line-height:14px;font-family:sans-serif;text-align:center;letter-spacing:0px;word-spacing:0px;text-anchor:middle;fill:#919191;fill-opacity:1;stroke:none;stroke-width:1px;stroke-linecap:butt;stroke-linejoin:miter;stroke-opacity:1"
       transform="matrix(0.2645833,0,0,0.2645833,-295.68383,-1802.4939)"><flowRegion
         id="flowRegion8314"
         style="line-height:14px;text-align:center;text-anchor:middle;fill:#919191"><rect
           id="rect8312"
           width="448.82043"
           height="244.37964"
           x="1717.5624"
           y="2944.614"
           style="line-height:14px;text-align:center;text-anchor:middle;fill:#919191" /></flowRegion><flowPara
         id="flowPara8316"
         style="font-style:normal;font-variant:normal;font-weight:normal;font-stretch:normal;font-size:12px;line-height:14px;font-family:Cantarell;-inkscape-font-specification:Cantarell;text-align:start;text-anchor:start;fill:#919191">Less Warm</flowPara></flowRoot>
    <flowRoot
       transform="matrix(0.2645833,0,0,0.2645833,-342.54098,-1802.4939)"
       style="font-style:normal;font-weight:normal;font-size:40px;line-height:14px;font-family:sans-serif;text-align:end;letter-spacing:0px;word-spacing:0px;text-anchor:end;fill:#919191;fill-opacity:1;stroke:none;stroke-width:1px;stroke-linecap:butt;stroke-linejoin:miter;stroke-opacity:1"
       id="flowRoot8326"
       xml:space="preserve"><flowRegion
         style="line-height:14px;text-align:end;text-anchor:end;fill:#919191"
         id="flowRegion8322"><rect
           style="line-height:14px;text-align:end;text-anchor:end;fill:#919191"
           y="2944.614"
           x="1717.5624"
           height="244.37964"
           width="448.82043"
           id="rect8320" /></flowRegion><flowPara
         style="font-style:normal;font-variant:normal;font-weight:normal;font-stretch:normal;font-size:12px;line-height:14px;font-family:Cantarell;-inkscape-font-specification:Cantarell;text-align:end;text-anchor:end;fill:#919191"
         id="flowPara8324">More Warm</flowPara></flowRoot>
    <rect
       inkscape:export-ydpi="90"
       inkscape:export-xdpi="90"
       inkscape:export-filename="/home/hbons/layer4.png"
       style="color:#000000;display:inline;overflow:visible;visibility:visible;fill:url(#linearGradient8344);fill-opacity:1;fill-rule:nonzero;stroke:#ffbe6f;stroke-width:0.264583;stroke-linecap:butt;stroke-linejoin:miter;stroke-miterlimit:4;stroke-dasharray:none;stroke-dashoffset:0;stroke-opacity:1;marker:none;enable-background:accumulate"
       id="rect8328"
       width="71.172913"
       height="0.79374921"
       x="159.15714"
       y="1025.2522"
       rx="0.37766328"
       ry="0.43528938"
       transform="scale(1,-1)" />
    <g
       inkscape:label="#g5543-1"
       id="g8334"
       style="display:inline;fill:#f2f2f2;fill-opacity:1;stroke:#bcbcbc;stroke-width:0.999694;stroke-opacity:1"
       transform="matrix(0.26466416,0,0,0.26466416,143.1334,-1072.5946)">
      <path
         style="color:#000000;display:inline;overflow:visible;visibility:visible;fill:#f2f2f2;fill-opacity:1;fill-rule:nonzero;stroke:#bcbcbc;stroke-width:0.999694;stroke-linecap:butt;stroke-linejoin:miter;stroke-miterlimit:4;stroke-dasharray:none;stroke-dashoffset:0;stroke-opacity:1;marker:none;enable-background:accumulate"
         d="m 201.71751,170.6638 c -3.70998,-3.71842 -9.72504,-3.71842 -13.43502,0 -3.70999,3.71841 -3.70999,9.74716 0,13.46558 l 6.71751,6.73279 6.71751,-6.73279 c 3.70999,-3.71842 3.70999,-9.74716 0,-13.46558 z"
         id="path8330"
         inkscape:connector-curvature="0" />
      <g
         style="display:inline;fill:#f2f2f2;fill-opacity:1;stroke:#bcbcbc;stroke-width:0.999694;stroke-opacity:1"
         id="g8332"
         transform="translate(0,180)" />
    </g>
    <text
       inkscape:export-ydpi="90"
       inkscape:export-xdpi="90"
       inkscape:export-filename="/home/allan/Documents/GnomeDesign/projects/contacts/png/big-landscape.png"
       id="text8338"
       y="-1024.335"
       x="118.60967"
       style="font-style:normal;font-variant:normal;font-weight:bold;font-stretch:normal;font-size:3.88056px;line-height:6.87917px;font-family:Cantarell;-inkscape-font-specification:'Cantarell Bold';text-align:end;writing-mode:lr-tb;text-anchor:end;display:inline;fill:#2e3436;fill-opacity:1;stroke:none;stroke-width:0.264583"
       xml:space="preserve"><tspan
         id="tspan8336"
         y="-1024.335"
         x="118.60967"
         sodipodi:role="line"
         style="font-weight:normal;font-size:3.88056px;line-height:6.87917px;text-align:start;text-anchor:start;fill:#2e3436;fill-opacity:1;stroke-width:0.264583">Color Temperature</tspan></text>
    <path
       style="fill:none;stroke:#dbdbdb;stroke-width:0.264583px;stroke-linecap:butt;stroke-linejoin:miter;stroke-opacity:1"
       d="M 114.30061,-1033.4614 H 235.47979"
       id="path8340"
       inkscape:connector-curvature="0"
       sodipodi:nodetypes="cc" />
    <rect
       style="color:#000000;clip-rule:nonzero;display:inline;overflow:visible;visibility:visible;isolation:auto;mix-blend-mode:normal;color-interpolation:sRGB;color-interpolation-filters:linearRGB;solid-color:#000000;solid-opacity:1;fill:none;fill-opacity:1;fill-rule:nonzero;stroke:#e2e2e2;stroke-width:0.264583;stroke-linecap:butt;stroke-linejoin:miter;stroke-miterlimit:4;stroke-dasharray:none;stroke-dashoffset:0;stroke-opacity:1;marker:none;color-rendering:auto;image-rendering:auto;shape-rendering:auto;text-rendering:auto;enable-background:accumulate"
       id="rect7139"
       width="71.17292"
       height="8.7312508"
       x="159.15714"
       y="-1059.6519"
       rx="0.79374999"
       ry="0.79375011"
       inkscape:export-filename="/home/lapo.fedora/SparkleShare/gnome-mockups/content selection/content-selection.png"
       inkscape:export-xdpi="90"
       inkscape:export-ydpi="90" />
    <g
       transform="translate(27.780554,-1231.9002)"
       id="g7145">
      <path
         style="fill:#2e3436;fill-opacity:1;stroke:none;stroke-width:0.264583"
         d="m 199.49583,176.08541 -1.32291,1.32291 -1.32292,-1.32291 z"
         id="path7141"
         inkscape:connector-curvature="0"
         sodipodi:nodetypes="cccc" />
      <rect
         width="4.2333331"
         height="4.2333331"
         x="174.49791"
         y="196.05624"
         id="rect7143"
         style="color:#bebebe;display:inline;overflow:visible;visibility:visible;fill:none;stroke:none;stroke-width:0.264583;marker:none;enable-background:new"
         transform="matrix(0,1,1,0,0,0)" />
    </g>
    <text
       inkscape:export-ydpi="90"
       inkscape:export-xdpi="90"
       inkscape:export-filename="/home/allan/Documents/GnomeDesign/projects/contacts/png/big-landscape.png"
       id="text7149"
       y="-1054.001"
       x="162.30188"
       style="font-style:normal;font-variant:normal;font-weight:normal;font-stretch:normal;font-size:3.70417px;line-height:125%;font-family:Cantarell;-inkscape-font-specification:Cantarell;text-align:start;writing-mode:lr-tb;text-anchor:start;display:inline;fill:#2e3436;fill-opacity:1;stroke:#a7aba7;stroke-width:0;stroke-miterlimit:4;stroke-dasharray:none;stroke-opacity:1"
       xml:space="preserve"><tspan
         y="-1054.001"
         x="162.30188"
         id="tspan7147"
         sodipodi:role="line"
         style="stroke-width:0;stroke-miterlimit:4;stroke-dasharray:none">Sunset to Sunrise</tspan></text>
    <rect
       style="color:#000000;clip-rule:nonzero;display:inline;overflow:visible;visibility:visible;isolation:auto;mix-blend-mode:normal;color-interpolation:sRGB;color-interpolation-filters:linearRGB;solid-color:#000000;solid-opacity:1;fill:none;fill-opacity:1;fill-rule:nonzero;stroke:#e2e2e2;stroke-width:0.264583;stroke-linecap:butt;stroke-linejoin:miter;stroke-miterlimit:4;stroke-dasharray:none;stroke-dashoffset:0;stroke-opacity:1;marker:none;color-rendering:auto;image-rendering:auto;shape-rendering:auto;text-rendering:auto;enable-background:accumulate"
       id="rect43584"
       width="71.17292"
       height="8.7312508"
       x="159.15714"
       y="-1156.4888"
       rx="0.79374999"
       ry="0.79375011"
       inkscape:export-filename="/home/lapo.fedora/SparkleShare/gnome-mockups/content selection/content-selection.png"
       inkscape:export-xdpi="90"
       inkscape:export-ydpi="90" />
    <g
       transform="translate(27.780554,-1328.7384)"
       id="g43590">
      <path
         style="fill:#2e3436;fill-opacity:1;stroke:none;stroke-width:0.264583"
         d="m 199.49583,176.08541 -1.32291,1.32291 -1.32292,-1.32291 z"
         id="path43586"
         inkscape:connector-curvature="0"
         sodipodi:nodetypes="cccc" />
      <rect
         width="4.2333331"
         height="4.2333331"
         x="174.49791"
         y="196.05624"
         id="rect43588"
         style="color:#bebebe;display:inline;overflow:visible;visibility:visible;fill:none;stroke:none;stroke-width:0.264583;marker:none;enable-background:new"
         transform="matrix(0,1,1,0,0,0)" />
    </g>
    <text
       inkscape:export-ydpi="90"
       inkscape:export-xdpi="90"
       inkscape:export-filename="/home/allan/Documents/GnomeDesign/projects/contacts/png/big-landscape.png"
       id="text43594"
       y="-1150.8378"
       x="162.30188"
       style="font-style:normal;font-variant:normal;font-weight:normal;font-stretch:normal;font-size:3.70417px;line-height:125%;font-family:Cantarell;-inkscape-font-specification:Cantarell;text-align:start;writing-mode:lr-tb;text-anchor:start;display:inline;fill:#2e3436;fill-opacity:1;stroke:#a7aba7;stroke-width:0;stroke-miterlimit:4;stroke-dasharray:none;stroke-opacity:1"
       xml:space="preserve"><tspan
         y="-1150.8378"
         x="162.30188"
         id="tspan43592"
         sodipodi:role="line"
         style="stroke-width:0;stroke-miterlimit:4;stroke-dasharray:none">Custom</tspan></text>
    <text
       inkscape:export-ydpi="90"
       inkscape:export-xdpi="90"
       inkscape:export-filename="/home/aday/Dropbox/Public/settings/sound.png"
       id="text43598"
       y="-1070.8109"
       x="114.3"
       style="font-style:normal;font-variant:normal;font-weight:bold;font-stretch:normal;font-size:3.88056px;line-height:0%;font-family:Cantarell;-inkscape-font-specification:'Cantarell Bold';text-align:start;letter-spacing:0px;word-spacing:0px;text-anchor:start;white-space:pre;inline-size:123.159;display:inline;opacity:1;fill:#77767b;fill-opacity:1;stroke:none;stroke-width:0.264583"
       xml:space="preserve"
       transform="translate(0,-17.991669)"><tspan
         x="114.3"
         y="-1070.8109"
         id="tspan132741"><tspan
           style="font-weight:normal;line-height:1.25;-inkscape-font-specification:Cantarell"
           id="tspan132739">Night Light makes the screen color warmer. This can help prevent eye </tspan></tspan><tspan
         x="114.3"
         y="-1065.9602"
         id="tspan132745"><tspan
           style="font-weight:normal;line-height:1.25;-inkscape-font-specification:Cantarell"
           id="tspan132743">strain and sleeplessness</tspan></tspan></text>
    <path
       inkscape:connector-curvature="0"
       id="path51110"
       d="M 235.4801,-1145.1148 H 114.30095"
       style="display:inline;fill:none;stroke:#dfdfdf;stroke-width:0.264583px;stroke-linecap:butt;stroke-linejoin:miter;stroke-opacity:1" />
    <text
       inkscape:export-ydpi="90"
       inkscape:export-xdpi="90"
       inkscape:export-filename="/home/allan/Documents/GnomeDesign/projects/contacts/png/big-landscape.png"
       id="text51114"
       y="-1135.6876"
       x="118.60964"
       style="font-style:normal;font-variant:normal;font-weight:bold;font-stretch:normal;font-size:3.88056px;line-height:9.35026px;font-family:Cantarell;-inkscape-font-specification:'Cantarell Bold';text-align:start;writing-mode:lr-tb;text-anchor:start;display:inline;fill:#2e3436;fill-opacity:1;stroke:none;stroke-width:0.264583"
       xml:space="preserve"><tspan
         y="-1135.6876"
         x="118.60964"
         id="tspan51112"
         sodipodi:role="line"
         style="font-weight:normal;line-height:9.35026px;stroke-width:0.264583">Times</tspan></text>
    <g
       id="g51120"
       transform="matrix(0.2645833,0,0,0.2645833,112.25175,-1274.4983)"
       style="fill:#2e3436;fill-opacity:1">
      <text
         xml:space="preserve"
         style="font-style:normal;font-variant:normal;font-weight:normal;font-stretch:normal;font-size:14px;line-height:26px;font-family:Cantarell;-inkscape-font-specification:Cantarell;text-align:start;writing-mode:lr-tb;text-anchor:start;display:inline;fill:#2e3436;fill-opacity:1;stroke:none;stroke-width:1"
         x="240.81911"
         y="524.43561"
         id="text51118"
         inkscape:export-filename="/home/allan/Documents/GnomeDesign/projects/contacts/png/big-landscape.png"
         inkscape:export-xdpi="90"
         inkscape:export-ydpi="90"><tspan
           style="font-style:normal;font-variant:normal;font-weight:normal;font-stretch:normal;font-size:14px;line-height:26px;font-family:Cantarell;-inkscape-font-specification:Cantarell;text-align:start;text-anchor:start;fill:#2e3436;fill-opacity:1;stroke-width:1"
           sodipodi:role="line"
           id="tspan51116"
           x="240.81911"
           y="524.43561">Light from 8:00 AM to 10:00 PM</tspan></text>
    </g>
    <text
       inkscape:export-ydpi="90"
       inkscape:export-xdpi="90"
       inkscape:export-filename="/home/aday/Dropbox/Public/settings/sound.png"
       id="text53953"
       y="-1070.8109"
       x="114.3"
       style="font-style:normal;font-variant:normal;font-weight:bold;font-stretch:normal;font-size:3.88056px;line-height:0%;font-family:Cantarell;-inkscape-font-specification:'Cantarell Bold';text-align:start;letter-spacing:0px;word-spacing:0px;text-anchor:start;white-space:pre;inline-size:123.159;display:inline;opacity:1;fill:#77767b;fill-opacity:1;stroke:none;stroke-width:0.264583"
       xml:space="preserve"
       transform="translate(0,-50.270836)"><tspan
         x="114.3"
         y="-1070.8109"
         id="tspan132749"><tspan
           style="font-weight:normal;line-height:1.25;-inkscape-font-specification:Cantarell"
           id="tspan132747">Your computer may wait for a moment when applications are not in </tspan></tspan><tspan
         x="114.3"
         y="-1065.9602"
         id="tspan132753"><tspan
           style="font-weight:normal;line-height:1.25;-inkscape-font-specification:Cantarell"
           id="tspan132751">focus to change their appearance.</tspan></tspan></text>
    <text
       inkscape:export-ydpi="90"
       inkscape:export-xdpi="90"
       inkscape:export-filename="/home/aday/Dropbox/Public/settings/sound.png"
       id="text95181"
       y="-997.2569"
       x="114.3"
       style="font-style:normal;font-variant:normal;font-weight:bold;font-stretch:normal;font-size:3.88056px;line-height:0%;font-family:Cantarell;-inkscape-font-specification:'Cantarell Bold';text-align:start;letter-spacing:0px;word-spacing:0px;text-anchor:start;display:inline;opacity:1;fill:#2e3436;fill-opacity:1;stroke:none;stroke-width:0.264583"
       xml:space="preserve"><tspan
         y="-997.2569"
         x="114.3"
         sodipodi:role="line"
         style="font-style:normal;font-variant:normal;font-weight:bold;font-stretch:normal;font-size:3.88056px;line-height:1.25;font-family:Cantarell;-inkscape-font-specification:Cantarell;fill:#2e3436;fill-opacity:1;stroke-width:0.264583"
         id="tspan95179">Default Applications</tspan></text>
    <rect
       ry="2.3812499"
       rx="2.3812501"
       y="-974.72858"
       x="114.16862"
       height="86.518753"
       width="121.44375"
       id="rect95285"
       style="display:inline;fill:#ffffff;fill-opacity:1;stroke:#d0d0d0;stroke-width:0.264583;stroke-linecap:square;stroke-miterlimit:4;stroke-dasharray:none;stroke-dashoffset:0;stroke-opacity:1" />
    <path
       style="fill:none;stroke:#dbdbdb;stroke-width:0.264583px;stroke-linecap:butt;stroke-linejoin:miter;stroke-opacity:1"
       d="M 114.30061,-960.96153 H 235.47979"
       id="path97827"
       inkscape:connector-curvature="0"
       sodipodi:nodetypes="cc" />
    <path
       inkscape:connector-curvature="0"
       id="path97829"
       d="M 114.30061,-946.41139 H 235.47979"
       style="fill:none;stroke:#dbdbdb;stroke-width:0.264583px;stroke-linecap:butt;stroke-linejoin:miter;stroke-opacity:1"
       sodipodi:nodetypes="cc" />
    <path
       style="fill:none;stroke:#dbdbdb;stroke-width:0.264583px;stroke-linecap:butt;stroke-linejoin:miter;stroke-opacity:1"
       d="M 114.30061,-931.86118 H 235.47979"
       id="path97831"
       inkscape:connector-curvature="0"
       sodipodi:nodetypes="cc" />
    <text
       inkscape:export-ydpi="90"
       inkscape:export-xdpi="90"
       inkscape:export-filename="/home/allan/Documents/GnomeDesign/projects/contacts/png/big-landscape.png"
       id="text97835"
       y="-966.1264"
       x="118.60967"
       style="font-style:normal;font-variant:normal;font-weight:bold;font-stretch:normal;font-size:3.88056px;line-height:6.87917px;font-family:Cantarell;-inkscape-font-specification:'Cantarell Bold';text-align:end;writing-mode:lr-tb;text-anchor:end;display:inline;fill:#2e3436;fill-opacity:1;stroke:none;stroke-width:0.264583"
       xml:space="preserve"><tspan
         id="tspan97833"
         y="-966.1264"
         x="118.60967"
         sodipodi:role="line"
         style="font-weight:normal;font-size:3.88056px;line-height:6.87917px;text-align:start;text-anchor:start;fill:#2e3436;fill-opacity:1;stroke-width:0.264583">Web Browser</tspan></text>
    <text
       inkscape:export-ydpi="90"
       inkscape:export-xdpi="90"
       inkscape:export-filename="/home/allan/Documents/GnomeDesign/projects/contacts/png/big-landscape.png"
       id="text97941"
       y="-952.36804"
       x="118.60967"
       style="font-style:normal;font-variant:normal;font-weight:bold;font-stretch:normal;font-size:3.88056px;line-height:6.87917px;font-family:Cantarell;-inkscape-font-specification:'Cantarell Bold';text-align:end;writing-mode:lr-tb;text-anchor:end;display:inline;fill:#2e3436;fill-opacity:1;stroke:none;stroke-width:0.264583"
       xml:space="preserve"><tspan
         id="tspan97939"
         y="-952.36804"
         x="118.60967"
         sodipodi:role="line"
         style="font-weight:normal;font-size:3.88056px;line-height:6.87917px;text-align:start;text-anchor:start;fill:#2e3436;fill-opacity:1;stroke-width:0.264583">Mail</tspan></text>
    <text
       inkscape:export-ydpi="90"
       inkscape:export-xdpi="90"
       inkscape:export-filename="/home/allan/Documents/GnomeDesign/projects/contacts/png/big-landscape.png"
       id="text98047"
       y="-937.55133"
       x="118.60967"
       style="font-style:normal;font-variant:normal;font-weight:bold;font-stretch:normal;font-size:3.88056px;line-height:6.87917px;font-family:Cantarell;-inkscape-font-specification:'Cantarell Bold';text-align:end;writing-mode:lr-tb;text-anchor:end;display:inline;fill:#2e3436;fill-opacity:1;stroke:none;stroke-width:0.264583"
       xml:space="preserve"><tspan
         id="tspan98045"
         y="-937.55133"
         x="118.60967"
         sodipodi:role="line"
         style="font-weight:normal;font-size:3.88056px;line-height:6.87917px;text-align:start;text-anchor:start;fill:#2e3436;fill-opacity:1;stroke-width:0.264583">Calendar</tspan></text>
    <text
       inkscape:export-ydpi="90"
       inkscape:export-xdpi="90"
       inkscape:export-filename="/home/allan/Documents/GnomeDesign/projects/contacts/png/big-landscape.png"
       id="text98153"
       y="-923.79297"
       x="118.60967"
       style="font-style:normal;font-variant:normal;font-weight:bold;font-stretch:normal;font-size:3.88056px;line-height:6.87917px;font-family:Cantarell;-inkscape-font-specification:'Cantarell Bold';text-align:end;writing-mode:lr-tb;text-anchor:end;display:inline;fill:#2e3436;fill-opacity:1;stroke:none;stroke-width:0.264583"
       xml:space="preserve"><tspan
         id="tspan98151"
         y="-923.79297"
         x="118.60967"
         sodipodi:role="line"
         style="font-weight:normal;font-size:3.88056px;line-height:6.87917px;text-align:start;text-anchor:start;fill:#2e3436;fill-opacity:1;stroke-width:0.264583">Music</tspan></text>
    <path
       inkscape:connector-curvature="0"
       id="path98341"
       d="M 114.30061,-917.30722 H 235.47979"
       style="fill:none;stroke:#dbdbdb;stroke-width:0.264583px;stroke-linecap:butt;stroke-linejoin:miter;stroke-opacity:1"
       sodipodi:nodetypes="cc" />
    <path
       style="fill:none;stroke:#dbdbdb;stroke-width:0.264583px;stroke-linecap:butt;stroke-linejoin:miter;stroke-opacity:1"
       d="M 114.30061,-902.75701 H 235.47979"
       id="path98343"
       inkscape:connector-curvature="0"
       sodipodi:nodetypes="cc" />
    <text
       inkscape:export-ydpi="90"
       inkscape:export-xdpi="90"
       inkscape:export-filename="/home/allan/Documents/GnomeDesign/projects/contacts/png/big-landscape.png"
       id="text98507"
       y="-908.97626"
       x="118.60967"
       style="font-style:normal;font-variant:normal;font-weight:bold;font-stretch:normal;font-size:3.88056px;line-height:6.87917px;font-family:Cantarell;-inkscape-font-specification:'Cantarell Bold';text-align:end;writing-mode:lr-tb;text-anchor:end;display:inline;fill:#2e3436;fill-opacity:1;stroke:none;stroke-width:0.264583"
       xml:space="preserve"><tspan
         id="tspan98505"
         y="-908.97626"
         x="118.60967"
         sodipodi:role="line"
         style="font-weight:normal;font-size:3.88056px;line-height:6.87917px;text-align:start;text-anchor:start;fill:#2e3436;fill-opacity:1;stroke-width:0.264583">Video</tspan></text>
    <text
       inkscape:export-ydpi="90"
       inkscape:export-xdpi="90"
       inkscape:export-filename="/home/allan/Documents/GnomeDesign/projects/contacts/png/big-landscape.png"
       id="text98712"
       y="-894.15955"
       x="118.60967"
       style="font-style:normal;font-variant:normal;font-weight:bold;font-stretch:normal;font-size:3.88056px;line-height:6.87917px;font-family:Cantarell;-inkscape-font-specification:'Cantarell Bold';text-align:end;writing-mode:lr-tb;text-anchor:end;display:inline;fill:#2e3436;fill-opacity:1;stroke:none;stroke-width:0.264583"
       xml:space="preserve"><tspan
         id="tspan98710"
         y="-894.15955"
         x="118.60967"
         sodipodi:role="line"
         style="font-weight:normal;font-size:3.88056px;line-height:6.87917px;text-align:start;text-anchor:start;fill:#2e3436;fill-opacity:1;stroke-width:0.264583">Images</tspan></text>
    <rect
       style="color:#000000;clip-rule:nonzero;display:inline;overflow:visible;visibility:visible;isolation:auto;mix-blend-mode:normal;color-interpolation:sRGB;color-interpolation-filters:linearRGB;solid-color:#000000;solid-opacity:1;fill:none;fill-opacity:1;fill-rule:nonzero;stroke:#e2e2e2;stroke-width:0.264583;stroke-linecap:butt;stroke-linejoin:miter;stroke-miterlimit:4;stroke-dasharray:none;stroke-dashoffset:0;stroke-opacity:1;marker:none;color-rendering:auto;image-rendering:auto;shape-rendering:auto;text-rendering:auto;enable-background:accumulate"
       id="rect98816"
       width="71.17292"
       height="8.7312508"
       x="159.15714"
       y="-971.81018"
       rx="0.79374999"
       ry="0.79375011"
       inkscape:export-filename="/home/lapo.fedora/SparkleShare/gnome-mockups/content selection/content-selection.png"
       inkscape:export-xdpi="90"
       inkscape:export-ydpi="90" />
    <g
       transform="translate(27.780554,-1144.0581)"
       id="g98822">
      <path
         style="fill:#2e3436;fill-opacity:1;stroke:none;stroke-width:0.264583"
         d="m 199.49583,176.08541 -1.32291,1.32291 -1.32292,-1.32291 z"
         id="path98818"
         inkscape:connector-curvature="0"
         sodipodi:nodetypes="cccc" />
      <rect
         width="4.2333331"
         height="4.2333331"
         x="174.49791"
         y="196.05624"
         id="rect98820"
         style="color:#bebebe;display:inline;overflow:visible;visibility:visible;fill:none;stroke:none;stroke-width:0.264583;marker:none;enable-background:new"
         transform="matrix(0,1,1,0,0,0)" />
    </g>
    <text
       inkscape:export-ydpi="90"
       inkscape:export-xdpi="90"
       inkscape:export-filename="/home/allan/Documents/GnomeDesign/projects/contacts/png/big-landscape.png"
       id="text98826"
       y="-966.1593"
       x="162.30188"
       style="font-style:normal;font-variant:normal;font-weight:normal;font-stretch:normal;font-size:3.70417px;line-height:125%;font-family:Cantarell;-inkscape-font-specification:Cantarell;text-align:start;writing-mode:lr-tb;text-anchor:start;display:inline;fill:#2e3436;fill-opacity:1;stroke:#a7aba7;stroke-width:0;stroke-miterlimit:4;stroke-dasharray:none;stroke-opacity:1"
       xml:space="preserve"><tspan
         y="-966.1593"
         x="162.30188"
         id="tspan98824"
         sodipodi:role="line"
         style="stroke-width:0;stroke-miterlimit:4;stroke-dasharray:none">Mozilla Firefox</tspan></text>
    <rect
       style="color:#000000;clip-rule:nonzero;display:inline;overflow:visible;visibility:visible;isolation:auto;mix-blend-mode:normal;color-interpolation:sRGB;color-interpolation-filters:linearRGB;solid-color:#000000;solid-opacity:1;fill:none;fill-opacity:1;fill-rule:nonzero;stroke:#e2e2e2;stroke-width:0.264583;stroke-linecap:butt;stroke-linejoin:miter;stroke-miterlimit:4;stroke-dasharray:none;stroke-dashoffset:0;stroke-opacity:1;marker:none;color-rendering:auto;image-rendering:auto;shape-rendering:auto;text-rendering:auto;enable-background:accumulate"
       id="rect98828"
       width="71.17292"
       height="8.7312508"
       x="159.15714"
       y="-958.05182"
       rx="0.79374999"
       ry="0.79375011"
       inkscape:export-filename="/home/lapo.fedora/SparkleShare/gnome-mockups/content selection/content-selection.png"
       inkscape:export-xdpi="90"
       inkscape:export-ydpi="90" />
    <g
       transform="translate(27.780554,-1130.2998)"
       id="g98834">
      <path
         style="fill:#2e3436;fill-opacity:1;stroke:none;stroke-width:0.264583"
         d="m 199.49583,176.08541 -1.32291,1.32291 -1.32292,-1.32291 z"
         id="path98830"
         inkscape:connector-curvature="0"
         sodipodi:nodetypes="cccc" />
      <rect
         width="4.2333331"
         height="4.2333331"
         x="174.49791"
         y="196.05624"
         id="rect98832"
         style="color:#bebebe;display:inline;overflow:visible;visibility:visible;fill:none;stroke:none;stroke-width:0.264583;marker:none;enable-background:new"
         transform="matrix(0,1,1,0,0,0)" />
    </g>
    <text
       inkscape:export-ydpi="90"
       inkscape:export-xdpi="90"
       inkscape:export-filename="/home/allan/Documents/GnomeDesign/projects/contacts/png/big-landscape.png"
       id="text98838"
       y="-952.40094"
       x="162.30188"
       style="font-style:normal;font-variant:normal;font-weight:normal;font-stretch:normal;font-size:3.70417px;line-height:125%;font-family:Cantarell;-inkscape-font-specification:Cantarell;text-align:start;writing-mode:lr-tb;text-anchor:start;display:inline;fill:#2e3436;fill-opacity:1;stroke:#a7aba7;stroke-width:0;stroke-miterlimit:4;stroke-dasharray:none;stroke-opacity:1"
       xml:space="preserve"><tspan
         y="-952.40094"
         x="162.30188"
         id="tspan98836"
         sodipodi:role="line"
         style="stroke-width:0;stroke-miterlimit:4;stroke-dasharray:none">Evolution</tspan></text>
    <rect
       style="color:#000000;clip-rule:nonzero;display:inline;overflow:visible;visibility:visible;isolation:auto;mix-blend-mode:normal;color-interpolation:sRGB;color-interpolation-filters:linearRGB;solid-color:#000000;solid-opacity:1;fill:none;fill-opacity:1;fill-rule:nonzero;stroke:#e2e2e2;stroke-width:0.264583;stroke-linecap:butt;stroke-linejoin:miter;stroke-miterlimit:4;stroke-dasharray:none;stroke-dashoffset:0;stroke-opacity:1;marker:none;color-rendering:auto;image-rendering:auto;shape-rendering:auto;text-rendering:auto;enable-background:accumulate"
       id="rect98840"
       width="71.17292"
       height="8.7312508"
       x="159.15714"
       y="-943.76428"
       rx="0.79374999"
       ry="0.79375011"
       inkscape:export-filename="/home/lapo.fedora/SparkleShare/gnome-mockups/content selection/content-selection.png"
       inkscape:export-xdpi="90"
       inkscape:export-ydpi="90" />
    <g
       transform="translate(27.780554,-1116.0123)"
       id="g98846">
      <path
         style="fill:#2e3436;fill-opacity:1;stroke:none;stroke-width:0.264583"
         d="m 199.49583,176.08541 -1.32291,1.32291 -1.32292,-1.32291 z"
         id="path98842"
         inkscape:connector-curvature="0"
         sodipodi:nodetypes="cccc" />
      <rect
         width="4.2333331"
         height="4.2333331"
         x="174.49791"
         y="196.05624"
         id="rect98844"
         style="color:#bebebe;display:inline;overflow:visible;visibility:visible;fill:none;stroke:none;stroke-width:0.264583;marker:none;enable-background:new"
         transform="matrix(0,1,1,0,0,0)" />
    </g>
    <text
       inkscape:export-ydpi="90"
       inkscape:export-xdpi="90"
       inkscape:export-filename="/home/allan/Documents/GnomeDesign/projects/contacts/png/big-landscape.png"
       id="text98850"
       y="-938.1134"
       x="162.30188"
       style="font-style:normal;font-variant:normal;font-weight:normal;font-stretch:normal;font-size:3.70417px;line-height:125%;font-family:Cantarell;-inkscape-font-specification:Cantarell;text-align:start;writing-mode:lr-tb;text-anchor:start;display:inline;fill:#2e3436;fill-opacity:1;stroke:#a7aba7;stroke-width:0;stroke-miterlimit:4;stroke-dasharray:none;stroke-opacity:1"
       xml:space="preserve"><tspan
         y="-938.1134"
         x="162.30188"
         id="tspan98848"
         sodipodi:role="line"
         style="stroke-width:0;stroke-miterlimit:4;stroke-dasharray:none">Evolution</tspan></text>
    <rect
       style="color:#000000;clip-rule:nonzero;display:inline;overflow:visible;visibility:visible;isolation:auto;mix-blend-mode:normal;color-interpolation:sRGB;color-interpolation-filters:linearRGB;solid-color:#000000;solid-opacity:1;fill:none;fill-opacity:1;fill-rule:nonzero;stroke:#e2e2e2;stroke-width:0.264583;stroke-linecap:butt;stroke-linejoin:miter;stroke-miterlimit:4;stroke-dasharray:none;stroke-dashoffset:0;stroke-opacity:1;marker:none;color-rendering:auto;image-rendering:auto;shape-rendering:auto;text-rendering:auto;enable-background:accumulate"
       id="rect98852"
       width="71.17292"
       height="8.7312508"
       x="159.15714"
       y="-928.94757"
       rx="0.79374999"
       ry="0.79375011"
       inkscape:export-filename="/home/lapo.fedora/SparkleShare/gnome-mockups/content selection/content-selection.png"
       inkscape:export-xdpi="90"
       inkscape:export-ydpi="90" />
    <g
       transform="translate(27.780554,-1101.1956)"
       id="g98858">
      <path
         style="fill:#2e3436;fill-opacity:1;stroke:none;stroke-width:0.264583"
         d="m 199.49583,176.08541 -1.32291,1.32291 -1.32292,-1.32291 z"
         id="path98854"
         inkscape:connector-curvature="0"
         sodipodi:nodetypes="cccc" />
      <rect
         width="4.2333331"
         height="4.2333331"
         x="174.49791"
         y="196.05624"
         id="rect98856"
         style="color:#bebebe;display:inline;overflow:visible;visibility:visible;fill:none;stroke:none;stroke-width:0.264583;marker:none;enable-background:new"
         transform="matrix(0,1,1,0,0,0)" />
    </g>
    <text
       inkscape:export-ydpi="90"
       inkscape:export-xdpi="90"
       inkscape:export-filename="/home/allan/Documents/GnomeDesign/projects/contacts/png/big-landscape.png"
       id="text98862"
       y="-923.29669"
       x="162.30188"
       style="font-style:normal;font-variant:normal;font-weight:normal;font-stretch:normal;font-size:3.70417px;line-height:125%;font-family:Cantarell;-inkscape-font-specification:Cantarell;text-align:start;writing-mode:lr-tb;text-anchor:start;display:inline;fill:#2e3436;fill-opacity:1;stroke:#a7aba7;stroke-width:0;stroke-miterlimit:4;stroke-dasharray:none;stroke-opacity:1"
       xml:space="preserve"><tspan
         y="-923.29669"
         x="162.30188"
         id="tspan98860"
         sodipodi:role="line"
         style="stroke-width:0;stroke-miterlimit:4;stroke-dasharray:none">GNOME Music</tspan></text>
    <rect
       style="color:#000000;clip-rule:nonzero;display:inline;overflow:visible;visibility:visible;isolation:auto;mix-blend-mode:normal;color-interpolation:sRGB;color-interpolation-filters:linearRGB;solid-color:#000000;solid-opacity:1;fill:none;fill-opacity:1;fill-rule:nonzero;stroke:#e2e2e2;stroke-width:0.264583;stroke-linecap:butt;stroke-linejoin:miter;stroke-miterlimit:4;stroke-dasharray:none;stroke-dashoffset:0;stroke-opacity:1;marker:none;color-rendering:auto;image-rendering:auto;shape-rendering:auto;text-rendering:auto;enable-background:accumulate"
       id="rect98864"
       width="71.17292"
       height="8.7312508"
       x="159.15714"
       y="-914.66003"
       rx="0.79374999"
       ry="0.79375011"
       inkscape:export-filename="/home/lapo.fedora/SparkleShare/gnome-mockups/content selection/content-selection.png"
       inkscape:export-xdpi="90"
       inkscape:export-ydpi="90" />
    <g
       transform="translate(27.780554,-1086.9081)"
       id="g98870">
      <path
         style="fill:#2e3436;fill-opacity:1;stroke:none;stroke-width:0.264583"
         d="m 199.49583,176.08541 -1.32291,1.32291 -1.32292,-1.32291 z"
         id="path98866"
         inkscape:connector-curvature="0"
         sodipodi:nodetypes="cccc" />
      <rect
         width="4.2333331"
         height="4.2333331"
         x="174.49791"
         y="196.05624"
         id="rect98868"
         style="color:#bebebe;display:inline;overflow:visible;visibility:visible;fill:none;stroke:none;stroke-width:0.264583;marker:none;enable-background:new"
         transform="matrix(0,1,1,0,0,0)" />
    </g>
    <text
       inkscape:export-ydpi="90"
       inkscape:export-xdpi="90"
       inkscape:export-filename="/home/allan/Documents/GnomeDesign/projects/contacts/png/big-landscape.png"
       id="text98874"
       y="-909.00916"
       x="162.30188"
       style="font-style:normal;font-variant:normal;font-weight:normal;font-stretch:normal;font-size:3.70417px;line-height:125%;font-family:Cantarell;-inkscape-font-specification:Cantarell;text-align:start;writing-mode:lr-tb;text-anchor:start;display:inline;fill:#2e3436;fill-opacity:1;stroke:#a7aba7;stroke-width:0;stroke-miterlimit:4;stroke-dasharray:none;stroke-opacity:1"
       xml:space="preserve"><tspan
         y="-909.00916"
         x="162.30188"
         id="tspan98872"
         sodipodi:role="line"
         style="stroke-width:0;stroke-miterlimit:4;stroke-dasharray:none">VLC Media Player</tspan></text>
    <rect
       style="color:#000000;clip-rule:nonzero;display:inline;overflow:visible;visibility:visible;isolation:auto;mix-blend-mode:normal;color-interpolation:sRGB;color-interpolation-filters:linearRGB;solid-color:#000000;solid-opacity:1;fill:none;fill-opacity:1;fill-rule:nonzero;stroke:#e2e2e2;stroke-width:0.264583;stroke-linecap:butt;stroke-linejoin:miter;stroke-miterlimit:4;stroke-dasharray:none;stroke-dashoffset:0;stroke-opacity:1;marker:none;color-rendering:auto;image-rendering:auto;shape-rendering:auto;text-rendering:auto;enable-background:accumulate"
       id="rect98876"
       width="71.17292"
       height="8.7312508"
       x="159.15714"
       y="-899.84332"
       rx="0.79374999"
       ry="0.79375011"
       inkscape:export-filename="/home/lapo.fedora/SparkleShare/gnome-mockups/content selection/content-selection.png"
       inkscape:export-xdpi="90"
       inkscape:export-ydpi="90" />
    <g
       transform="translate(27.780554,-1072.0914)"
       id="g98882">
      <path
         style="fill:#2e3436;fill-opacity:1;stroke:none;stroke-width:0.264583"
         d="m 199.49583,176.08541 -1.32291,1.32291 -1.32292,-1.32291 z"
         id="path98878"
         inkscape:connector-curvature="0"
         sodipodi:nodetypes="cccc" />
      <rect
         width="4.2333331"
         height="4.2333331"
         x="174.49791"
         y="196.05624"
         id="rect98880"
         style="color:#bebebe;display:inline;overflow:visible;visibility:visible;fill:none;stroke:none;stroke-width:0.264583;marker:none;enable-background:new"
         transform="matrix(0,1,1,0,0,0)" />
    </g>
    <text
       inkscape:export-ydpi="90"
       inkscape:export-xdpi="90"
       inkscape:export-filename="/home/allan/Documents/GnomeDesign/projects/contacts/png/big-landscape.png"
       id="text98886"
       y="-894.19244"
       x="162.30188"
       style="font-style:normal;font-variant:normal;font-weight:normal;font-stretch:normal;font-size:3.70417px;line-height:125%;font-family:Cantarell;-inkscape-font-specification:Cantarell;text-align:start;writing-mode:lr-tb;text-anchor:start;display:inline;fill:#2e3436;fill-opacity:1;stroke:#a7aba7;stroke-width:0;stroke-miterlimit:4;stroke-dasharray:none;stroke-opacity:1"
       xml:space="preserve"><tspan
         y="-894.19244"
         x="162.30188"
         id="tspan98884"
         sodipodi:role="line"
         style="stroke-width:0;stroke-miterlimit:4;stroke-dasharray:none">Image Viewer</tspan></text>
    <text
       inkscape:export-ydpi="90"
       inkscape:export-xdpi="90"
       inkscape:export-filename="/home/aday/Dropbox/Public/settings/sound.png"
       id="text106294"
       y="-1070.8109"
       x="114.3"
       style="font-style:normal;font-variant:normal;font-weight:bold;font-stretch:normal;font-size:3.88056px;line-height:0%;font-family:Cantarell;-inkscape-font-specification:'Cantarell Bold';text-align:start;letter-spacing:0px;word-spacing:0px;text-anchor:start;white-space:pre;inline-size:127.341;display:inline;opacity:1;fill:#77767b;fill-opacity:1;stroke:none;stroke-width:0.264583"
       xml:space="preserve"
       transform="translate(0,82.550002)"><tspan
         x="114.3"
         y="-1070.8109"
         id="tspan132757"><tspan
           style="font-weight:normal;line-height:1.25;-inkscape-font-specification:Cantarell"
           id="tspan132755">Preferred applications for handling common tasks and opening common </tspan></tspan><tspan
         x="114.3"
         y="-1065.9602"
         id="tspan132761"><tspan
           style="font-weight:normal;line-height:1.25;-inkscape-font-specification:Cantarell"
           id="tspan132759">files or media.</tspan></tspan></text>
    <path
       style="fill:none;stroke:#fafafa;stroke-width:0.529167;stroke-linecap:butt;stroke-linejoin:miter;stroke-miterlimit:4;stroke-dasharray:1.05833, 0.529167;stroke-dashoffset:0;stroke-opacity:1"
       d="M 106.3625,-1080.6856 H 242.09376"
       id="path126716" />
    <rect
       y="-1216.4169"
       x="128.5874"
       height="27.781355"
       width="37.041767"
       id="rect38811"
       style="display:inline;fill:none;fill-opacity:0.380609;stroke:#3584e4;stroke-width:1.05833;stroke-linecap:square;stroke-miterlimit:4;stroke-dasharray:none;stroke-dashoffset:0;stroke-opacity:1"
       rx="1.5875"
       ry="1.5875" />
  </g>
</svg>
