<?xml version="1.0" encoding="UTF-8" standalone="no"?>
<!-- Created with Inkscape (http://www.inkscape.org/) -->

<svg
   width="1560"
   height="900"
   viewBox="0 0 412.75 238.12501"
   version="1.1"
   id="svg74514"
   inkscape:version="1.2.2 (b0a8486541, 2022-12-01)"
   sodipodi:docname="system-reboot-dialog.svg"
   inkscape:export-filename="system-reboot-dialog.png"
   inkscape:export-xdpi="96"
   inkscape:export-ydpi="96"
   xmlns:inkscape="http://www.inkscape.org/namespaces/inkscape"
   xmlns:sodipodi="http://sodipodi.sourceforge.net/DTD/sodipodi-0.dtd"
   xmlns="http://www.w3.org/2000/svg"
   xmlns:svg="http://www.w3.org/2000/svg">
  <sodipodi:namedview
     id="namedview74516"
     pagecolor="#ffffff"
     bordercolor="#000000"
     borderopacity="0.25"
     inkscape:showpageshadow="2"
     inkscape:pageopacity="1"
     inkscape:pagecheckerboard="0"
     inkscape:deskcolor="#d1d1d1"
     inkscape:document-units="px"
     showgrid="false"
     inkscape:zoom="0.70710678"
     inkscape:cx="632.86057"
     inkscape:cy="545.88644"
     inkscape:window-width="1920"
     inkscape:window-height="1131"
     inkscape:window-x="0"
     inkscape:window-y="0"
     inkscape:window-maximized="1"
     inkscape:current-layer="layer1">
    <inkscape:grid
       type="xygrid"
       id="grid76563"
       originx="0"
       originy="0" />
  </sodipodi:namedview>
  <defs
     id="defs74511">
    <rect
       x="726.17798"
       y="2341.2844"
       width="173.03539"
       height="59.935585"
       id="rect32824" />
    <rect
       x="726.17798"
       y="2341.2844"
       width="508.10593"
       height="19.464771"
       id="rect32826" />
    <rect
       x="726.17798"
       y="2341.2844"
       width="508.10593"
       height="19.464771"
       id="rect32828" />
    <rect
       x="726.17798"
       y="2341.2844"
       width="508.10593"
       height="19.464771"
       id="rect32830" />
    <rect
       x="726.17798"
       y="2341.2844"
       width="508.10593"
       height="19.464771"
       id="rect33125" />
    <rect
       x="726.17798"
       y="2341.2844"
       width="508.10593"
       height="19.464771"
       id="rect33239" />
    <rect
       x="726.17798"
       y="2341.2844"
       width="508.10593"
       height="19.464771"
       id="rect33253" />
    <rect
       x="726.17798"
       y="2341.2844"
       width="508.10593"
       height="19.464771"
       id="rect33392" />
    <rect
       x="726.17798"
       y="2341.2844"
       width="508.10593"
       height="19.464771"
       id="rect33508" />
    <rect
       x="726.17798"
       y="2341.2844"
       width="508.10593"
       height="19.464771"
       id="rect33522" />
    <rect
       x="726.17798"
       y="2341.2844"
       width="173.03539"
       height="59.935585"
       id="rect54855" />
    <rect
       x="726.17798"
       y="2341.2844"
       width="508.10593"
       height="19.464771"
       id="rect54857" />
    <rect
       x="726.17798"
       y="2341.2844"
       width="508.10593"
       height="19.464771"
       id="rect54859" />
    <rect
       x="726.17798"
       y="2341.2844"
       width="508.10593"
       height="19.464771"
       id="rect54861" />
    <rect
       x="726.17798"
       y="2341.2844"
       width="508.10593"
       height="19.464771"
       id="rect54863" />
    <rect
       x="726.17798"
       y="2341.2844"
       width="508.10593"
       height="19.464771"
       id="rect54871" />
    <rect
       x="726.17798"
       y="2341.2844"
       width="508.10593"
       height="19.464771"
       id="rect54873" />
    <rect
       x="726.17798"
       y="2341.2844"
       width="508.10593"
       height="19.464771"
       id="rect54867" />
    <rect
       x="726.17798"
       y="2341.2844"
       width="508.10593"
       height="19.464771"
       id="rect54869" />
    <rect
       x="726.17798"
       y="2341.2844"
       width="508.10593"
       height="19.464771"
       id="rect56730" />
    <rect
       x="726.17798"
       y="2341.2844"
       width="508.10593"
       height="19.464771"
       id="rect56792" />
    <rect
       x="726.17798"
       y="2341.2844"
       width="508.10593"
       height="19.464771"
       id="rect54865" />
    <rect
       x="726.17798"
       y="2341.2844"
       width="173.03539"
       height="59.935585"
       id="rect78384" />
    <rect
       x="726.17798"
       y="2341.2844"
       width="508.10593"
       height="19.464771"
       id="rect78386" />
    <rect
       x="726.17798"
       y="2341.2844"
       width="508.10593"
       height="19.464771"
       id="rect78388" />
    <rect
       x="726.17798"
       y="2341.2844"
       width="508.10593"
       height="19.464771"
       id="rect78390" />
    <rect
       x="726.17798"
       y="2341.2844"
       width="508.10593"
       height="19.464771"
       id="rect78392" />
    <rect
       x="726.17798"
       y="2341.2844"
       width="508.10593"
       height="19.464771"
       id="rect78394" />
    <rect
       x="726.17798"
       y="2341.2844"
       width="508.10593"
       height="19.464771"
       id="rect78396" />
    <rect
       x="726.17798"
       y="2341.2844"
       width="508.10593"
       height="19.464771"
       id="rect78398" />
    <rect
       x="726.17798"
       y="2341.2844"
       width="508.10593"
       height="19.464771"
       id="rect78400" />
    <rect
       x="726.17798"
       y="2341.2844"
       width="508.10593"
       height="19.464771"
       id="rect78402" />
    <rect
       x="726.17798"
       y="2341.2844"
       width="508.10593"
       height="19.464771"
       id="rect78404" />
    <rect
       x="726.17798"
       y="2341.2844"
       width="508.10593"
       height="19.464771"
       id="rect78406" />
    <rect
       x="726.17798"
       y="2341.2844"
       width="173.03539"
       height="59.935585"
       id="rect78776" />
    <rect
       x="726.17798"
       y="2341.2844"
       width="508.10593"
       height="19.464771"
       id="rect78778" />
    <rect
       x="726.17798"
       y="2341.2844"
       width="508.10593"
       height="19.464771"
       id="rect78780" />
    <rect
       x="726.17798"
       y="2341.2844"
       width="508.10593"
       height="19.464771"
       id="rect78782" />
    <rect
       x="726.17798"
       y="2341.2844"
       width="508.10593"
       height="19.464771"
       id="rect78784" />
    <rect
       x="726.17798"
       y="2341.2844"
       width="508.10593"
       height="19.464771"
       id="rect78786" />
    <rect
       x="726.17798"
       y="2341.2844"
       width="508.10593"
       height="19.464771"
       id="rect78788" />
    <rect
       x="726.17798"
       y="2341.2844"
       width="508.10593"
       height="19.464771"
       id="rect78790" />
    <rect
       x="726.17798"
       y="2341.2844"
       width="508.10593"
       height="19.464771"
       id="rect78792" />
    <rect
       x="726.17798"
       y="2341.2844"
       width="508.10593"
       height="19.464771"
       id="rect78794" />
    <rect
       x="726.17798"
       y="2341.2844"
       width="508.10593"
       height="19.464771"
       id="rect78796" />
    <rect
       x="726.17798"
       y="2341.2844"
       width="508.10593"
       height="19.464771"
       id="rect78798" />
  </defs>
  <g
     inkscape:label="Layer 1"
     inkscape:groupmode="layer"
     id="layer1">
    <rect
       inkscape:export-ydpi="90"
       inkscape:export-xdpi="90"
       style="display:inline;fill:#303030;fill-opacity:1;stroke:#fafafa;stroke-width:0;stroke-miterlimit:4;stroke-dasharray:none;stroke-opacity:1"
       id="rect32796"
       width="117.21043"
       height="131.23283"
       x="-137.58331"
       y="47.625"
       rx="2.3812499"
       ry="2.3812501" />
    <path
       id="path32798"
       style="display:inline;fill:#525252;fill-opacity:1;stroke:#fafafa;stroke-width:0"
       d="m -20.372379,177.53504 v 9.26041 c 0,1.31921 -1.06203,2.38125 -2.381247,2.38125 H -135.20151 c -1.31922,0 -2.38125,-1.06204 -2.38125,-2.38125 v -9.26041 z"
       sodipodi:nodetypes="csssscc" />
    <text
       xml:space="preserve"
       transform="matrix(0.26458333,0,0,0.26458333,-294.15662,-562.76593)"
       id="text32802"
       style="font-size:21.3333px;font-family:Cantarell;-inkscape-font-specification:Cantarell;text-align:start;white-space:pre;shape-inside:url(#rect32824);display:inline;fill:#ffffff;fill-opacity:1;stroke:#2e3436;stroke-width:0;stroke-dasharray:none"
       x="34.269989"
       y="0"><tspan
         x="775.24471"
         y="2360.4427"
         id="tspan82035"><tspan
           style="font-weight:800;-inkscape-font-specification:'Cantarell Ultra-Bold';text-align:center;text-anchor:middle"
           id="tspan82033">Restart</tspan></tspan></text>
    <text
       xml:space="preserve"
       transform="matrix(0.26458333,0,0,0.26458333,-338.2254,-551.21763)"
       id="text32806"
       style="font-size:14.6667px;font-family:Cantarell;-inkscape-font-specification:Cantarell;text-align:start;white-space:pre;shape-inside:url(#rect32826);display:inline;fill:#ffffff;fill-opacity:1;stroke:#2e3436;stroke-width:0;stroke-dasharray:none"
       x="34.269989"
       y="0"><tspan
         x="812.59011"
         y="2354.456"
         id="tspan82039"><tspan
           style="text-align:center;text-anchor:middle"
           id="tspan82037">The system will restart automatically in 60 seconds.</tspan></tspan></text>
    <path
       id="path32808"
       style="display:inline;fill:none;stroke:#3f72b0;stroke-width:0.529166"
       d="m -134.93693,177.7996 h 53.445839 2.38125 v 8.73123 2.38125 h -55.827089 c -1.31921,0 -2.38125,-1.06204 -2.38125,-2.38125 v -8.73123 z"
       sodipodi:nodetypes="cccccsscc" />
    <text
       xml:space="preserve"
       transform="matrix(0.26458333,0,0,0.26458333,-367.64619,-437.97453)"
       id="text32812"
       style="font-size:14.6667px;font-family:Cantarell;-inkscape-font-specification:Cantarell;text-align:start;white-space:pre;shape-inside:url(#rect32828);display:inline;fill:#ffffff;fill-opacity:1;stroke:#2e3436;stroke-width:0;stroke-dasharray:none"
       x="34.269989"
       y="0"><tspan
         x="957.70974"
         y="2354.456"
         id="tspan82043"><tspan
           style="font-weight:bold;text-align:center;text-anchor:middle"
           id="tspan82041">Cancel</tspan></tspan></text>
    <text
       xml:space="preserve"
       transform="matrix(0.26458333,0,0,0.26458333,-309.21597,-437.97453)"
       id="text32816"
       style="font-size:14.6667px;font-family:Cantarell;-inkscape-font-specification:Cantarell;text-align:start;white-space:pre;shape-inside:url(#rect32830);display:inline;fill:#ffffff;fill-opacity:1;stroke:#2e3436;stroke-width:0;stroke-dasharray:none"
       x="34.269989"
       y="0"><tspan
         x="955.52442"
         y="2354.456"
         id="tspan82047"><tspan
           style="font-weight:bold;text-align:center;text-anchor:middle"
           id="tspan82045">Restart</tspan></tspan></text>
    <rect
       style="fill:#525252;fill-opacity:1;stroke:none;stroke-width:0.529167;stroke-dasharray:none;stroke-opacity:1"
       id="rect32900"
       width="95.250038"
       height="13.229162"
       x="-126.73515"
       y="80.432884"
       rx="2.3812499"
       ry="2.3812499" />
    <text
       xml:space="preserve"
       transform="matrix(0.26458333,0,0,0.26458333,-314.41287,-534.54843)"
       id="text33123"
       style="font-size:14.6667px;font-family:Cantarell;-inkscape-font-specification:Cantarell;text-align:start;white-space:pre;shape-inside:url(#rect33125);display:inline;fill:#ffffff;fill-opacity:1;stroke:#2e3436;stroke-width:0;stroke-dasharray:none"
       x="116.26417"
       y="0"><tspan
         x="726.17773"
         y="2354.456"
         id="tspan82051"><tspan
           style="font-weight:bold"
           id="tspan82049">Install Software Updates</tspan></tspan></text>
    <text
       xml:space="preserve"
       transform="matrix(0.26458333,0,0,0.26458333,-318.11703,-486.39393)"
       id="text33237"
       style="font-size:14.6667px;font-family:Cantarell;-inkscape-font-specification:Cantarell;text-align:start;white-space:pre;shape-inside:url(#rect33239);display:inline;fill:#ffffff;fill-opacity:1;stroke:#2e3436;stroke-width:0;stroke-dasharray:none"
       x="116.26417"
       y="0"><tspan
         x="726.17773"
         y="2354.456"
         id="tspan82055"><tspan
           style="font-weight:bold"
           id="tspan82053">System Start Options</tspan></tspan></text>
    <rect
       style="fill:#525252;fill-opacity:1;stroke:none;stroke-width:0.529168;stroke-dasharray:none;stroke-opacity:1"
       id="rect33247"
       width="95.250038"
       height="26.722918"
       x="-126.73515"
       y="140.22873"
       rx="2.3812499"
       ry="2.3812499" />
    <text
       xml:space="preserve"
       transform="matrix(0.26458333,0,0,0.26458333,-308.06286,-474.75213)"
       id="text33251"
       style="font-size:14.6667px;font-family:Cantarell;-inkscape-font-specification:Cantarell;text-align:start;white-space:pre;shape-inside:url(#rect33253);display:inline;fill:#ffffff;fill-opacity:1;stroke:#2e3436;stroke-width:0;stroke-dasharray:none"
       x="116.26417"
       y="0"><tspan
         x="726.17773"
         y="2354.456"
         id="tspan82059"><tspan
           style="font-weight:bold"
           id="tspan82057">Distro A</tspan></tspan></text>
    <path
       style="fill:#525252;fill-opacity:1;stroke:#303030;stroke-width:0.264582;stroke-dasharray:none;stroke-opacity:1"
       d="m -126.7349,153.59006 h 95.249937"
       id="path33317" />
    <text
       xml:space="preserve"
       transform="matrix(0.26458333,0,0,0.26458333,-308.06286,-461.21003)"
       id="text33390"
       style="font-size:14.6667px;font-family:Cantarell;-inkscape-font-specification:Cantarell;text-align:start;white-space:pre;shape-inside:url(#rect33392);display:inline;fill:#ffffff;fill-opacity:1;stroke:#2e3436;stroke-width:0;stroke-dasharray:none"
       x="116.26417"
       y="0"><tspan
         x="726.17773"
         y="2354.456"
         id="tspan82063"><tspan
           style="font-weight:bold"
           id="tspan82061">Distro A</tspan></tspan></text>
    <rect
       style="fill:#525252;fill-opacity:1;stroke:none;stroke-width:0.529167;stroke-dasharray:none;stroke-opacity:1"
       id="rect33502"
       width="95.250038"
       height="13.229162"
       x="-126.73515"
       y="96.837074"
       rx="2.3812499"
       ry="2.3812499" />
    <text
       xml:space="preserve"
       transform="matrix(0.26458333,0,0,0.26458333,-314.41287,-518.14413)"
       id="text33506"
       style="font-size:14.6667px;font-family:Cantarell;-inkscape-font-specification:Cantarell;text-align:start;white-space:pre;shape-inside:url(#rect33508);display:inline;fill:#ffffff;fill-opacity:1;stroke:#2e3436;stroke-width:0;stroke-dasharray:none"
       x="116.26417"
       y="0"><tspan
         x="726.17773"
         y="2354.456"
         id="tspan82067"><tspan
           style="font-weight:bold"
           id="tspan82065">1 App is Blocking Restart</tspan></tspan></text>
    <rect
       style="fill:#525252;fill-opacity:1;stroke:none;stroke-width:0.529167;stroke-dasharray:none;stroke-opacity:1"
       id="rect33516"
       width="95.250038"
       height="13.229162"
       x="-126.73515"
       y="113.24127"
       rx="2.3812499"
       ry="2.3812499" />
    <text
       xml:space="preserve"
       transform="matrix(0.26458333,0,0,0.26458333,-314.41287,-501.73983)"
       id="text33520"
       style="font-size:14.6667px;font-family:Cantarell;-inkscape-font-specification:Cantarell;text-align:start;white-space:pre;shape-inside:url(#rect33522);display:inline;fill:#ffffff;fill-opacity:1;stroke:#2e3436;stroke-width:0;stroke-dasharray:none"
       x="116.26417"
       y="0"><tspan
         x="726.17773"
         y="2354.456"
         id="tspan82071"><tspan
           style="font-weight:bold"
           id="tspan82069">Another User is Logged In</tspan></tspan></text>
    <rect
       ry="3.3072915"
       rx="3.3072913"
       y="83.740189"
       x="-47.889233"
       height="6.614583"
       width="12.700008"
       id="rect39869"
       style="fill:#000000;fill-opacity:0.152941;stroke:none;stroke-width:0.264583;stroke-linecap:round;stroke-miterlimit:4;stroke-dasharray:none;stroke-opacity:1" />
    <g
       id="g39873"
       transform="matrix(-0.26458334,0,0,0.26458334,1640.8441,-244.8038)"
       style="fill:#3584e4;fill-opacity:1">
      <rect
         ry="12.499999"
         rx="12.499998"
         y="1241.7408"
         x="-6382.6094"
         height="24.999998"
         width="48.000031"
         id="rect39871"
         style="fill:#3584e4;fill-opacity:1;stroke:none;stroke-width:1;stroke-linecap:round;stroke-miterlimit:4;stroke-dasharray:none;stroke-opacity:1"
         transform="scale(-1,1)" />
    </g>
    <rect
       ry="2.5887942"
       rx="2.588845"
       y="84.515564"
       x="-41.160625"
       height="5.1776214"
       width="5.1777225"
       id="rect39875"
       style="fill:#ffffff;fill-opacity:1;stroke:none;stroke-width:0.264583;stroke-linecap:round;stroke-miterlimit:4;stroke-dasharray:none;stroke-opacity:1" />
    <g
       id="g47023"
       transform="rotate(90,-47.820588,-517.72093)">
      <path
         d="m 572.29396,-528.76431 a 0.26458333,0.26458333 0 0 1 0.0775,-0.18758 0.26458333,0.26458333 0 0 1 0.37414,0 l 1.5875,1.5875 a 0.26460979,0.26460979 0 0 1 0,0.37465 l -1.5875,1.5875 a 0.26458333,0.26458333 0 0 1 -0.37414,0 0.26458333,0.26458333 0 0 1 0,-0.37465 l 1.40043,-1.39992 -1.40043,-1.40043 a 0.26458333,0.26458333 0 0 1 -0.0775,-0.18707 z"
         id="path41646"
         style="fill:#ffffff;fill-opacity:1;stroke-width:0.264583" />
      <rect
         y="571.23541"
         x="-529.2937"
         height="4.2333331"
         width="4.2333331"
         id="rect41648"
         style="fill:none;fill-opacity:1;stroke-width:0.264583"
         transform="matrix(0,1,1,0,0,0)" />
    </g>
    <path
       d="m -36.77671,118.79758 a 0.26458333,0.26458333 0 0 1 0.18759,0.0775 0.26458333,0.26458333 0 0 1 0,0.37414 l -1.587497,1.5875 a 0.26460979,0.26460979 0 0 1 -0.37466,0 l -1.5875,-1.5875 a 0.26458333,0.26458333 0 0 1 0,-0.37414 0.26458333,0.26458333 0 0 1 0.37466,0 l 1.39991,1.40043 1.400427,-1.40043 a 0.26458333,0.26458333 0 0 1 0.18707,-0.0775 z"
       id="path41981"
       style="fill:#ffffff;fill-opacity:1;stroke-width:0.264583" />
    <circle
       style="fill:#ffffff;fill-opacity:1;stroke:#3584e4;stroke-width:1.5875;stroke-dasharray:none;stroke-opacity:1"
       id="circle38578"
       cx="-120.12062"
       cy="146.84306"
       r="1.8520756" />
    <circle
       style="fill:none;fill-opacity:1;stroke:#e0e0e0;stroke-width:0.529166;stroke-dasharray:none;stroke-opacity:0.344752"
       id="circle43513"
       cx="-120.12062"
       cy="160.07227"
       r="2.3812501" />
    <rect
       inkscape:export-ydpi="90"
       inkscape:export-xdpi="90"
       style="display:inline;fill:#303030;fill-opacity:1;stroke:#fafafa;stroke-width:0;stroke-miterlimit:4;stroke-dasharray:none;stroke-opacity:1"
       id="rect54779"
       width="117.21043"
       height="37.570831"
       x="15.875265"
       y="69.849998"
       rx="2.3812499"
       ry="2.3812499" />
    <path
       id="path54781"
       style="display:inline;fill:#525252;fill-opacity:1;stroke:#fafafa;stroke-width:0"
       d="m 133.08595,103.98078 v 9.2604 c 0,1.31921 -1.06203,2.38125 -2.38125,2.38125 H 18.256776 c -1.31922,0 -2.38125,-1.06204 -2.38125,-2.38125 v -9.2604 z"
       sodipodi:nodetypes="csssscc" />
    <text
       xml:space="preserve"
       transform="matrix(0.26458333,0,0,0.26458333,-140.6983,-540.54094)"
       id="text54785"
       style="font-size:21.3333px;font-family:Cantarell;-inkscape-font-specification:Cantarell;text-align:start;white-space:pre;shape-inside:url(#rect54855);display:inline;fill:#ffffff;fill-opacity:1;stroke:#2e3436;stroke-width:0;stroke-dasharray:none"
       x="34.269989"
       y="0"><tspan
         x="775.24471"
         y="2360.4427"
         id="tspan82075"><tspan
           style="font-weight:800;-inkscape-font-specification:'Cantarell Ultra-Bold';text-align:center;text-anchor:middle"
           id="tspan82073">Restart</tspan></tspan></text>
    <text
       xml:space="preserve"
       transform="matrix(0.26458333,0,0,0.26458333,-184.76704,-528.99264)"
       id="text54789"
       style="font-size:14.6667px;font-family:Cantarell;-inkscape-font-specification:Cantarell;text-align:start;white-space:pre;shape-inside:url(#rect54857);display:inline;fill:#ffffff;fill-opacity:1;stroke:#2e3436;stroke-width:0;stroke-dasharray:none"
       x="34.269989"
       y="0"><tspan
         x="812.59011"
         y="2354.456"
         id="tspan82079"><tspan
           style="text-align:center;text-anchor:middle"
           id="tspan82077">The system will restart automatically in 60 seconds.</tspan></tspan></text>
    <path
       id="path54791"
       style="display:inline;fill:none;stroke:#3f72b0;stroke-width:0.529166"
       d="m 18.521356,104.24534 h 53.44585 2.38125 v 8.73122 2.38125 h -55.8271 c -1.31921,0 -2.38125,-1.06204 -2.38125,-2.38125 v -8.73122 z"
       sodipodi:nodetypes="cccccsscc" />
    <text
       xml:space="preserve"
       transform="matrix(0.26458333,0,0,0.26458333,-214.18781,-511.52901)"
       id="text54795"
       style="font-size:14.6667px;font-family:Cantarell;-inkscape-font-specification:Cantarell;text-align:start;white-space:pre;shape-inside:url(#rect54859);display:inline;fill:#ffffff;fill-opacity:1;stroke:#2e3436;stroke-width:0;stroke-dasharray:none"
       x="34.269989"
       y="0"><tspan
         x="957.70974"
         y="2354.456"
         id="tspan82083"><tspan
           style="font-weight:bold;text-align:center;text-anchor:middle"
           id="tspan82081">Cancel</tspan></tspan></text>
    <text
       xml:space="preserve"
       transform="matrix(0.26458333,0,0,0.26458333,-155.75763,-511.52901)"
       id="text54799"
       style="font-size:14.6667px;font-family:Cantarell;-inkscape-font-specification:Cantarell;text-align:start;white-space:pre;shape-inside:url(#rect54861);display:inline;fill:#ffffff;fill-opacity:1;stroke:#2e3436;stroke-width:0;stroke-dasharray:none"
       x="34.269989"
       y="0"><tspan
         x="955.52442"
         y="2354.456"
         id="tspan82087"><tspan
           style="font-weight:bold;text-align:center;text-anchor:middle"
           id="tspan82085">Restart</tspan></tspan></text>
    <path
       style="fill:#525252;fill-opacity:1;stroke:#303030;stroke-width:0.264582;stroke-dasharray:none;stroke-opacity:1"
       d="m 397.14025,280.59014 h 95.24997"
       id="path54817" />
    <text
       inkscape:export-ydpi="90"
       inkscape:export-xdpi="90"
       inkscape:export-filename="/home/aday/Dropbox/Public/settings/sound.png"
       id="text76936"
       y="24.154671"
       x="15.848161"
       style="font-style:normal;font-variant:normal;font-weight:normal;font-stretch:normal;font-size:9.87778px;line-height:0%;font-family:Cantarell;-inkscape-font-specification:Cantarell;text-align:start;letter-spacing:0px;word-spacing:0px;text-anchor:start;display:inline;fill:#2e3436;fill-opacity:1;stroke:none;stroke-width:0.264583"
       xml:space="preserve"><tspan
         y="24.154671"
         x="15.848161"
         id="tspan76934"
         sodipodi:role="line"
         style="font-style:normal;font-variant:normal;font-weight:800;font-stretch:normal;font-size:9.87778px;line-height:1.25;font-family:Cantarell;-inkscape-font-specification:'Cantarell Ultra-Bold';text-align:start;text-anchor:start;stroke-width:0.264583">System Restart Dialog</tspan></text>
    <text
       inkscape:export-ydpi="90"
       inkscape:export-xdpi="90"
       inkscape:export-filename="/home/aday/Dropbox/Public/settings/sound.png"
       id="text76940"
       y="37.384892"
       x="15.848161"
       style="font-style:normal;font-variant:normal;font-weight:normal;font-stretch:normal;font-size:3.88056px;line-height:1.45;font-family:Cantarell;-inkscape-font-specification:Cantarell;text-align:start;letter-spacing:0px;word-spacing:0px;text-anchor:start;white-space:pre;inline-size:115.494;display:inline;fill:#2e3436;fill-opacity:1;stroke:none;stroke-width:0.264583"
       xml:space="preserve"><tspan
         x="15.848161"
         y="37.384892"
         id="tspan82089">An experiment to see what exposing boot next options in the </tspan><tspan
         x="15.848161"
         y="43.011703"
         id="tspan82091">system restart dialog might look like.</tspan></text>
    <rect
       inkscape:export-ydpi="90"
       inkscape:export-xdpi="90"
       style="display:inline;fill:#303030;fill-opacity:1;stroke:#fafafa;stroke-width:0;stroke-miterlimit:4;stroke-dasharray:none;stroke-opacity:1"
       id="rect78290"
       width="117.21043"
       height="75.670837"
       x="148.16693"
       y="69.849998"
       rx="2.3812499"
       ry="2.3812499" />
    <path
       id="path78292"
       style="display:inline;fill:#525252;fill-opacity:1;stroke:#fafafa;stroke-width:0"
       d="m 265.3777,142.60997 v 9.26041 c 0,1.31921 -1.06203,2.38125 -2.38125,2.38125 H 150.54848 c -1.31922,0 -2.38125,-1.06204 -2.38125,-2.38125 v -9.26041 z"
       sodipodi:nodetypes="csssscc" />
    <text
       xml:space="preserve"
       transform="matrix(0.26458333,0,0,0.26458333,-8.4066043,-540.54094)"
       id="text78298"
       style="font-size:21.3333px;font-family:Cantarell;-inkscape-font-specification:Cantarell;text-align:start;white-space:pre;shape-inside:url(#rect78384);display:inline;fill:#ffffff;fill-opacity:1;stroke:#2e3436;stroke-width:0;stroke-dasharray:none"
       x="34.269989"
       y="0"><tspan
         x="775.24471"
         y="2360.4427"
         id="tspan82095"><tspan
           style="font-weight:800;-inkscape-font-specification:'Cantarell Ultra-Bold';text-align:center;text-anchor:middle"
           id="tspan82093">Restart</tspan></tspan></text>
    <text
       xml:space="preserve"
       transform="matrix(0.26458333,0,0,0.26458333,-52.475317,-528.99264)"
       id="text78304"
       style="font-size:14.6667px;font-family:Cantarell;-inkscape-font-specification:Cantarell;text-align:start;white-space:pre;shape-inside:url(#rect78386);display:inline;fill:#ffffff;fill-opacity:1;stroke:#2e3436;stroke-width:0;stroke-dasharray:none"
       x="34.269989"
       y="0"><tspan
         x="812.59011"
         y="2354.456"
         id="tspan82099"><tspan
           style="text-align:center;text-anchor:middle"
           id="tspan82097">The system will restart automatically in 60 seconds.</tspan></tspan></text>
    <path
       id="path78306"
       style="display:inline;fill:none;stroke:#3f72b0;stroke-width:0.529166"
       d="m 150.81306,142.87453 h 53.44588 2.38125 v 8.73123 2.38125 h -55.82713 c -1.31921,0 -2.38125,-1.06204 -2.38125,-2.38125 v -8.73123 z"
       sodipodi:nodetypes="cccccsscc" />
    <text
       xml:space="preserve"
       transform="matrix(0.26458333,0,0,0.26458333,-81.896072,-472.89981)"
       id="text78312"
       style="font-size:14.6667px;font-family:Cantarell;-inkscape-font-specification:Cantarell;text-align:start;white-space:pre;shape-inside:url(#rect78388);display:inline;fill:#ffffff;fill-opacity:1;stroke:#2e3436;stroke-width:0;stroke-dasharray:none"
       x="34.269989"
       y="0"><tspan
         x="957.70974"
         y="2354.456"
         id="tspan82103"><tspan
           style="font-weight:bold;text-align:center;text-anchor:middle"
           id="tspan82101">Cancel</tspan></tspan></text>
    <text
       xml:space="preserve"
       transform="matrix(0.26458333,0,0,0.26458333,-23.465925,-472.89981)"
       id="text78318"
       style="font-size:14.6667px;font-family:Cantarell;-inkscape-font-specification:Cantarell;text-align:start;white-space:pre;shape-inside:url(#rect78390);display:inline;fill:#ffffff;fill-opacity:1;stroke:#2e3436;stroke-width:0;stroke-dasharray:none"
       x="34.269989"
       y="0"><tspan
         x="955.52442"
         y="2354.456"
         id="tspan82107"><tspan
           style="font-weight:bold;text-align:center;text-anchor:middle"
           id="tspan82105">Restart</tspan></tspan></text>
    <text
       inkscape:export-ydpi="90"
       inkscape:export-xdpi="90"
       inkscape:export-filename="/home/aday/Dropbox/Public/settings/sound.png"
       id="text78410"
       y="37.384892"
       x="15.848161"
       style="font-style:normal;font-variant:normal;font-weight:normal;font-stretch:normal;font-size:3.88056px;line-height:1.45;font-family:Cantarell;-inkscape-font-specification:Cantarell;text-align:start;letter-spacing:0px;word-spacing:0px;text-anchor:start;white-space:pre;inline-size:115.494;display:inline;fill:#2e3436;fill-opacity:1;stroke:none;stroke-width:0.264583"
       xml:space="preserve"
       transform="translate(0,25.929164)"><tspan
         x="15.848161"
         y="37.384892"
         id="tspan82111"><tspan
           style="font-weight:bold"
           id="tspan82109">Plain dialog with no options</tspan></tspan></text>
    <text
       inkscape:export-ydpi="90"
       inkscape:export-xdpi="90"
       inkscape:export-filename="/home/aday/Dropbox/Public/settings/sound.png"
       id="text78414"
       y="37.384892"
       x="15.848161"
       style="font-style:normal;font-variant:normal;font-weight:normal;font-stretch:normal;font-size:3.88056px;line-height:1.45;font-family:Cantarell;-inkscape-font-specification:Cantarell;text-align:start;letter-spacing:0px;word-spacing:0px;text-anchor:start;white-space:pre;inline-size:115.494;display:inline;fill:#2e3436;fill-opacity:1;stroke:none;stroke-width:0.264583"
       xml:space="preserve"
       transform="translate(132.29169,25.929164)"><tspan
         x="15.848161"
         y="37.384892"
         id="tspan82115"><tspan
           style="font-weight:bold"
           id="tspan82113">With nextboot option</tspan></tspan></text>
    <rect
       inkscape:export-ydpi="90"
       inkscape:export-xdpi="90"
       style="display:inline;fill:#303030;fill-opacity:1;stroke:#fafafa;stroke-width:0;stroke-miterlimit:4;stroke-dasharray:none;stroke-opacity:1"
       id="rect78682"
       width="117.21043"
       height="144.46198"
       x="280.45865"
       y="69.849998"
       rx="2.3812499"
       ry="2.3812499" />
    <path
       id="path78684"
       style="display:inline;fill:#525252;fill-opacity:1;stroke:#fafafa;stroke-width:0"
       d="m 397.66945,210.34337 v 9.26041 c 0,1.31921 -1.06203,2.38125 -2.38125,2.38125 H 282.84023 c -1.31922,0 -2.38125,-1.06204 -2.38125,-2.38125 v -9.26041 z"
       sodipodi:nodetypes="csssscc" />
    <text
       xml:space="preserve"
       transform="matrix(0.26458333,0,0,0.26458333,123.88508,-540.54094)"
       id="text78690"
       style="font-size:21.3333px;font-family:Cantarell;-inkscape-font-specification:Cantarell;text-align:start;white-space:pre;shape-inside:url(#rect78776);display:inline;fill:#ffffff;fill-opacity:1;stroke:#2e3436;stroke-width:0;stroke-dasharray:none"
       x="34.269989"
       y="0"><tspan
         x="775.24471"
         y="2360.4427"
         id="tspan82119"><tspan
           style="font-weight:800;-inkscape-font-specification:'Cantarell Ultra-Bold';text-align:center;text-anchor:middle"
           id="tspan82117">Restart</tspan></tspan></text>
    <text
       xml:space="preserve"
       transform="matrix(0.26458333,0,0,0.26458333,79.816357,-528.99264)"
       id="text78696"
       style="font-size:14.6667px;font-family:Cantarell;-inkscape-font-specification:Cantarell;text-align:start;white-space:pre;shape-inside:url(#rect78778);display:inline;fill:#ffffff;fill-opacity:1;stroke:#2e3436;stroke-width:0;stroke-dasharray:none"
       x="34.269989"
       y="0"><tspan
         x="812.59011"
         y="2354.456"
         id="tspan82123"><tspan
           style="text-align:center;text-anchor:middle"
           id="tspan82121">The system will restart automatically in 60 seconds.</tspan></tspan></text>
    <path
       id="path78698"
       style="display:inline;fill:none;stroke:#3f72b0;stroke-width:0.529166"
       d="m 283.10481,210.60793 h 53.44588 2.38125 v 8.73123 2.38125 h -55.82713 c -1.31921,0 -2.38125,-1.06204 -2.38125,-2.38125 v -8.73123 z"
       sodipodi:nodetypes="cccccsscc" />
    <text
       xml:space="preserve"
       transform="matrix(0.26458333,0,0,0.26458333,50.395602,-405.16641)"
       id="text78704"
       style="font-size:14.6667px;font-family:Cantarell;-inkscape-font-specification:Cantarell;text-align:start;white-space:pre;shape-inside:url(#rect78780);display:inline;fill:#ffffff;fill-opacity:1;stroke:#2e3436;stroke-width:0;stroke-dasharray:none"
       x="34.269989"
       y="0"><tspan
         x="957.70974"
         y="2354.456"
         id="tspan82127"><tspan
           style="font-weight:bold;text-align:center;text-anchor:middle"
           id="tspan82125">Cancel</tspan></tspan></text>
    <text
       xml:space="preserve"
       transform="matrix(0.26458333,0,0,0.26458333,108.82575,-405.16641)"
       id="text78710"
       style="font-size:14.6667px;font-family:Cantarell;-inkscape-font-specification:Cantarell;text-align:start;white-space:pre;shape-inside:url(#rect78782);display:inline;fill:#ffffff;fill-opacity:1;stroke:#2e3436;stroke-width:0;stroke-dasharray:none"
       x="34.269989"
       y="0"><tspan
         x="955.52442"
         y="2354.456"
         id="tspan82131"><tspan
           style="font-weight:bold;text-align:center;text-anchor:middle"
           id="tspan82129">Restart</tspan></tspan></text>
    <rect
       style="fill:#3a3a3a;fill-opacity:1;stroke:#3a3a3a;stroke-width:0.529167;stroke-dasharray:none;stroke-opacity:1"
       id="rect78712"
       width="95.250038"
       height="13.229162"
       x="291.30673"
       y="152.39958"
       rx="2.3812499"
       ry="2.3812499" />
    <text
       xml:space="preserve"
       transform="matrix(0.26458333,0,0,0.26458333,103.62885,-462.58146)"
       id="text78718"
       style="font-size:14.6667px;font-family:Cantarell;-inkscape-font-specification:Cantarell;text-align:start;white-space:pre;shape-inside:url(#rect78784);display:inline;fill:#ffffff;fill-opacity:1;stroke:#2e3436;stroke-width:0;stroke-dasharray:none"
       x="116.26417"
       y="0"><tspan
         x="726.17773"
         y="2354.456"
         id="tspan82135"><tspan
           style="font-weight:bold"
           id="tspan82133">Install Software Updates</tspan></tspan></text>
    <rect
       style="fill:#3a3a3a;fill-opacity:1;stroke:#3a3a3a;stroke-width:0.529168;stroke-dasharray:none;stroke-opacity:1"
       id="rect78720"
       width="95.250038"
       height="20.637501"
       x="291.30673"
       y="102.65814"
       rx="2.3812499"
       ry="2.3812499" />
    <text
       xml:space="preserve"
       transform="matrix(0.26458333,0,0,0.26458333,103.62885,-512.32284)"
       id="text78726"
       style="font-size:14.6667px;font-family:Cantarell;-inkscape-font-specification:Cantarell;text-align:start;white-space:pre;shape-inside:url(#rect78786);display:inline;fill:#ffffff;fill-opacity:1;stroke:#2e3436;stroke-width:0;stroke-dasharray:none"
       x="116.26417"
       y="0"><tspan
         x="726.17773"
         y="2354.456"
         id="tspan82139"><tspan
           style="font-weight:bold"
           id="tspan82137">1 App is Blocking Restart</tspan></tspan></text>
    <rect
       style="fill:#3a3a3a;fill-opacity:1;stroke:#3a3a3a;stroke-width:0.529166;stroke-dasharray:none;stroke-opacity:1"
       id="rect78728"
       width="95.250038"
       height="20.637501"
       x="291.30673"
       y="127.52898"
       rx="2.3812499"
       ry="2.3812499" />
    <text
       xml:space="preserve"
       transform="matrix(0.26458333,0,0,0.26458333,103.62885,-487.452)"
       id="text78734"
       style="font-size:14.6667px;font-family:Cantarell;-inkscape-font-specification:Cantarell;text-align:start;white-space:pre;shape-inside:url(#rect78788);display:inline;fill:#ffffff;fill-opacity:1;stroke:#2e3436;stroke-width:0;stroke-dasharray:none"
       x="116.26417"
       y="0"><tspan
         x="726.17773"
         y="2354.456"
         id="tspan82143"><tspan
           style="font-weight:bold"
           id="tspan82141">Another User is Logged In</tspan></tspan></text>
    <rect
       ry="3.3072915"
       rx="3.3072913"
       y="155.70686"
       x="369.09406"
       height="6.614583"
       width="12.700008"
       id="rect78736"
       style="fill:#000000;fill-opacity:0.152941;stroke:none;stroke-width:0.264583;stroke-linecap:round;stroke-miterlimit:4;stroke-dasharray:none;stroke-opacity:1" />
    <g
       id="g78740"
       transform="matrix(-0.26458334,0,0,0.26458334,2057.8301,-172.83709)"
       style="fill:#3584e4;fill-opacity:1">
      <rect
         ry="12.499999"
         rx="12.499998"
         y="1241.7408"
         x="-6382.6094"
         height="24.999998"
         width="48.000031"
         id="rect78738"
         style="fill:#3584e4;fill-opacity:1;stroke:none;stroke-width:1;stroke-linecap:round;stroke-miterlimit:4;stroke-dasharray:none;stroke-opacity:1"
         transform="scale(-1,1)" />
    </g>
    <rect
       ry="2.5887942"
       rx="2.588845"
       y="156.48227"
       x="375.82263"
       height="5.1776214"
       width="5.1777225"
       id="rect78742"
       style="fill:#ffffff;fill-opacity:1;stroke:none;stroke-width:0.264583;stroke-linecap:round;stroke-miterlimit:4;stroke-dasharray:none;stroke-opacity:1" />
    <rect
       style="fill:#3a3a3a;fill-opacity:1;stroke:#3a3a3a;stroke-width:0.529167;stroke-dasharray:none;stroke-opacity:1"
       id="rect78744"
       width="95.250038"
       height="30.691666"
       x="291.30673"
       y="169.86194"
       rx="2.3812499"
       ry="2.3812499" />
    <text
       xml:space="preserve"
       transform="matrix(0.26458333,0,0,0.26458333,103.62885,-436.38752)"
       id="text78748"
       style="font-size:14.6667px;font-family:Cantarell;-inkscape-font-specification:Cantarell;text-align:start;white-space:pre;shape-inside:url(#rect78790);display:inline;fill:#ffffff;fill-opacity:1;stroke:#2e3436;stroke-width:0;stroke-dasharray:none"
       x="116.26417"
       y="0"><tspan
         x="726.17773"
         y="2354.456"
         id="tspan82145">Distro A</tspan></text>
    <text
       xml:space="preserve"
       transform="matrix(0.26458333,0,0,0.26458333,103.62885,-428.13742)"
       id="text78752"
       style="font-size:14.6667px;font-family:Cantarell;-inkscape-font-specification:Cantarell;text-align:start;white-space:pre;shape-inside:url(#rect78792);display:inline;fill:#ffffff;fill-opacity:1;stroke:#2e3436;stroke-width:0;stroke-dasharray:none"
       x="116.26417"
       y="0"><tspan
         x="726.17773"
         y="2354.456"
         id="tspan82147">Distro A</tspan></text>
    <g
       inkscape:label="select selected selection check approve done good small"
       id="g78760"
       transform="matrix(0,0.26458334,-0.26458334,0,368.56601,140.19272)">
      <title
         id="title78754">object-select</title>
      <path
         style="fill:#ffffff;fill-opacity:1"
         d="m 167.79479,197.25019 a 1,1 0 0 0 -1.41211,0.0937 1,1 0 0 0 0.0937,1.41211 l 7.19532,6.29687 -2.24415,2.24414 a 1,1 0 0 0 0,1.41407 1,1 0 0 0 1.41602,0 l 3,-3 a 1.0001,1.0001 0 0 0 -0.0488,-1.46094 z"
         id="path78756" />
      <rect
         y="195.00317"
         x="163.1358"
         height="16"
         width="16"
         id="rect78758"
         style="fill:none;fill-opacity:1" />
    </g>
    <text
       xml:space="preserve"
       transform="matrix(0.26458333,0,0,0.26458333,103.62885,-480.5727)"
       id="text78764"
       style="font-size:14.6667px;font-family:Cantarell;-inkscape-font-specification:Cantarell;text-align:start;white-space:pre;shape-inside:url(#rect78794);display:inline;fill:#ffffff;fill-opacity:1;stroke:#2e3436;stroke-width:0;stroke-dasharray:none"
       x="116.26417"
       y="0"><tspan
         x="726.17773"
         y="2354.456"
         id="tspan82149">Angela Avery</tspan></text>
    <text
       xml:space="preserve"
       transform="matrix(0.26458333,0,0,0.26458333,103.62885,-504.91434)"
       id="text78768"
       style="font-size:14.6667px;font-family:Cantarell;-inkscape-font-specification:Cantarell;text-align:start;white-space:pre;shape-inside:url(#rect78796);display:inline;fill:#ffffff;fill-opacity:1;stroke:#2e3436;stroke-width:0;stroke-dasharray:none"
       x="116.26417"
       y="0"><tspan
         x="726.17773"
         y="2354.456"
         id="tspan82151">Text Editor ‒ There are unsaved documents</tspan></text>
    <text
       xml:space="preserve"
       transform="matrix(0.26458333,0,0,0.26458333,103.62885,-445.38332)"
       id="text78774"
       style="font-size:14.6667px;font-family:Cantarell;-inkscape-font-specification:Cantarell;text-align:start;white-space:pre;shape-inside:url(#rect78798);display:inline;fill:#ffffff;fill-opacity:1;stroke:#2e3436;stroke-width:0;stroke-dasharray:none"
       x="116.26417"
       y="0"><tspan
         x="726.17773"
         y="2354.456"
         id="tspan82155"><tspan
           style="font-weight:bold"
           id="tspan82153">System Start Options</tspan></tspan></text>
    <g
       id="g78812"
       transform="translate(0,-64.02884)">
      <rect
         style="fill:#3a3a3a;fill-opacity:1;stroke:#3a3a3a;stroke-width:0.529167;stroke-dasharray:none;stroke-opacity:1"
         id="rect78352"
         width="95.250038"
         height="30.691666"
         x="159.01503"
         y="166.68698"
         rx="2.3812499"
         ry="2.3812499" />
      <text
         xml:space="preserve"
         transform="matrix(0.26458333,0,0,0.26458333,-28.662822,-439.56254)"
         id="text78356"
         style="font-size:14.6667px;font-family:Cantarell;-inkscape-font-specification:Cantarell;text-align:start;white-space:pre;shape-inside:url(#rect78398);display:inline;fill:#ffffff;fill-opacity:1;stroke:#2e3436;stroke-width:0;stroke-dasharray:none"
         x="116.26417"
         y="0"><tspan
           x="726.17773"
           y="2354.456"
           id="tspan82157">Distro A</tspan></text>
      <text
         xml:space="preserve"
         transform="matrix(0.26458333,0,0,0.26458333,-28.662822,-431.31244)"
         id="text78360"
         style="font-size:14.6667px;font-family:Cantarell;-inkscape-font-specification:Cantarell;text-align:start;white-space:pre;shape-inside:url(#rect78400);display:inline;fill:#ffffff;fill-opacity:1;stroke:#2e3436;stroke-width:0;stroke-dasharray:none"
         x="116.26417"
         y="0"><tspan
           x="726.17773"
           y="2354.456"
           id="tspan82159">Distro A</tspan></text>
      <g
         inkscape:label="select selected selection check approve done good small"
         id="g78368"
         transform="matrix(0,0.26458334,-0.26458334,0,236.27426,137.0177)">
        <title
           id="title78362">object-select</title>
        <path
           style="fill:#ffffff;fill-opacity:1"
           d="m 167.79479,197.25019 a 1,1 0 0 0 -1.41211,0.0937 1,1 0 0 0 0.0937,1.41211 l 7.19532,6.29687 -2.24415,2.24414 a 1,1 0 0 0 0,1.41407 1,1 0 0 0 1.41602,0 l 3,-3 a 1.0001,1.0001 0 0 0 -0.0488,-1.46094 z"
           id="path78364" />
        <rect
           y="195.00317"
           x="163.1358"
           height="16"
           width="16"
           id="rect78366"
           style="fill:none;fill-opacity:1" />
      </g>
      <text
         xml:space="preserve"
         transform="matrix(0.26458333,0,0,0.26458333,-28.662822,-448.55834)"
         id="text78382"
         style="font-size:14.6667px;font-family:Cantarell;-inkscape-font-specification:Cantarell;text-align:start;white-space:pre;shape-inside:url(#rect78406);display:inline;fill:#ffffff;fill-opacity:1;stroke:#2e3436;stroke-width:0;stroke-dasharray:none"
         x="116.26417"
         y="0"><tspan
           x="726.17773"
           y="2354.456"
           id="tspan82163"><tspan
             style="font-weight:bold"
             id="tspan82161">System Start Options</tspan></tspan></text>
    </g>
    <text
       inkscape:export-ydpi="90"
       inkscape:export-xdpi="90"
       inkscape:export-filename="/home/aday/Dropbox/Public/settings/sound.png"
       id="text78816"
       y="37.384892"
       x="15.848161"
       style="font-style:normal;font-variant:normal;font-weight:normal;font-stretch:normal;font-size:3.88056px;line-height:1.45;font-family:Cantarell;-inkscape-font-specification:Cantarell;text-align:start;letter-spacing:0px;word-spacing:0px;text-anchor:start;white-space:pre;inline-size:115.494;display:inline;fill:#2e3436;fill-opacity:1;stroke:none;stroke-width:0.264583"
       xml:space="preserve"
       transform="translate(264.58344,25.929164)"><tspan
         x="15.848161"
         y="37.384892"
         id="tspan82167"><tspan
           style="font-weight:bold"
           id="tspan82165">With all the other options too</tspan></tspan></text>
  </g>
</svg>
