<?xml version="1.0" encoding="UTF-8" standalone="no"?>
<!-- Created with Inkscape (http://www.inkscape.org/) -->

<svg
   xmlns:dc="http://purl.org/dc/elements/1.1/"
   xmlns:cc="http://creativecommons.org/ns#"
   xmlns:rdf="http://www.w3.org/1999/02/22-rdf-syntax-ns#"
   xmlns:svg="http://www.w3.org/2000/svg"
   xmlns="http://www.w3.org/2000/svg"
   xmlns:sodipodi="http://sodipodi.sourceforge.net/DTD/sodipodi-0.dtd"
   xmlns:inkscape="http://www.inkscape.org/namespaces/inkscape"
   width="800"
   height="800"
   viewBox="0 0 800 800"
   version="1.1"
   id="svg1323"
   inkscape:version="0.92.4 5da689c313, 2019-01-14"
   sodipodi:docname="hand1.svg">
  <defs
     id="defs1317" />
  <sodipodi:namedview
     id="base"
     pagecolor="#ffffff"
     bordercolor="#666666"
     borderopacity="1.0"
     inkscape:pageopacity="0.0"
     inkscape:pageshadow="2"
     inkscape:zoom="1"
     inkscape:cx="126.45606"
     inkscape:cy="474.7486"
     inkscape:document-units="px"
     inkscape:current-layer="layer1"
     showgrid="false"
     units="px" />
  <metadata
     id="metadata1320">
    <rdf:RDF>
      <cc:Work
         rdf:about="">
        <dc:format>image/svg+xml</dc:format>
        <dc:type
           rdf:resource="http://purl.org/dc/dcmitype/StillImage" />
        <dc:title></dc:title>
      </cc:Work>
    </rdf:RDF>
  </metadata>
  <g
     inkscape:label="Layer 1"
     inkscape:groupmode="layer"
     id="layer1"
     transform="translate(0,-85.333325)">
    <path
       style="color:#000000;font-style:normal;font-variant:normal;font-weight:normal;font-stretch:normal;font-size:medium;line-height:normal;font-family:sans-serif;font-variant-ligatures:normal;font-variant-position:normal;font-variant-caps:normal;font-variant-numeric:normal;font-variant-alternates:normal;font-feature-settings:normal;text-indent:0;text-align:start;text-decoration:none;text-decoration-line:none;text-decoration-style:solid;text-decoration-color:#000000;letter-spacing:normal;word-spacing:normal;text-transform:none;writing-mode:lr-tb;direction:ltr;text-orientation:mixed;dominant-baseline:auto;baseline-shift:baseline;text-anchor:start;white-space:normal;shape-padding:0;clip-rule:nonzero;display:inline;overflow:visible;visibility:visible;opacity:1;isolation:auto;mix-blend-mode:normal;color-interpolation:sRGB;color-interpolation-filters:linearRGB;solid-color:#000000;solid-opacity:1;vector-effect:none;fill:#98c1f1;fill-opacity:1;fill-rule:nonzero;stroke:none;stroke-width:27.83713913;stroke-linecap:round;stroke-linejoin:round;stroke-miterlimit:4;stroke-dasharray:none;stroke-dashoffset:0;stroke-opacity:1;color-rendering:auto;image-rendering:auto;shape-rendering:auto;text-rendering:auto;enable-background:accumulate"
       d="m 335.29297,224.07031 v 0.01 c -0.0692,7.8e-4 -0.13588,-0.009 -0.20508,-0.008 -32.55773,0.47957 -58.86517,27.55192 -58.4043,60.11132 l -0.002,-0.19726 V 466.0332 c -9.46431,-6.10229 -20.72168,-9.62865 -32.77148,-9.45117 -32.55774,0.47957 -58.86517,27.55195 -58.4043,60.11133 v 207.05859 a 13.919961,13.919961 0 0 0 13.91797,13.91993 h 167.4707 228.50781 c 38.44363,0 70.44922,-32.04082 70.44922,-70.47657 v -88.21484 -51.26953 l -0.002,0.19726 c 0.47037,-33.22573 -26.92119,-60.6007 -60.14649,-60.11132 a 13.919961,13.919961 0 0 0 -0.0176,0 c -11.33516,0.18193 -21.77165,3.68861 -30.54883,9.5371 v -8.9414 l -0.002,0.20117 c 0.47347,-32.7721 -25.63741,-60.63587 -58.875,-60.12695 -17.95665,0.27454 -33.97939,8.6616 -44.6836,21.57031 C 460.8477,416.73795 444.53977,408.1823 426,408.4668 c -11.31089,0.17293 -21.82708,3.61032 -30.76562,9.3164 V 283.98633 l -0.002,0.19726 c 0.46684,-32.97727 -26.51919,-60.15731 -59.4082,-60.08398 a 13.919961,13.919961 0 0 0 -0.53125,-0.0293 z m 0.20312,27.83594 c 6.7e-4,-1e-5 0.001,1e-5 0.002,0 17.89779,-0.26254 32.15376,13.98491 31.90039,31.88281 a 13.919961,13.919961 0 0 0 -0.002,0.19727 v 238.46289 a 13.919961,13.919961 0 0 0 13.91993,13.91992 h 0.23242 a 13.919961,13.919961 0 0 0 13.91797,-13.91992 v -54.05664 a 13.919961,13.919961 0 0 0 0,-0.20117 c -0.25322,-17.51777 13.44039,-31.62474 30.95898,-31.89258 a 13.919961,13.919961 0 0 0 0.002,0 c 17.91729,-0.27495 30.88083,13.50903 30.61524,31.89258 a 13.919961,13.919961 0 0 0 -0.002,0.20117 v 54.05664 a 13.919961,13.919961 0 0 0 13.91796,13.91992 h 0.84961 a 13.919961,13.919961 0 0 0 13.91797,-13.91992 v -54.05664 a 13.919961,13.919961 0 0 0 -0.002,-0.20117 c -0.25322,-17.51776 13.44235,-31.62474 30.96094,-31.89258 17.91736,-0.27495 30.88083,13.50903 30.61523,31.89258 a 13.919961,13.919961 0 0 0 -0.002,0.20117 v 54.05664 a 13.919961,13.919961 0 0 0 13.91992,13.91992 h 1.60352 a 13.919961,13.919961 0 0 0 13.8457,-12.50195 c 1.68633,-16.47916 13.42922,-27.97532 29.45703,-28.23633 17.89311,-0.2571 32.14396,13.98824 31.89062,31.88281 a 13.919961,13.919961 0 0 0 -0.002,0.19727 v 51.26953 88.21484 c 0,22.63891 -19.98124,42.63867 -42.61133,42.63867 H 366.89453 213.3418 V 516.49609 a 13.919961,13.919961 0 0 0 0,-0.19726 c -0.24801,-17.52105 13.45557,-31.62275 30.97851,-31.88086 17.89874,-0.26363 32.15573,13.9823 31.90235,31.88086 a 13.919961,13.919961 0 0 0 -0.002,0.19726 c 0,33.75736 0.45708,62.2045 0.46094,62.44532 0,1.5e-4 0,0.0389 0,0.0391 10e-6,7.4e-4 0.002,0.22461 0.002,0.22461 a 13.919961,13.919961 0 0 0 27.83594,-0.22461 V 283.98633 a 13.919961,13.919961 0 0 0 -0.002,-0.19727 c -0.248,-17.52035 13.45652,-31.62366 30.97851,-31.88281 z"
       id="path17113"
       inkscape:connector-curvature="0" />
  </g>
</svg>
