<?xml version="1.0" encoding="UTF-8"?>
<svg height="16px" viewBox="0 0 16 16" width="16px" xmlns="http://www.w3.org/2000/svg">
    <g fill="#241f31">
        <path d="m 0 11 h 5 v 5.003906 z m 0 0"/>
        <path d="m 5 11 v -5 l 5 -5 v 5 z m 0 0"/>
        <path d="m 10 11.003906 h 5 v -5.003906 z m 0 0"/>
    </g>
</svg>
