<?xml version="1.0" encoding="UTF-8" standalone="no"?>
<svg
   width="16"
   height="16"
   version="1.1"
   id="svg69"
   sodipodi:docname="favicon.svg"
   inkscape:version="1.3 (0e150ed6c4, 2023-07-21)"
   inkscape:export-filename="/var/home/jimmac/src/git/gnome/GNOME-Release-40/assets/card.png"
   inkscape:export-xdpi="96"
   inkscape:export-ydpi="96"
   xmlns:inkscape="http://www.inkscape.org/namespaces/inkscape"
   xmlns:sodipodi="http://sodipodi.sourceforge.net/DTD/sodipodi-0.dtd"
   xmlns="http://www.w3.org/2000/svg"
   xmlns:svg="http://www.w3.org/2000/svg"
   xmlns:rdf="http://www.w3.org/1999/02/22-rdf-syntax-ns#"
   xmlns:cc="http://creativecommons.org/ns#"
   xmlns:dc="http://purl.org/dc/elements/1.1/">
  <metadata
     id="metadata75">
    <rdf:RDF>
      <cc:Work
         rdf:about="">
        <dc:format>image/svg+xml</dc:format>
        <dc:type
           rdf:resource="http://purl.org/dc/dcmitype/StillImage" />
        <dc:title />
      </cc:Work>
    </rdf:RDF>
  </metadata>
  <defs
     id="defs73">
    <filter
       id="alpha-to-white"
       x="0"
       y="0"
       width="1"
       height="1">
      <feColorMatrix
         in="SourceGraphic"
         type="matrix"
         values="0 0 0 0 1 0 0 0 0 1 0 0 0 0 1 0 0 0 1 0"
         id="feColorMatrix2" />
    </filter>
  </defs>
  <sodipodi:namedview
     pagecolor="#ffffff"
     bordercolor="#666666"
     borderopacity="1"
     objecttolerance="10"
     gridtolerance="10"
     guidetolerance="10"
     inkscape:pageopacity="0"
     inkscape:pageshadow="2"
     inkscape:window-width="640"
     inkscape:window-height="480"
     id="namedview71"
     showgrid="true"
     inkscape:current-layer="svg69"
     inkscape:document-rotation="0"
     borderlayer="true"
     inkscape:showpageshadow="false"
     showborder="false"
     inkscape:pagecheckerboard="1"
     inkscape:deskcolor="#d1d1d1">
    <inkscape:grid
       type="xygrid"
       id="grid111"
       originx="0"
       originy="0"
       spacingy="1"
       spacingx="1"
       units="px"
       visible="true" />
  </sodipodi:namedview>
  <rect
     style="fill:#4a86cf;fill-opacity:1;stroke:none;stroke-width:0.0222308;stop-color:#000000"
     id="rect77"
     width="16"
     height="16"
     x="0"
     y="0"
     rx="8"
     ry="8" />
  <g
     id="use3"
     style="stroke-width:13.8931;filter:url(#alpha-to-white)"
     transform="matrix(0.57582664,0,0,0.57582664,3.3562636,3.3683718)">
    <svg
       height="16"
       viewBox="0 0 16 16"
       width="16"
       version="1.1"
       id="svg4"
       style="stroke-width:13.8931">
      <path
         d="m 6.992188,1 v 1.980469 h 2 c 0.484374,0 0.984374,0.394531 1,0.972656 v 8.058594 c -0.015626,0.582031 -0.515626,0.976562 -1,0.976562 h -2 v 2 h 2.984374 c 0.015626,0 0.03125,0 0.050782,-0.0039 0.472656,-0.01953 0.902344,-0.394531 0.957031,-0.894531 0.05469,0.511718 0.503906,0.894531 0.996094,0.894531 h 0.03125 2.976562 v -2 h -1.996093 c -0.488282,0 -0.988282,-0.390625 -1,-0.972656 v -8.0586 c 0.01172,-0.578125 0.511718,-0.972656 1,-0.972656 h 1.988281 V 1 h -2.96875 C 12,1 11.988281,1 11.980469,1 11.488281,1 11.039062,1.382812 10.984375,1.894531 10.929688,1.394531 10.5,1.019531 10.027344,1 10.007812,1 9.992188,1 9.976562,1 Z m 0,0"
         id="path1"
         style="stroke-width:13.8931" />
      <path
         d="m 5.058594,12.285156 c 0.914062,0 1.957031,-0.242187 2.601562,-0.59375 L 7.199219,10.171875 c -0.488281,0.171875 -1.105469,0.269531 -1.628907,0.269531 -1.6875,0 -2.660156,-0.996094 -2.660156,-2.636718 0,-1.542969 0.863282,-2.332032 2.394532,-2.332032 0.652343,0 1.417968,0.121094 1.878906,0.316406 L 7.769531,4.136719 C 6.953125,3.785156 6.164062,3.617188 5.328125,3.617188 c -2.707031,0 -4.601563,1.746093 -4.601563,4.394531 0,2.5625 1.773438,4.273437 4.332032,4.273437 z m 0,0"
         id="path4"
         style="stroke-width:13.8931" />
    </svg>
  </g>
</svg>
