<?xml version="1.0" encoding="UTF-8" standalone="no"?>
<svg
   xmlns:dc="http://purl.org/dc/elements/1.1/"
   xmlns:cc="http://creativecommons.org/ns#"
   xmlns:rdf="http://www.w3.org/1999/02/22-rdf-syntax-ns#"
   xmlns:svg="http://www.w3.org/2000/svg"
   xmlns="http://www.w3.org/2000/svg"
   xmlns:xlink="http://www.w3.org/1999/xlink"
   xmlns:sodipodi="http://sodipodi.sourceforge.net/DTD/sodipodi-0.dtd"
   xmlns:inkscape="http://www.inkscape.org/namespaces/inkscape"
   sodipodi:docname="gnome-circle.svg"
   width="1080"
   height="1350"
   viewBox="0 0 1080 1350"
   version="1.1"
   id="svg8"
   inkscape:version="1.0 (4035a4fb49, 2020-05-01)"
   inkscape:export-filename="/var/home/jimmac/SparkleShare/brand/subbrands/gnome-circle/gnome-circle.png"
   inkscape:export-xdpi="96"
   inkscape:export-ydpi="96">
  <defs
     id="defs2">
    <linearGradient
       id="linearGradient12874"
       inkscape:collect="always">
      <stop
         id="stop12870"
         offset="0"
         style="stop-color:#3584e4;stop-opacity:1" />
      <stop
         style="stop-color:#33d17a;stop-opacity:1"
         offset="0.22812541"
         id="stop12880" />
      <stop
         id="stop12882"
         offset="0.4507792"
         style="stop-color:#f6d32d;stop-opacity:1" />
      <stop
         style="stop-color:#e66100;stop-opacity:1"
         offset="0.65643227"
         id="stop12884" />
      <stop
         id="stop12886"
         offset="0.8507629"
         style="stop-color:#e01b24;stop-opacity:1" />
      <stop
         id="stop12872"
         offset="1"
         style="stop-color:#9141ac;stop-opacity:1" />
    </linearGradient>
    <inkscape:path-effect
       effect="spiro"
       id="path-effect853"
       is_visible="true"
       lpeversion="1" />
    <inkscape:path-effect
       lpeversion="1"
       is_visible="true"
       id="path-effect849"
       effect="spiro" />
    <radialGradient
       inkscape:collect="always"
       xlink:href="#linearGradient12874"
       id="radialGradient12878-1"
       cx="584.85468"
       cy="573.7619"
       fx="584.85468"
       fy="573.7619"
       r="92.825592"
       gradientUnits="userSpaceOnUse"
       gradientTransform="matrix(2.1623085,-2.1623085,2.2151679,2.2151681,-2529.6374,142.80187)" />
    <clipPath
       clipPathUnits="userSpaceOnUse"
       id="clipPath13937">
      <ellipse
         style="opacity:1;vector-effect:none;fill:#57e389;fill-opacity:1;stroke-width:15.9521;stroke-linecap:round;stroke-linejoin:miter;stroke-miterlimit:4;stroke-dasharray:none;stroke-dashoffset:0;stroke-opacity:1;stop-color:#000000;stop-opacity:1"
         id="ellipse13939"
         cx="-1029.1083"
         cy="1427.886"
         rx="238.09785"
         ry="244.88539" />
    </clipPath>
  </defs>
  <sodipodi:namedview
     inkscape:guide-bbox="true"
     showguides="true"
     inkscape:window-maximized="0"
     inkscape:window-y="23"
     inkscape:window-x="26"
     inkscape:window-height="1376"
     inkscape:window-width="2560"
     showborder="true"
     id="base"
     pagecolor="#ffffff"
     bordercolor="#383838"
     borderopacity="1"
     inkscape:pageopacity="1"
     inkscape:pageshadow="2"
     inkscape:zoom="0.70710678"
     inkscape:cx="779.95376"
     inkscape:cy="711.00919"
     inkscape:document-units="px"
     inkscape:current-layer="layer1"
     inkscape:document-rotation="0"
     showgrid="false"
     inkscape:showpageshadow="false"
     borderlayer="true"
     units="px"
     fit-margin-top="0"
     fit-margin-left="0"
     fit-margin-right="0"
     fit-margin-bottom="0">
    <sodipodi:guide
       id="guide13029"
       orientation="1,0"
       position="196.96875,-86.554687" />
    <sodipodi:guide
       id="guide13031"
       orientation="1,0"
       position="515.40625,17.000001" />
    <sodipodi:guide
       id="guide13033"
       orientation="1,0"
       position="573.92969,-3.6953118" />
    <sodipodi:guide
       id="guide13037"
       orientation="1,0"
       position="889.21094,-34.570312" />
    <inkscape:grid
       id="grid13039"
       type="xygrid"
       originx="-154.04983"
       originy="-209.36994" />
  </sodipodi:namedview>
  <metadata
     id="metadata5">
    <rdf:RDF>
      <cc:Work
         rdf:about="">
        <dc:format>image/svg+xml</dc:format>
        <dc:type
           rdf:resource="http://purl.org/dc/dcmitype/StillImage" />
        <dc:title />
        <cc:license
           rdf:resource="http://creativecommons.org/licenses/by-sa/4.0/" />
      </cc:Work>
      <cc:License
         rdf:about="http://creativecommons.org/licenses/by-sa/4.0/">
        <cc:permits
           rdf:resource="http://creativecommons.org/ns#Reproduction" />
        <cc:permits
           rdf:resource="http://creativecommons.org/ns#Distribution" />
        <cc:requires
           rdf:resource="http://creativecommons.org/ns#Notice" />
        <cc:requires
           rdf:resource="http://creativecommons.org/ns#Attribution" />
        <cc:permits
           rdf:resource="http://creativecommons.org/ns#DerivativeWorks" />
        <cc:requires
           rdf:resource="http://creativecommons.org/ns#ShareAlike" />
      </cc:License>
    </rdf:RDF>
  </metadata>
  <g
     inkscape:label="Layer 1"
     inkscape:groupmode="layer"
     id="layer1"
     transform="translate(-154.04983,-209.36994)">
    <rect
       style="opacity:1;vector-effect:none;fill:#f6f5f4;fill-opacity:1;stroke-width:4.21449;stroke-linecap:round;stroke-linejoin:miter;stroke-miterlimit:4;stroke-dasharray:none;stroke-dashoffset:0;stroke-opacity:1;stop-color:#000000;stop-opacity:1"
       id="rect12951-4"
       width="318.53717"
       height="148.47046"
       x="350.91888"
       y="764.65466" />
    <g
       id="g13873"
       transform="matrix(0.1522156,0,0,0.1522156,606.33689,726.67526)"
       style="fill:#000000">
      <g
         style="font-style:normal;font-variant:normal;font-weight:900;font-stretch:normal;font-size:224.56px;line-height:1.25;font-family:'Red Hat Display';-inkscape-font-specification:'Red Hat Display, Heavy';font-variant-ligatures:normal;font-variant-caps:normal;font-variant-numeric:normal;font-variant-east-asian:normal;letter-spacing:0px;word-spacing:0px;fill:#000000;fill-opacity:1;stroke:none;stroke-width:5.61399"
         id="text13842"
         aria-label="circle">
        <path
           id="path976"
           style="font-style:normal;font-variant:normal;font-weight:900;font-stretch:normal;font-size:224.56px;font-family:'Red Hat Display';-inkscape-font-specification:'Red Hat Display, Heavy';font-variant-ligatures:normal;font-variant-caps:normal;font-variant-numeric:normal;font-variant-east-asian:normal;letter-spacing:4.30335px;fill:#000000;stroke-width:5.61399"
           d="m -602.07929,863.456 c -16.39288,0 -28.51912,-12.79992 -28.51912,-30.09104 0,-17.29112 11.90168,-30.3156 27.62088,-30.3156 10.55432,0 18.86304,4.26664 27.17176,13.69816 l 22.23144,-23.12968 c -12.3508,-13.92272 -30.76472,-22.00687 -50.30144,-22.00687 -35.48048,0 -62.8768,26.94719 -62.8768,61.75399 0,34.8068 27.39632,61.52944 62.8768,61.52944 18.86304,0 37.0524,-8.08416 49.17864,-21.78232 l -21.55776,-22.456 c -7.8596,8.75784 -15.94376,12.79992 -25.8244,12.79992 z" />
        <path
           id="path978"
           style="font-style:normal;font-variant:normal;font-weight:900;font-stretch:normal;font-size:224.56px;font-family:'Red Hat Display';-inkscape-font-specification:'Red Hat Display, Heavy';font-variant-ligatures:normal;font-variant-caps:normal;font-variant-numeric:normal;font-variant-east-asian:normal;letter-spacing:4.30335px;fill:#000000;stroke-width:5.61399"
           d="m -517.83267,762.85313 c 11.00344,0 19.98584,-8.9824 19.98584,-19.98584 0,-11.00344 -8.9824,-19.98584 -19.98584,-19.98584 -11.00344,0 -19.98584,8.9824 -19.98584,19.98584 0,11.00344 8.9824,19.98584 19.98584,19.98584 z m 18.18936,11.00344 h -36.37872 V 892.6488 h 36.37872 z" />
        <path
           id="path980"
           style="font-style:normal;font-variant:normal;font-weight:900;font-stretch:normal;font-size:224.56px;font-family:'Red Hat Display';-inkscape-font-specification:'Red Hat Display, Heavy';font-variant-ligatures:normal;font-variant-caps:normal;font-variant-numeric:normal;font-variant-east-asian:normal;letter-spacing:4.30335px;fill:#000000;stroke-width:5.61399"
           d="m -472.88417,892.6488 h 36.37872 v -75.45216 c 6.06312,-9.43152 16.16832,-15.04552 27.62088,-15.04552 6.28768,0 12.57536,1.34736 17.29112,3.59296 v -31.66295 c -3.14384,-2.02104 -6.7368,-2.69472 -13.69816,-2.91928 -12.79992,0 -23.35424,5.16487 -31.21384,14.59639 v -11.90167 h -36.37872 z" />
        <path
           id="path982"
           style="font-style:normal;font-variant:normal;font-weight:900;font-stretch:normal;font-size:224.56px;font-family:'Red Hat Display';-inkscape-font-specification:'Red Hat Display, Heavy';font-variant-ligatures:normal;font-variant-caps:normal;font-variant-numeric:normal;font-variant-east-asian:normal;letter-spacing:4.30335px;fill:#000000;stroke-width:5.61399"
           d="m -316.77854,863.456 c -16.39288,0 -28.51912,-12.79992 -28.51912,-30.09104 0,-17.29112 11.90168,-30.3156 27.62088,-30.3156 10.55432,0 18.86304,4.26664 27.17176,13.69816 l 22.23144,-23.12968 c -12.3508,-13.92272 -30.76472,-22.00687 -50.30144,-22.00687 -35.48048,0 -62.87679,26.94719 -62.87679,61.75399 0,34.8068 27.39631,61.52944 62.87679,61.52944 18.86304,0 37.0524,-8.08416 49.17864,-21.78232 l -21.55776,-22.456 c -7.8596,8.75784 -15.94376,12.79992 -25.8244,12.79992 z" />
        <path
           id="path984"
           style="font-style:normal;font-variant:normal;font-weight:900;font-stretch:normal;font-size:224.56px;font-family:'Red Hat Display';-inkscape-font-specification:'Red Hat Display, Heavy';font-variant-ligatures:normal;font-variant-caps:normal;font-variant-numeric:normal;font-variant-east-asian:normal;letter-spacing:4.30335px;fill:#000000;stroke-width:5.61399"
           d="m -214.34256,727.59721 -36.37872,7.8596 V 892.6488 h 36.37872 z" />
        <path
           id="path986"
           style="font-style:normal;font-variant:normal;font-weight:900;font-stretch:normal;font-size:224.56px;font-family:'Red Hat Display';-inkscape-font-specification:'Red Hat Display, Heavy';font-variant-ligatures:normal;font-variant-caps:normal;font-variant-numeric:normal;font-variant-east-asian:normal;letter-spacing:4.30335px;fill:#000000;stroke-width:5.61399"
           d="m -78.671803,876.9296 -24.027917,-21.3332 c -5.614,5.83856 -13.92272,8.9824 -23.80336,8.9824 -13.69816,0 -24.47704,-7.63504 -29.1928,-18.86304 h 84.659117 v -8.9824 c 0,-37.50152 -25.150719,-64.89783 -59.957517,-64.89783 -34.8068,0 -61.97856,26.94719 -61.97856,61.52943 0,34.58224 28.29456,61.52944 64.67328,61.52944 19.76128,0 34.582237,-5.38944 49.627757,-17.9648 z m -52.996157,-75.45216 c 11.67712,0 21.10864,7.41048 24.92616,18.86304 h -49.62776 c 3.59296,-11.90168 12.57536,-18.86304 24.7016,-18.86304 z" />
      </g>
      <g
         style="fill:#000000"
         transform="matrix(2.5905044,0,0,2.5905044,446.62738,-1996.4247)"
         id="g13854">
        <path
           transform="matrix(0.38602521,0,0,0.38602521,-172.40943,770.67026)"
           d="m -992.29492,488.52344 a 246.69238,246.69238 0 0 0 -246.16798,246.69336 246.69238,246.69238 0 0 0 246.69337,246.6914 246.69238,246.69238 0 0 0 246.69141,-246.6914 246.69238,246.69238 0 0 0 -246.69141,-246.69336 246.69238,246.69238 0 0 0 -0.52539,0 z m 0.47461,49.9082 a 196.78428,196.78428 0 0 1 0.0508,0 196.78428,196.78428 0 0 1 196.7832,196.78516 A 196.78428,196.78428 0 0 1 -991.76953,932 196.78428,196.78428 0 0 1 -1188.5547,735.2168 196.78428,196.78428 0 0 1 -991.82031,538.43164 Z"
           style="opacity:1;vector-effect:none;fill:#000000;fill-opacity:1;stroke-width:44.5075;stroke-linecap:round;stroke-linejoin:miter;stroke-miterlimit:4;stroke-dasharray:none;stroke-dashoffset:0;stroke-opacity:1;stop-color:#000000;stop-opacity:1"
           id="circle13844" />
        <path
           transform="matrix(0.38602521,0,0,0.38602521,-172.40943,770.67026)"
           d="m -992.16406,584.42969 a 150.78596,150.78596 0 0 0 -150.39254,150.78711 150.78596,150.78596 0 0 0 150.78707,150.78515 150.78596,150.78596 0 0 0 150.78515,-150.78515 150.78596,150.78596 0 0 0 -150.78515,-150.78711 150.78596,150.78596 0 0 0 -0.39453,0 z m 0.39453,54.00976 a 96.775999,96.775999 0 0 1 96.77539,96.77735 96.775999,96.775999 0 0 1 -96.77539,96.77539 96.775999,96.775999 0 0 1 -96.77737,-96.77539 96.775999,96.775999 0 0 1 96.77737,-96.77735 z"
           style="opacity:1;vector-effect:none;fill:#000000;fill-opacity:1;stroke-width:27.2042;stroke-linecap:round;stroke-linejoin:miter;stroke-miterlimit:4;stroke-dasharray:none;stroke-dashoffset:0;stroke-opacity:1;stop-color:#000000;stop-opacity:1"
           id="circle13850" />
      </g>
      <g
         style="font-style:normal;font-variant:normal;font-weight:normal;font-stretch:normal;font-size:151.355px;line-height:1.25;font-family:'Red Hat Display';-inkscape-font-specification:'Red Hat Display, Normal';font-variant-ligatures:normal;font-variant-caps:normal;font-variant-numeric:normal;font-variant-east-asian:normal;letter-spacing:0px;word-spacing:0px;fill:#000000;fill-opacity:1;stroke:none;stroke-width:3.7839"
         id="text13858"
         aria-label="GNOME">
        <path
           id="path989"
           style="font-style:normal;font-variant:normal;font-weight:normal;font-stretch:normal;font-size:151.355px;font-family:'Red Hat Display';-inkscape-font-specification:'Red Hat Display, Normal';font-variant-ligatures:normal;font-variant-caps:normal;font-variant-numeric:normal;font-variant-east-asian:normal;letter-spacing:2.90051px;fill:#000000;stroke-width:3.7839"
           d="m -556.45941,635.88732 v -4.692 h -49.7958 v 10.29214 h 37.99011 c -1.81626,20.73563 -18.31396,36.02249 -39.80637,36.02249 -24.2168,0 -42.83346,-19.07073 -42.83346,-43.89295 0,-24.82222 18.61666,-43.89295 42.83346,-43.89295 13.01653,0 25.73035,5.44878 33.90352,14.68143 l 7.87046,-8.02181 c -10.29214,-11.04891 -25.42764,-17.40582 -41.77398,-17.40582 -30.57371,0 -54.63915,24.21679 -54.63915,54.63915 0,30.42235 24.2168,54.63915 54.79051,54.63915 29.06016,0 51.4607,-22.8546 51.4607,-52.36883 z" />
        <path
           id="path991"
           style="font-style:normal;font-variant:normal;font-weight:normal;font-stretch:normal;font-size:151.355px;font-family:'Red Hat Display';-inkscape-font-specification:'Red Hat Display, Normal';font-variant-ligatures:normal;font-variant-caps:normal;font-variant-numeric:normal;font-variant-east-asian:normal;letter-spacing:2.90051px;fill:#000000;stroke-width:3.7839"
           d="m -535.54793,580.64275 v 105.9485 h 11.04892 v -88.23996 l 65.08264,88.23996 h 10.29214 v -105.9485 h -11.04891 v 85.96964 l -63.72045,-85.96964 z" />
        <path
           id="path993"
           style="font-style:normal;font-variant:normal;font-weight:normal;font-stretch:normal;font-size:151.355px;font-family:'Red Hat Display';-inkscape-font-specification:'Red Hat Display, Normal';font-variant-ligatures:normal;font-variant-caps:normal;font-variant-numeric:normal;font-variant-east-asian:normal;letter-spacing:2.90051px;fill:#000000;stroke-width:3.7839"
           d="m -318.78304,633.617 c 0,-30.57371 -24.06544,-54.63915 -54.4878,-54.63915 -30.57371,0 -54.63915,24.06544 -54.63915,54.63915 0,30.57371 24.06544,54.63915 54.63915,54.63915 30.42236,0 54.4878,-24.06544 54.4878,-54.63915 z m -11.80569,0 c 0,24.67086 -18.61666,43.89295 -42.68211,43.89295 -24.2168,0 -42.83346,-19.22209 -42.83346,-43.89295 0,-24.82222 18.61666,-43.89295 42.83346,-43.89295 24.06545,0 42.68211,19.07073 42.68211,43.89295 z" />
        <path
           id="path995"
           style="font-style:normal;font-variant:normal;font-weight:normal;font-stretch:normal;font-size:151.355px;font-family:'Red Hat Display';-inkscape-font-specification:'Red Hat Display, Normal';font-variant-ligatures:normal;font-variant-caps:normal;font-variant-numeric:normal;font-variant-east-asian:normal;letter-spacing:2.90051px;fill:#000000;stroke-width:3.7839"
           d="m -245.20004,679.0235 41.47127,-85.06151 v 92.62926 h 11.04891 v -105.9485 h -16.34634 l -36.02249,75.22343 -36.17384,-75.22343 h -16.34634 v 105.9485 h 10.89756 v -92.4779 z" />
        <path
           id="path997"
           style="font-style:normal;font-variant:normal;font-weight:normal;font-stretch:normal;font-size:151.355px;font-family:'Red Hat Display';-inkscape-font-specification:'Red Hat Display, Normal';font-variant-ligatures:normal;font-variant-caps:normal;font-variant-numeric:normal;font-variant-east-asian:normal;letter-spacing:2.90051px;fill:#000000;stroke-width:3.7839"
           d="m -166.47094,686.59125 h 76.434273 v -10.29214 h -64.779943 v -38.14146 h 41.92534 v -10.14079 h -41.92534 v -37.08197 h 64.174523 v -10.29214 h -75.828853 z" />
      </g>
    </g>
    <rect
       style="font-variation-settings:normal;opacity:1;vector-effect:none;fill:#57e389;fill-opacity:1;stroke-width:4.35968;stroke-linecap:round;stroke-linejoin:miter;stroke-miterlimit:4;stroke-dasharray:none;stroke-dashoffset:0;stroke-opacity:1;stop-color:#000000;stop-opacity:1"
       id="rect12921-9"
       width="318.53738"
       height="196.8669"
       x="350.91888"
       y="1184.661" />
    <rect
       y="1184.661"
       x="546.35419"
       height="196.8669"
       width="123.10212"
       id="rect12925-3"
       style="font-variation-settings:normal;opacity:1;vector-effect:none;fill:#33d17a;fill-opacity:1;stroke-width:2.71025;stroke-linecap:round;stroke-linejoin:miter;stroke-miterlimit:4;stroke-dasharray:none;stroke-dashoffset:0;stroke-opacity:1;stop-color:#000000;stop-opacity:1" />
    <rect
       style="font-variation-settings:normal;opacity:1;vector-effect:none;fill:#2ec27e;fill-opacity:1;stroke-width:1.62063;stroke-linecap:round;stroke-linejoin:miter;stroke-miterlimit:4;stroke-dasharray:none;stroke-dashoffset:0;stroke-opacity:1;stop-color:#000000;stop-opacity:1"
       id="rect12927-6"
       width="123.10212"
       height="70.393524"
       x="546.35419"
       y="1311.1346" />
    <rect
       y="1311.1346"
       x="350.91888"
       height="70.393524"
       width="195.4352"
       id="rect12929-2"
       style="font-variation-settings:normal;opacity:1;vector-effect:none;fill:#33d17a;fill-opacity:1;stroke-width:2.042;stroke-linecap:round;stroke-linejoin:miter;stroke-miterlimit:4;stroke-dasharray:none;stroke-dashoffset:0;stroke-opacity:1;stop-color:#000000;stop-opacity:1" />
    <rect
       style="font-variation-settings:normal;opacity:1;vector-effect:none;fill:#26a269;fill-opacity:1;stroke-width:3.13599;stroke-linecap:round;stroke-linejoin:miter;stroke-miterlimit:4;stroke-dasharray:none;stroke-dashoffset:0;stroke-opacity:1;stop-color:#000000;stop-opacity:1"
       id="rect12931-1"
       width="318.53741"
       height="101.86349"
       x="-669.45605"
       y="1381.5281"
       transform="scale(-1,1)" />
    <text
       xml:space="preserve"
       style="font-style:normal;font-variant:normal;font-weight:800;font-stretch:normal;font-size:24.1647px;line-height:1.25;font-family:Cantarell;-inkscape-font-specification:'Cantarell, Ultra-Bold';font-variant-ligatures:normal;font-variant-caps:normal;font-variant-numeric:normal;font-variant-east-asian:normal;letter-spacing:0px;word-spacing:0px;fill:#000000;fill-opacity:1;stroke:none;stroke-width:0.604114"
       x="351.97565"
       y="1163.3358"
       id="text12935-2"><tspan
         sodipodi:role="line"
         id="tspan12933-5"
         x="351.97565"
         y="1163.3358"
         style="stroke-width:0.604114">Color Palette</tspan></text>
    <text
       id="text12949-3"
       y="743.35315"
       x="351.97449"
       style="font-style:normal;font-variant:normal;font-weight:800;font-stretch:normal;font-size:24.1376px;line-height:1.25;font-family:Cantarell;-inkscape-font-specification:'Cantarell, Ultra-Bold';font-variant-ligatures:normal;font-variant-caps:normal;font-variant-numeric:normal;font-variant-east-asian:normal;letter-spacing:0px;word-spacing:0px;fill:#000000;fill-opacity:1;stroke:none;stroke-width:0.603436"
       xml:space="preserve"><tspan
         y="743.35315"
         x="351.97449"
         id="tspan12947-9"
         sodipodi:role="line"
         style="stroke-width:0.603436">Stencils</tspan></text>
    <rect
       y="913.12531"
       x="350.91888"
       height="148.47046"
       width="318.53717"
       id="rect12953-1"
       style="opacity:1;vector-effect:none;fill:#241f31;fill-opacity:1;stroke-width:4.21449;stroke-linecap:round;stroke-linejoin:miter;stroke-miterlimit:4;stroke-dasharray:none;stroke-dashoffset:0;stroke-opacity:1;stop-color:#000000;stop-opacity:1" />
    <text
       id="text13000-8"
       y="290.60571"
       x="351.96729"
       style="font-style:normal;font-variant:normal;font-weight:800;font-stretch:normal;font-size:23.9732px;line-height:1.25;font-family:Cantarell;-inkscape-font-specification:'Cantarell, Ultra-Bold';font-variant-ligatures:normal;font-variant-caps:normal;font-variant-numeric:normal;font-variant-east-asian:normal;letter-spacing:0px;word-spacing:0px;fill:#000000;fill-opacity:1;stroke:none;stroke-width:0.599326"
       xml:space="preserve"><tspan
         y="290.60571"
         x="351.96729"
         id="tspan12998-8"
         sodipodi:role="line"
         style="stroke-width:0.599326">Horizontal</tspan></text>
    <g
       transform="matrix(0.1522156,0,0,0.1522156,606.33689,870.51787)"
       id="g13889"
       style="fill:#ffffff">
      <g
         style="font-style:normal;font-variant:normal;font-weight:900;font-stretch:normal;font-size:224.56px;line-height:1.25;font-family:'Red Hat Display';-inkscape-font-specification:'Red Hat Display, Heavy';font-variant-ligatures:normal;font-variant-caps:normal;font-variant-numeric:normal;font-variant-east-asian:normal;letter-spacing:0px;word-spacing:0px;fill:#ffffff;fill-opacity:1;stroke:none;stroke-width:5.61399"
         id="text13877"
         aria-label="circle">
        <path
           id="path963"
           style="font-style:normal;font-variant:normal;font-weight:900;font-stretch:normal;font-size:224.56px;font-family:'Red Hat Display';-inkscape-font-specification:'Red Hat Display, Heavy';font-variant-ligatures:normal;font-variant-caps:normal;font-variant-numeric:normal;font-variant-east-asian:normal;letter-spacing:4.30335px;fill:#ffffff;stroke-width:5.61399"
           d="m -602.07929,863.456 c -16.39288,0 -28.51912,-12.79992 -28.51912,-30.09104 0,-17.29112 11.90168,-30.3156 27.62088,-30.3156 10.55432,0 18.86304,4.26664 27.17176,13.69816 l 22.23144,-23.12968 c -12.3508,-13.92272 -30.76472,-22.00687 -50.30144,-22.00687 -35.48048,0 -62.8768,26.94719 -62.8768,61.75399 0,34.8068 27.39632,61.52944 62.8768,61.52944 18.86304,0 37.0524,-8.08416 49.17864,-21.78232 l -21.55776,-22.456 c -7.8596,8.75784 -15.94376,12.79992 -25.8244,12.79992 z" />
        <path
           id="path965"
           style="font-style:normal;font-variant:normal;font-weight:900;font-stretch:normal;font-size:224.56px;font-family:'Red Hat Display';-inkscape-font-specification:'Red Hat Display, Heavy';font-variant-ligatures:normal;font-variant-caps:normal;font-variant-numeric:normal;font-variant-east-asian:normal;letter-spacing:4.30335px;fill:#ffffff;stroke-width:5.61399"
           d="m -517.83267,762.85313 c 11.00344,0 19.98584,-8.9824 19.98584,-19.98584 0,-11.00344 -8.9824,-19.98584 -19.98584,-19.98584 -11.00344,0 -19.98584,8.9824 -19.98584,19.98584 0,11.00344 8.9824,19.98584 19.98584,19.98584 z m 18.18936,11.00344 h -36.37872 V 892.6488 h 36.37872 z" />
        <path
           id="path967"
           style="font-style:normal;font-variant:normal;font-weight:900;font-stretch:normal;font-size:224.56px;font-family:'Red Hat Display';-inkscape-font-specification:'Red Hat Display, Heavy';font-variant-ligatures:normal;font-variant-caps:normal;font-variant-numeric:normal;font-variant-east-asian:normal;letter-spacing:4.30335px;fill:#ffffff;stroke-width:5.61399"
           d="m -472.88417,892.6488 h 36.37872 v -75.45216 c 6.06312,-9.43152 16.16832,-15.04552 27.62088,-15.04552 6.28768,0 12.57536,1.34736 17.29112,3.59296 v -31.66295 c -3.14384,-2.02104 -6.7368,-2.69472 -13.69816,-2.91928 -12.79992,0 -23.35424,5.16487 -31.21384,14.59639 v -11.90167 h -36.37872 z" />
        <path
           id="path969"
           style="font-style:normal;font-variant:normal;font-weight:900;font-stretch:normal;font-size:224.56px;font-family:'Red Hat Display';-inkscape-font-specification:'Red Hat Display, Heavy';font-variant-ligatures:normal;font-variant-caps:normal;font-variant-numeric:normal;font-variant-east-asian:normal;letter-spacing:4.30335px;fill:#ffffff;stroke-width:5.61399"
           d="m -316.77854,863.456 c -16.39288,0 -28.51912,-12.79992 -28.51912,-30.09104 0,-17.29112 11.90168,-30.3156 27.62088,-30.3156 10.55432,0 18.86304,4.26664 27.17176,13.69816 l 22.23144,-23.12968 c -12.3508,-13.92272 -30.76472,-22.00687 -50.30144,-22.00687 -35.48048,0 -62.87679,26.94719 -62.87679,61.75399 0,34.8068 27.39631,61.52944 62.87679,61.52944 18.86304,0 37.0524,-8.08416 49.17864,-21.78232 l -21.55776,-22.456 c -7.8596,8.75784 -15.94376,12.79992 -25.8244,12.79992 z" />
        <path
           id="path971"
           style="font-style:normal;font-variant:normal;font-weight:900;font-stretch:normal;font-size:224.56px;font-family:'Red Hat Display';-inkscape-font-specification:'Red Hat Display, Heavy';font-variant-ligatures:normal;font-variant-caps:normal;font-variant-numeric:normal;font-variant-east-asian:normal;letter-spacing:4.30335px;fill:#ffffff;stroke-width:5.61399"
           d="m -214.34256,727.59721 -36.37872,7.8596 V 892.6488 h 36.37872 z" />
        <path
           id="path973"
           style="font-style:normal;font-variant:normal;font-weight:900;font-stretch:normal;font-size:224.56px;font-family:'Red Hat Display';-inkscape-font-specification:'Red Hat Display, Heavy';font-variant-ligatures:normal;font-variant-caps:normal;font-variant-numeric:normal;font-variant-east-asian:normal;letter-spacing:4.30335px;fill:#ffffff;stroke-width:5.61399"
           d="m -78.671803,876.9296 -24.027917,-21.3332 c -5.614,5.83856 -13.92272,8.9824 -23.80336,8.9824 -13.69816,0 -24.47704,-7.63504 -29.1928,-18.86304 h 84.659117 v -8.9824 c 0,-37.50152 -25.150719,-64.89783 -59.957517,-64.89783 -34.8068,0 -61.97856,26.94719 -61.97856,61.52943 0,34.58224 28.29456,61.52944 64.67328,61.52944 19.76128,0 34.582237,-5.38944 49.627757,-17.9648 z m -52.996157,-75.45216 c 11.67712,0 21.10864,7.41048 24.92616,18.86304 h -49.62776 c 3.59296,-11.90168 12.57536,-18.86304 24.7016,-18.86304 z" />
      </g>
      <g
         id="g13883"
         transform="matrix(2.5905044,0,0,2.5905044,446.62738,-1996.4247)"
         style="fill:#ffffff">
        <path
           id="path13879"
           style="opacity:1;vector-effect:none;fill:#ffffff;fill-opacity:1;stroke-width:44.5075;stroke-linecap:round;stroke-linejoin:miter;stroke-miterlimit:4;stroke-dasharray:none;stroke-dashoffset:0;stroke-opacity:1;stop-color:#000000;stop-opacity:1"
           d="m -992.29492,488.52344 a 246.69238,246.69238 0 0 0 -246.16798,246.69336 246.69238,246.69238 0 0 0 246.69337,246.6914 246.69238,246.69238 0 0 0 246.69141,-246.6914 246.69238,246.69238 0 0 0 -246.69141,-246.69336 246.69238,246.69238 0 0 0 -0.52539,0 z m 0.47461,49.9082 a 196.78428,196.78428 0 0 1 0.0508,0 196.78428,196.78428 0 0 1 196.7832,196.78516 A 196.78428,196.78428 0 0 1 -991.76953,932 196.78428,196.78428 0 0 1 -1188.5547,735.2168 196.78428,196.78428 0 0 1 -991.82031,538.43164 Z"
           transform="matrix(0.38602521,0,0,0.38602521,-172.40943,770.67026)" />
        <path
           id="path13881"
           style="opacity:1;vector-effect:none;fill:#ffffff;fill-opacity:1;stroke-width:27.2042;stroke-linecap:round;stroke-linejoin:miter;stroke-miterlimit:4;stroke-dasharray:none;stroke-dashoffset:0;stroke-opacity:1;stop-color:#000000;stop-opacity:1"
           d="m -992.16406,584.42969 a 150.78596,150.78596 0 0 0 -150.39254,150.78711 150.78596,150.78596 0 0 0 150.78707,150.78515 150.78596,150.78596 0 0 0 150.78515,-150.78515 150.78596,150.78596 0 0 0 -150.78515,-150.78711 150.78596,150.78596 0 0 0 -0.39453,0 z m 0.39453,54.00976 a 96.775999,96.775999 0 0 1 96.77539,96.77735 96.775999,96.775999 0 0 1 -96.77539,96.77539 96.775999,96.775999 0 0 1 -96.77737,-96.77539 96.775999,96.775999 0 0 1 96.77737,-96.77735 z"
           transform="matrix(0.38602521,0,0,0.38602521,-172.40943,770.67026)" />
      </g>
      <g
         style="font-style:normal;font-variant:normal;font-weight:normal;font-stretch:normal;font-size:151.355px;line-height:1.25;font-family:'Red Hat Display';-inkscape-font-specification:'Red Hat Display, Normal';font-variant-ligatures:normal;font-variant-caps:normal;font-variant-numeric:normal;font-variant-east-asian:normal;letter-spacing:0px;word-spacing:0px;fill:#ffffff;fill-opacity:1;stroke:none;stroke-width:3.7839"
         id="text13887"
         aria-label="GNOME">
        <path
           id="path952"
           style="font-style:normal;font-variant:normal;font-weight:normal;font-stretch:normal;font-size:151.355px;font-family:'Red Hat Display';-inkscape-font-specification:'Red Hat Display, Normal';font-variant-ligatures:normal;font-variant-caps:normal;font-variant-numeric:normal;font-variant-east-asian:normal;letter-spacing:2.90051px;fill:#ffffff;stroke-width:3.7839"
           d="m -556.45941,635.88732 v -4.692 h -49.7958 v 10.29214 h 37.99011 c -1.81626,20.73563 -18.31396,36.02249 -39.80637,36.02249 -24.2168,0 -42.83346,-19.07073 -42.83346,-43.89295 0,-24.82222 18.61666,-43.89295 42.83346,-43.89295 13.01653,0 25.73035,5.44878 33.90352,14.68143 l 7.87046,-8.02181 c -10.29214,-11.04891 -25.42764,-17.40582 -41.77398,-17.40582 -30.57371,0 -54.63915,24.21679 -54.63915,54.63915 0,30.42235 24.2168,54.63915 54.79051,54.63915 29.06016,0 51.4607,-22.8546 51.4607,-52.36883 z" />
        <path
           id="path954"
           style="font-style:normal;font-variant:normal;font-weight:normal;font-stretch:normal;font-size:151.355px;font-family:'Red Hat Display';-inkscape-font-specification:'Red Hat Display, Normal';font-variant-ligatures:normal;font-variant-caps:normal;font-variant-numeric:normal;font-variant-east-asian:normal;letter-spacing:2.90051px;fill:#ffffff;stroke-width:3.7839"
           d="m -535.54793,580.64275 v 105.9485 h 11.04892 v -88.23996 l 65.08264,88.23996 h 10.29214 v -105.9485 h -11.04891 v 85.96964 l -63.72045,-85.96964 z" />
        <path
           id="path956"
           style="font-style:normal;font-variant:normal;font-weight:normal;font-stretch:normal;font-size:151.355px;font-family:'Red Hat Display';-inkscape-font-specification:'Red Hat Display, Normal';font-variant-ligatures:normal;font-variant-caps:normal;font-variant-numeric:normal;font-variant-east-asian:normal;letter-spacing:2.90051px;fill:#ffffff;stroke-width:3.7839"
           d="m -318.78304,633.617 c 0,-30.57371 -24.06544,-54.63915 -54.4878,-54.63915 -30.57371,0 -54.63915,24.06544 -54.63915,54.63915 0,30.57371 24.06544,54.63915 54.63915,54.63915 30.42236,0 54.4878,-24.06544 54.4878,-54.63915 z m -11.80569,0 c 0,24.67086 -18.61666,43.89295 -42.68211,43.89295 -24.2168,0 -42.83346,-19.22209 -42.83346,-43.89295 0,-24.82222 18.61666,-43.89295 42.83346,-43.89295 24.06545,0 42.68211,19.07073 42.68211,43.89295 z" />
        <path
           id="path958"
           style="font-style:normal;font-variant:normal;font-weight:normal;font-stretch:normal;font-size:151.355px;font-family:'Red Hat Display';-inkscape-font-specification:'Red Hat Display, Normal';font-variant-ligatures:normal;font-variant-caps:normal;font-variant-numeric:normal;font-variant-east-asian:normal;letter-spacing:2.90051px;fill:#ffffff;stroke-width:3.7839"
           d="m -245.20004,679.0235 41.47127,-85.06151 v 92.62926 h 11.04891 v -105.9485 h -16.34634 l -36.02249,75.22343 -36.17384,-75.22343 h -16.34634 v 105.9485 h 10.89756 v -92.4779 z" />
        <path
           id="path960"
           style="font-style:normal;font-variant:normal;font-weight:normal;font-stretch:normal;font-size:151.355px;font-family:'Red Hat Display';-inkscape-font-specification:'Red Hat Display, Normal';font-variant-ligatures:normal;font-variant-caps:normal;font-variant-numeric:normal;font-variant-east-asian:normal;letter-spacing:2.90051px;fill:#ffffff;stroke-width:3.7839"
           d="m -166.47094,686.59125 h 76.434273 v -10.29214 h -64.779943 v -38.14146 h 41.92534 v -10.14079 h -41.92534 v -37.08197 h 64.174523 v -10.29214 h -75.828853 z" />
      </g>
    </g>
    <circle
       r="157.58592"
       cy="490.91187"
       cx="509.53464"
       id="circle2178"
       style="vector-effect:none;fill:#26a269;fill-opacity:1;stroke-width:28.4311;stroke-linecap:round;stroke-linejoin:miter;stroke-miterlimit:4;stroke-dasharray:none;stroke-dashoffset:0;stroke-opacity:1;stop-color:#000000" />
    <circle
       style="vector-effect:none;fill:#2ec27e;fill-opacity:1;stroke-width:22.6792;stroke-linecap:round;stroke-linejoin:miter;stroke-miterlimit:4;stroke-dasharray:none;stroke-dashoffset:0;stroke-opacity:1;stop-color:#000000"
       id="circle2180"
       cx="509.53464"
       cy="490.91187"
       r="125.70486" />
    <circle
       r="96.32135"
       cy="490.91187"
       cx="509.53464"
       id="circle2182"
       style="vector-effect:none;fill:#33d17a;fill-opacity:1;stroke-width:17.3779;stroke-linecap:round;stroke-linejoin:miter;stroke-miterlimit:4;stroke-dasharray:none;stroke-dashoffset:0;stroke-opacity:1;stop-color:#000000" />
    <circle
       style="vector-effect:none;fill:#57e389;fill-opacity:1;stroke-width:11.1533;stroke-linecap:round;stroke-linejoin:miter;stroke-miterlimit:4;stroke-dasharray:none;stroke-dashoffset:0;stroke-opacity:1;stop-color:#000000"
       id="circle2184"
       cx="509.53464"
       cy="490.91187"
       r="61.820053" />
    <circle
       r="31.726709"
       cy="490.91187"
       cx="509.53464"
       id="circle2186"
       style="vector-effect:none;fill:#8ff0a4;fill-opacity:1;stroke-width:5.72401;stroke-linecap:round;stroke-linejoin:miter;stroke-miterlimit:4;stroke-dasharray:none;stroke-dashoffset:0;stroke-opacity:1;stop-color:#000000" />
    <g
       style="font-style:normal;font-variant:normal;font-weight:900;font-stretch:normal;font-size:122.059px;line-height:1.25;font-family:'Red Hat Display';-inkscape-font-specification:'Red Hat Display, Heavy';font-variant-ligatures:normal;font-variant-caps:normal;font-variant-numeric:normal;font-variant-east-asian:normal;letter-spacing:0px;word-spacing:0px;fill:#26a269;fill-opacity:1;stroke:none;stroke-width:3.05145"
       id="text2190"
       aria-label="circle">
      <path
         id="path928"
         style="font-style:normal;font-variant:normal;font-weight:900;font-stretch:normal;font-size:122.059px;font-family:'Red Hat Display';-inkscape-font-specification:'Red Hat Display, Heavy';font-variant-ligatures:normal;font-variant-caps:normal;font-variant-numeric:normal;font-variant-east-asian:normal;letter-spacing:2.33905px;fill:#26a269;fill-opacity:1;stroke-width:3.05145"
         d="m 757.82109,562.64295 c -8.9103,0 -15.50149,-6.95736 -15.50149,-16.35591 0,-9.39854 6.46913,-16.47796 15.01326,-16.47796 5.73677,0 10.25295,2.31912 14.76914,7.4456 l 12.08384,-12.57208 c -6.71325,-7.56766 -16.72209,-11.96178 -27.34122,-11.96178 -19.28532,0 -34.17652,14.64708 -34.17652,33.56622 0,18.91915 14.8912,33.44417 34.17652,33.44417 10.25296,0 20.13974,-4.39412 26.73092,-11.83972 l -11.71766,-12.2059 c -4.27207,4.7603 -8.66619,6.95736 -14.03679,6.95736 z" />
      <path
         id="path930"
         style="font-style:normal;font-variant:normal;font-weight:900;font-stretch:normal;font-size:122.059px;font-family:'Red Hat Display';-inkscape-font-specification:'Red Hat Display, Heavy';font-variant-ligatures:normal;font-variant-caps:normal;font-variant-numeric:normal;font-variant-east-asian:normal;letter-spacing:2.33905px;fill:#26a269;fill-opacity:1;stroke-width:3.05145"
         d="m 803.6131,507.96052 c 5.98089,0 10.86325,-4.88236 10.86325,-10.86325 0,-5.98089 -4.88236,-10.86325 -10.86325,-10.86325 -5.98089,0 -10.86325,4.88236 -10.86325,10.86325 0,5.98089 4.88236,10.86325 10.86325,10.86325 z m 9.88677,5.98089 h -19.77355 v 64.56921 h 19.77355 z" />
      <path
         id="path932"
         style="font-style:normal;font-variant:normal;font-weight:900;font-stretch:normal;font-size:122.059px;font-family:'Red Hat Display';-inkscape-font-specification:'Red Hat Display, Heavy';font-variant-ligatures:normal;font-variant-caps:normal;font-variant-numeric:normal;font-variant-east-asian:normal;letter-spacing:2.33905px;fill:#26a269;fill-opacity:1;stroke-width:3.05145"
         d="m 828.04471,578.51062 h 19.77356 V 537.4988 c 3.2956,-5.12648 8.78825,-8.17796 15.01326,-8.17796 3.41765,0 6.8353,0.73236 9.39854,1.95295 v -17.21032 c -1.70882,-1.09853 -3.66177,-1.46471 -7.4456,-1.58677 -6.95736,0 -12.69413,2.80736 -16.9662,7.93384 v -6.46913 h -19.77356 z" />
      <path
         id="path934"
         style="font-style:normal;font-variant:normal;font-weight:900;font-stretch:normal;font-size:122.059px;font-family:'Red Hat Display';-inkscape-font-specification:'Red Hat Display, Heavy';font-variant-ligatures:normal;font-variant-caps:normal;font-variant-numeric:normal;font-variant-east-asian:normal;letter-spacing:2.33905px;fill:#26a269;fill-opacity:1;stroke-width:3.05145"
         d="m 912.8955,562.64295 c -8.91031,0 -15.5015,-6.95736 -15.5015,-16.35591 0,-9.39854 6.46913,-16.47796 15.01326,-16.47796 5.73677,0 10.25295,2.31912 14.76914,7.4456 l 12.08384,-12.57208 c -6.71325,-7.56766 -16.72208,-11.96178 -27.34122,-11.96178 -19.28532,0 -34.17652,14.64708 -34.17652,33.56622 0,18.91915 14.8912,33.44417 34.17652,33.44417 10.25296,0 20.13974,-4.39412 26.73092,-11.83972 l -11.71766,-12.2059 c -4.27207,4.7603 -8.66619,6.95736 -14.03678,6.95736 z" />
      <path
         id="path936"
         style="font-style:normal;font-variant:normal;font-weight:900;font-stretch:normal;font-size:122.059px;font-family:'Red Hat Display';-inkscape-font-specification:'Red Hat Display, Heavy';font-variant-ligatures:normal;font-variant-caps:normal;font-variant-numeric:normal;font-variant-east-asian:normal;letter-spacing:2.33905px;fill:#26a269;fill-opacity:1;stroke-width:3.05145"
         d="m 968.57428,488.79726 -19.77356,4.27206 v 85.4413 h 19.77356 z" />
      <path
         id="path938"
         style="font-style:normal;font-variant:normal;font-weight:900;font-stretch:normal;font-size:122.059px;font-family:'Red Hat Display';-inkscape-font-specification:'Red Hat Display, Heavy';font-variant-ligatures:normal;font-variant-caps:normal;font-variant-numeric:normal;font-variant-east-asian:normal;letter-spacing:2.33905px;fill:#26a269;fill-opacity:1;stroke-width:3.05145"
         d="m 1042.3177,569.96649 -13.0603,-11.5956 c -3.0514,3.17353 -7.5676,4.88236 -12.9382,4.88236 -7.4456,0 -13.3045,-4.15001 -15.8677,-10.25296 h 46.0162 v -4.88236 c 0,-20.38385 -13.6706,-35.27505 -32.5897,-35.27505 -18.91915,0 -33.68829,14.64708 -33.68829,33.44416 0,18.79709 15.37943,33.44417 35.15299,33.44417 10.7412,0 18.7971,-2.92942 26.975,-9.76472 z m -28.8059,-41.01182 c 6.3471,0 11.4736,4.02794 13.5486,10.25295 h -26.9751 c 1.953,-6.46912 6.8353,-10.25295 13.4265,-10.25295 z" />
    </g>
    <g
       style="font-style:normal;font-variant:normal;font-weight:500;font-stretch:normal;font-size:83.0977px;line-height:1.25;font-family:'Red Hat Display';-inkscape-font-specification:'Red Hat Display, Medium';font-variant-ligatures:normal;font-variant-caps:normal;font-variant-numeric:normal;font-variant-east-asian:normal;letter-spacing:0px;word-spacing:0px;fill:#33d17a;fill-opacity:1;stroke:none;stroke-width:2.07741"
       id="text2194"
       aria-label="GNOME">
      <path
         id="path941"
         style="font-style:normal;font-variant:normal;font-weight:500;font-stretch:normal;font-size:83.0977px;font-family:'Red Hat Display';-inkscape-font-specification:'Red Hat Display, Medium';font-variant-ligatures:normal;font-variant-caps:normal;font-variant-numeric:normal;font-variant-east-asian:normal;letter-spacing:1.59243px;fill:#33d17a;fill-opacity:1;stroke-width:2.07741"
         d="m 782.20575,437.56719 v -2.99152 h -28.50251 v 7.64499 H 773.065 c -1.16336,9.63933 -9.14074,16.61954 -19.44486,16.61954 -12.21536,0 -21.5223,-9.55624 -21.5223,-22.02089 0,-12.46466 9.22384,-21.9378 21.35611,-21.9378 6.73091,0 13.12943,2.82533 17.45051,7.81119 l 5.98304,-5.81684 c -5.65065,-6.31543 -14.20971,-10.05482 -23.43355,-10.05482 -16.95193,0 -30.24757,13.21253 -30.24757,29.99827 0,16.78573 13.37873,29.99827 30.33066,29.99827 16.28715,0 28.66871,-12.63085 28.66871,-29.25039 z" />
      <path
         id="path943"
         style="font-style:normal;font-variant:normal;font-weight:500;font-stretch:normal;font-size:83.0977px;font-family:'Red Hat Display';-inkscape-font-specification:'Red Hat Display, Medium';font-variant-ligatures:normal;font-variant-caps:normal;font-variant-numeric:normal;font-variant-east-asian:normal;letter-spacing:1.59243px;fill:#33d17a;fill-opacity:1;stroke-width:2.07741"
         d="m 792.93885,407.73511 v 58.16839 h 8.22667 v -44.54036 l 33.32218,44.54036 h 7.64499 v -58.16839 h -8.22668 v 43.12771 l -32.4081,-43.12771 z" />
      <path
         id="path945"
         style="font-style:normal;font-variant:normal;font-weight:500;font-stretch:normal;font-size:83.0977px;font-family:'Red Hat Display';-inkscape-font-specification:'Red Hat Display, Medium';font-variant-ligatures:normal;font-variant-caps:normal;font-variant-numeric:normal;font-variant-east-asian:normal;letter-spacing:1.59243px;fill:#33d17a;fill-opacity:1;stroke-width:2.07741"
         d="m 913.69327,436.81931 c 0,-16.78574 -13.37873,-29.99827 -30.33066,-29.99827 -16.95193,0 -30.24757,13.21253 -30.24757,29.99827 0,16.78573 13.29564,29.99827 30.24757,29.99827 16.95193,0 30.33066,-13.21254 30.33066,-29.99827 z m -8.89146,0 c 0,12.38156 -9.30694,21.93779 -21.4392,21.93779 -12.04917,0 -21.35611,-9.55623 -21.35611,-21.93779 0,-12.46466 9.30694,-21.9378 21.35611,-21.9378 12.13226,0 21.4392,9.47314 21.4392,21.9378 z" />
      <path
         id="path947"
         style="font-style:normal;font-variant:normal;font-weight:500;font-stretch:normal;font-size:83.0977px;font-family:'Red Hat Display';-inkscape-font-specification:'Red Hat Display, Medium';font-variant-ligatures:normal;font-variant-caps:normal;font-variant-numeric:normal;font-variant-east-asian:normal;letter-spacing:1.59243px;fill:#33d17a;fill-opacity:1;stroke-width:2.07741"
         d="m 954.42462,461.74862 21.6885,-43.2939 v 47.44878 h 8.22668 v -58.16839 h -11.63368 l -18.1984,37.14467 -18.28149,-37.14467 h -11.63368 v 58.16839 h 8.14357 v -47.36569 z" />
      <path
         id="path949"
         style="font-style:normal;font-variant:normal;font-weight:500;font-stretch:normal;font-size:83.0977px;font-family:'Red Hat Display';-inkscape-font-specification:'Red Hat Display, Medium';font-variant-ligatures:normal;font-variant-caps:normal;font-variant-numeric:normal;font-variant-east-asian:normal;letter-spacing:1.59243px;fill:#33d17a;fill-opacity:1;stroke-width:2.07741"
         d="m 997.73194,465.9035 h 43.21076 v -7.64499 h -34.4855 v -17.9491 h 22.4364 v -7.47879 h -22.4364 V 415.3801 h 34.1532 v -7.64499 h -42.87846 z" />
    </g>
    <circle
       style="vector-effect:none;fill:#26a269;fill-opacity:1;stroke-width:28.4311;stroke-linecap:round;stroke-linejoin:miter;stroke-miterlimit:4;stroke-dasharray:none;stroke-dashoffset:0;stroke-opacity:1;stop-color:#000000"
       id="circle951"
       cx="886.60486"
       cy="924.755"
       r="157.58592" />
    <circle
       r="125.70486"
       cy="924.755"
       cx="886.60486"
       id="circle953"
       style="vector-effect:none;fill:#2ec27e;fill-opacity:1;stroke-width:22.6792;stroke-linecap:round;stroke-linejoin:miter;stroke-miterlimit:4;stroke-dasharray:none;stroke-dashoffset:0;stroke-opacity:1;stop-color:#000000" />
    <circle
       style="vector-effect:none;fill:#33d17a;fill-opacity:1;stroke-width:17.3779;stroke-linecap:round;stroke-linejoin:miter;stroke-miterlimit:4;stroke-dasharray:none;stroke-dashoffset:0;stroke-opacity:1;stop-color:#000000"
       id="circle955"
       cx="886.60486"
       cy="924.755"
       r="96.32135" />
    <circle
       r="61.820053"
       cy="924.755"
       cx="886.60486"
       id="circle957"
       style="vector-effect:none;fill:#57e389;fill-opacity:1;stroke-width:11.1533;stroke-linecap:round;stroke-linejoin:miter;stroke-miterlimit:4;stroke-dasharray:none;stroke-dashoffset:0;stroke-opacity:1;stop-color:#000000" />
    <circle
       style="vector-effect:none;fill:#8ff0a4;fill-opacity:1;stroke-width:5.72401;stroke-linecap:round;stroke-linejoin:miter;stroke-miterlimit:4;stroke-dasharray:none;stroke-dashoffset:0;stroke-opacity:1;stop-color:#000000"
       id="circle959"
       cx="886.60486"
       cy="924.755"
       r="31.726709" />
    <g
       style="font-style:normal;font-variant:normal;font-weight:900;font-stretch:normal;font-size:94.1524px;line-height:1.25;font-family:'Red Hat Display';-inkscape-font-specification:'Red Hat Display, Heavy';font-variant-ligatures:normal;font-variant-caps:normal;font-variant-numeric:normal;font-variant-east-asian:normal;letter-spacing:0px;word-spacing:0px;fill:#26a269;fill-opacity:1;stroke:none;stroke-width:2.35378"
       id="text963"
       aria-label="circle">
      <path
         id="path907"
         style="font-style:normal;font-variant:normal;font-weight:900;font-stretch:normal;font-size:94.1524px;font-family:'Red Hat Display';-inkscape-font-specification:'Red Hat Display, Heavy';font-variant-ligatures:normal;font-variant-caps:normal;font-variant-numeric:normal;font-variant-east-asian:normal;letter-spacing:1.80426px;fill:#26a269;fill-opacity:1;stroke-width:2.35378"
         d="m 791.22456,1241.77 c -6.87313,0 -11.95736,-5.3667 -11.95736,-12.6165 0,-7.2497 4.99008,-12.7105 11.58075,-12.7105 4.42516,0 7.9088,1.7889 11.39244,5.7433 l 9.32109,-9.6977 c -5.17839,-5.8375 -12.89888,-9.227 -21.09014,-9.227 -14.87608,0 -26.36267,11.2983 -26.36267,25.8919 0,14.5937 11.48659,25.7978 26.36267,25.7978 7.9088,0 15.53514,-3.3895 20.61937,-9.1328 l -9.03863,-9.4152 c -3.29533,3.6719 -6.68482,5.3667 -10.82752,5.3667 z" />
      <path
         id="path909"
         style="font-style:normal;font-variant:normal;font-weight:900;font-stretch:normal;font-size:94.1524px;font-family:'Red Hat Display';-inkscape-font-specification:'Red Hat Display, Heavy';font-variant-ligatures:normal;font-variant-caps:normal;font-variant-numeric:normal;font-variant-east-asian:normal;letter-spacing:1.80426px;fill:#26a269;fill-opacity:1;stroke-width:2.35378"
         d="m 826.54703,1199.5897 c 4.61347,0 8.37956,-3.7661 8.37956,-8.3796 0,-4.6135 -3.76609,-8.3795 -8.37956,-8.3795 -4.61347,0 -8.37956,3.766 -8.37956,8.3795 0,4.6135 3.76609,8.3796 8.37956,8.3796 z m 7.62634,4.6134 h -15.25268 v 49.8067 h 15.25268 z" />
      <path
         id="path911"
         style="font-style:normal;font-variant:normal;font-weight:900;font-stretch:normal;font-size:94.1524px;font-family:'Red Hat Display';-inkscape-font-specification:'Red Hat Display, Heavy';font-variant-ligatures:normal;font-variant-caps:normal;font-variant-numeric:normal;font-variant-east-asian:normal;letter-spacing:1.80426px;fill:#26a269;fill-opacity:1;stroke-width:2.35378"
         d="m 845.39279,1254.0098 h 15.25269 v -31.6352 c 2.54212,-3.9544 6.77897,-6.3083 11.58075,-6.3083 2.63626,0 5.27253,0.565 7.24973,1.5065 v -13.2755 c -1.31813,-0.8474 -2.82457,-1.1298 -5.7433,-1.224 -5.36668,0 -9.79184,2.1655 -13.08718,6.1199 v -4.9901 h -15.25269 z" />
      <path
         id="path913"
         style="font-style:normal;font-variant:normal;font-weight:900;font-stretch:normal;font-size:94.1524px;font-family:'Red Hat Display';-inkscape-font-specification:'Red Hat Display, Heavy';font-variant-ligatures:normal;font-variant-caps:normal;font-variant-numeric:normal;font-variant-east-asian:normal;letter-spacing:1.80426px;fill:#26a269;fill-opacity:1;stroke-width:2.35378"
         d="m 910.84395,1241.77 c -6.87312,0 -11.95735,-5.3667 -11.95735,-12.6165 0,-7.2497 4.99007,-12.7105 11.58074,-12.7105 4.42516,0 7.9088,1.7889 11.39244,5.7433 l 9.32109,-9.6977 c -5.17838,-5.8375 -12.89888,-9.227 -21.09014,-9.227 -14.87608,0 -26.36267,11.2983 -26.36267,25.8919 0,14.5937 11.48659,25.7978 26.36267,25.7978 7.9088,0 15.53515,-3.3895 20.61938,-9.1328 l -9.03863,-9.4152 c -3.29534,3.6719 -6.68482,5.3667 -10.82753,5.3667 z" />
      <path
         id="path915"
         style="font-style:normal;font-variant:normal;font-weight:900;font-stretch:normal;font-size:94.1524px;font-family:'Red Hat Display';-inkscape-font-specification:'Red Hat Display, Heavy';font-variant-ligatures:normal;font-variant-caps:normal;font-variant-numeric:normal;font-variant-east-asian:normal;letter-spacing:1.80426px;fill:#26a269;fill-opacity:1;stroke-width:2.35378"
         d="m 953.79277,1184.8078 -15.25269,3.2953 v 65.9067 h 15.25269 z" />
      <path
         id="path917"
         style="font-style:normal;font-variant:normal;font-weight:900;font-stretch:normal;font-size:94.1524px;font-family:'Red Hat Display';-inkscape-font-specification:'Red Hat Display, Heavy';font-variant-ligatures:normal;font-variant-caps:normal;font-variant-numeric:normal;font-variant-east-asian:normal;letter-spacing:1.80426px;fill:#26a269;fill-opacity:1;stroke-width:2.35378"
         d="m 1010.6761,1247.4191 -10.0743,-8.9445 c -2.35382,2.448 -5.83746,3.7661 -9.98016,3.7661 -5.7433,0 -10.26261,-3.2012 -12.23981,-7.9088 h 35.49547 v -3.7661 c 0,-15.7234 -10.5451,-27.21 -25.13871,-27.21 -14.59362,0 -25.98606,11.2983 -25.98606,25.7977 0,14.4995 11.8632,25.7978 27.11589,25.7978 8.28541,0 14.49948,-2.2597 20.80768,-7.5322 z m -22.21997,-31.6352 c 4.89593,0 8.85033,3.107 10.45092,7.9088 h -20.80768 c 1.50644,-4.9901 5.27253,-7.9088 10.35676,-7.9088 z" />
    </g>
    <g
       style="font-style:normal;font-variant:normal;font-weight:500;font-stretch:normal;font-size:64.0988px;line-height:1.25;font-family:'Red Hat Display';-inkscape-font-specification:'Red Hat Display, Medium';font-variant-ligatures:normal;font-variant-caps:normal;font-variant-numeric:normal;font-variant-east-asian:normal;letter-spacing:0px;word-spacing:0px;fill:#33d17a;fill-opacity:1;stroke:none;stroke-width:1.60244"
       id="text967"
       aria-label="GNOME">
      <path
         id="path896"
         style="font-style:normal;font-variant:normal;font-weight:500;font-stretch:normal;font-size:64.0988px;font-family:'Red Hat Display';-inkscape-font-specification:'Red Hat Display, Medium';font-variant-ligatures:normal;font-variant-caps:normal;font-variant-numeric:normal;font-variant-east-asian:normal;letter-spacing:1.22835px;fill:#33d17a;fill-opacity:1;stroke-width:1.60244"
         d="m 810.03401,1145.2906 v -2.3075 h -21.98589 v 5.8971 h 14.93502 c -0.89738,7.4354 -7.05086,12.8197 -14.99912,12.8197 -9.42252,0 -16.60158,-7.3713 -16.60158,-16.9862 0,-9.6148 7.11496,-16.922 16.47339,-16.922 5.192,0 10.12761,2.1793 13.46075,6.0252 l 4.61511,-4.4869 c -4.35872,-4.8715 -10.9609,-7.7559 -18.07586,-7.7559 -13.07616,0 -23.33197,10.1917 -23.33197,23.1396 0,12.948 10.31991,23.1397 23.39607,23.1397 12.56336,0 22.11408,-9.743 22.11408,-22.5628 z" />
      <path
         id="path898"
         style="font-style:normal;font-variant:normal;font-weight:500;font-stretch:normal;font-size:64.0988px;font-family:'Red Hat Display';-inkscape-font-specification:'Red Hat Display, Medium';font-variant-ligatures:normal;font-variant-caps:normal;font-variant-numeric:normal;font-variant-east-asian:normal;letter-spacing:1.22835px;fill:#33d17a;fill-opacity:1;stroke-width:1.60244"
         d="m 818.31317,1122.2792 v 44.8691 h 6.34578 v -34.3569 l 25.70362,34.3569 h 5.89709 v -44.8691 h -6.34578 v 33.2672 l -24.99854,-33.2672 z" />
      <path
         id="path900"
         style="font-style:normal;font-variant:normal;font-weight:500;font-stretch:normal;font-size:64.0988px;font-family:'Red Hat Display';-inkscape-font-specification:'Red Hat Display, Medium';font-variant-ligatures:normal;font-variant-caps:normal;font-variant-numeric:normal;font-variant-east-asian:normal;letter-spacing:1.22835px;fill:#33d17a;fill-opacity:1;stroke-width:1.60244"
         d="m 911.45911,1144.7137 c 0,-12.9479 -10.31991,-23.1396 -23.39606,-23.1396 -13.07616,0 -23.33196,10.1917 -23.33196,23.1396 0,12.948 10.2558,23.1397 23.33196,23.1397 13.07615,0 23.39606,-10.1917 23.39606,-23.1397 z m -6.85857,0 c 0,9.5508 -7.17907,16.9221 -16.53749,16.9221 -9.29433,0 -16.47339,-7.3713 -16.47339,-16.9221 0,-9.6148 7.17906,-16.922 16.47339,-16.922 9.35842,0 16.53749,7.3072 16.53749,16.922 z" />
      <path
         id="path902"
         style="font-style:normal;font-variant:normal;font-weight:500;font-stretch:normal;font-size:64.0988px;font-family:'Red Hat Display';-inkscape-font-specification:'Red Hat Display, Medium';font-variant-ligatures:normal;font-variant-caps:normal;font-variant-numeric:normal;font-variant-east-asian:normal;letter-spacing:1.22835px;fill:#33d17a;fill-opacity:1;stroke-width:1.60244"
         d="m 942.87793,1163.9434 16.72979,-33.3955 v 36.6004 h 6.34578 v -44.8691 h -8.97383 l -14.03764,28.6521 -14.10174,-28.6521 h -8.97383 v 44.8691 h 6.28168 v -36.5363 z" />
      <path
         id="path904"
         style="font-style:normal;font-variant:normal;font-weight:500;font-stretch:normal;font-size:64.0988px;font-family:'Red Hat Display';-inkscape-font-specification:'Red Hat Display, Medium';font-variant-ligatures:normal;font-variant-caps:normal;font-variant-numeric:normal;font-variant-east-asian:normal;letter-spacing:1.22835px;fill:#33d17a;fill-opacity:1;stroke-width:1.60244"
         d="m 976.28376,1167.1483 h 33.33134 v -5.8971 h -26.60097 v -13.8453 h 17.30667 v -5.7689 h -17.30667 v -13.4608 h 26.34457 v -5.897 h -33.07494 z" />
    </g>
    <text
       xml:space="preserve"
       style="font-style:normal;font-variant:normal;font-weight:800;font-stretch:normal;font-size:24.1376px;line-height:1.25;font-family:Cantarell;-inkscape-font-specification:'Cantarell, Ultra-Bold';font-variant-ligatures:normal;font-variant-caps:normal;font-variant-numeric:normal;font-variant-east-asian:normal;letter-spacing:0px;word-spacing:0px;fill:#000000;fill-opacity:1;stroke:none;stroke-width:0.603436"
       x="728.45361"
       y="743.35315"
       id="text971"><tspan
         style="stroke-width:0.603436"
         sodipodi:role="line"
         id="tspan969"
         x="728.45361"
         y="743.35315">Vertical</tspan></text>
    <text
       xml:space="preserve"
       style="font-style:normal;font-variant:normal;font-weight:900;font-stretch:normal;font-size:122.059px;line-height:1.25;font-family:'Red Hat Display';-inkscape-font-specification:'Red Hat Display, Heavy';font-variant-ligatures:normal;font-variant-caps:normal;font-variant-numeric:normal;font-variant-east-asian:normal;letter-spacing:0px;word-spacing:0px;fill:#26a269;fill-opacity:1;stroke:none;stroke-width:3.05145"
       x="1478.3638"
       y="578.51062"
       id="text922"><tspan
         sodipodi:role="line"
         x="1478.3638"
         y="578.51062"
         id="tspan920"
         style="font-style:normal;font-variant:normal;font-weight:900;font-stretch:normal;font-size:122.059px;font-family:'Red Hat Display';-inkscape-font-specification:'Red Hat Display, Heavy';font-variant-ligatures:normal;font-variant-caps:normal;font-variant-numeric:normal;font-variant-east-asian:normal;letter-spacing:2.33905px;fill:#26a269;fill-opacity:1;stroke-width:3.05145">circle</tspan></text>
    <text
       id="text926"
       y="465.9035"
       x="1478.6686"
       style="font-style:normal;font-variant:normal;font-weight:500;font-stretch:normal;font-size:83.0977px;line-height:1.25;font-family:'Red Hat Display';-inkscape-font-specification:'Red Hat Display, Medium';font-variant-ligatures:normal;font-variant-caps:normal;font-variant-numeric:normal;font-variant-east-asian:normal;letter-spacing:0px;word-spacing:0px;fill:#33d17a;fill-opacity:1;stroke:none;stroke-width:2.07741"
       xml:space="preserve"><tspan
         style="font-style:normal;font-variant:normal;font-weight:500;font-stretch:normal;font-size:83.0977px;font-family:'Red Hat Display';-inkscape-font-specification:'Red Hat Display, Medium';font-variant-ligatures:normal;font-variant-caps:normal;font-variant-numeric:normal;font-variant-east-asian:normal;letter-spacing:1.59243px;fill:#33d17a;fill-opacity:1;stroke-width:2.07741"
         id="tspan924"
         y="465.9035"
         x="1478.6686"
         sodipodi:role="line">GNOME</tspan></text>
  </g>
</svg>
