<?xml version="1.0" encoding="UTF-8" standalone="no"?>
<!-- Created with Inkscape (http://www.inkscape.org/) -->

<svg
   width="780"
   height="1100"
   viewBox="0 0 206.37499 291.04167"
   version="1.1"
   id="svg423548"
   inkscape:version="1.2.2 (b0a8486541, 2022-12-01)"
   sodipodi:docname="console-preferences.svg"
   inkscape:export-filename="../console-preferences.png"
   inkscape:export-xdpi="90"
   inkscape:export-ydpi="90"
   xml:space="preserve"
   xmlns:inkscape="http://www.inkscape.org/namespaces/inkscape"
   xmlns:sodipodi="http://sodipodi.sourceforge.net/DTD/sodipodi-0.dtd"
   xmlns="http://www.w3.org/2000/svg"
   xmlns:svg="http://www.w3.org/2000/svg"><sodipodi:namedview
     id="namedview423550"
     pagecolor="#ffffff"
     bordercolor="#000000"
     borderopacity="0.25"
     inkscape:showpageshadow="2"
     inkscape:pageopacity="1"
     inkscape:pagecheckerboard="0"
     inkscape:deskcolor="#d1d1d1"
     inkscape:document-units="px"
     showgrid="false"
     inkscape:zoom="1"
     inkscape:cx="397.5"
     inkscape:cy="523"
     inkscape:window-width="2560"
     inkscape:window-height="1371"
     inkscape:window-x="0"
     inkscape:window-y="0"
     inkscape:window-maximized="1"
     inkscape:current-layer="layer1"><inkscape:grid
       type="xygrid"
       id="grid423991"
       originx="0"
       originy="0" /></sodipodi:namedview><defs
     id="defs423545"><rect
       x="650.00006"
       y="72.242188"
       width="184.52139"
       height="162.75784"
       id="rect426949" /><rect
       x="650.00006"
       y="72.242188"
       width="184.52139"
       height="162.75784"
       id="rect426951" /><rect
       x="650.00006"
       y="72.242188"
       width="184.52139"
       height="162.75784"
       id="rect426953" /><rect
       x="650.00006"
       y="72.242188"
       width="184.52139"
       height="162.75784"
       id="rect427704" /><rect
       x="650.00006"
       y="72.242188"
       width="184.52139"
       height="162.75784"
       id="rect427706" /><rect
       x="650.00006"
       y="72.242188"
       width="184.52139"
       height="162.75784"
       id="rect427708" /><rect
       x="650.00006"
       y="72.242188"
       width="184.52139"
       height="162.75784"
       id="rect427747" /><rect
       x="650.00006"
       y="72.242188"
       width="175.87847"
       height="116.56903"
       id="rect438111" /><rect
       x="650.00006"
       y="72.242188"
       width="175.87847"
       height="116.56903"
       id="rect438239" /><rect
       x="650.00006"
       y="72.242188"
       width="175.87847"
       height="116.56903"
       id="rect438265" /><rect
       x="650.00006"
       y="72.242188"
       width="175.87847"
       height="116.56903"
       id="rect439405" /><rect
       x="650.00006"
       y="72.242188"
       width="175.87847"
       height="116.56903"
       id="rect443154" /><rect
       x="650.00006"
       y="72.242188"
       width="175.87847"
       height="116.56903"
       id="rect443156" /></defs><g
     inkscape:label="Layer 1"
     inkscape:groupmode="layer"
     id="layer1"><rect
       inkscape:export-ydpi="96"
       inkscape:export-xdpi="96"
       style="display:inline;fill:#000000;fill-opacity:0.152861;stroke:#fafafa;stroke-width:0;stroke-miterlimit:4;stroke-dasharray:none;stroke-opacity:1"
       id="rect411389"
       width="164.04086"
       height="240.77081"
       x="21.166668"
       y="33.866665"
       rx="4.7624998"
       ry="4.7624998"
       inkscape:export-filename="/home/aday/Documents/platform-design-blog-post/contacts-mockup.png" /><rect
       inkscape:export-ydpi="90"
       inkscape:export-xdpi="90"
       style="display:inline;fill:#fafafa;fill-opacity:1;stroke:#fafafa;stroke-width:0;stroke-miterlimit:4;stroke-dasharray:none;stroke-opacity:1"
       id="rect411391"
       width="158.75214"
       height="235.46663"
       x="23.8125"
       y="36.525028"
       rx="2.3812499"
       ry="2.3812499" /><path
       id="path411409"
       style="display:inline;fill:#ebebeb;stroke:#fafafa;stroke-width:0"
       d="M 26.190787,36.52489 H 180.1834 c 1.31921,0 2.38125,1.062038 2.38125,2.38125 V 49.22489 H 180.1834 26.190787 23.809537 V 38.90614 c 0,-1.319212 1.062038,-2.38125 2.38125,-2.38125 z"
       sodipodi:nodetypes="sssccccss" /><text
       xml:space="preserve"
       style="font-style:normal;font-variant:normal;font-weight:normal;font-stretch:normal;font-size:3.88056px;line-height:0%;font-family:Cantarell;-inkscape-font-specification:Cantarell;text-align:center;letter-spacing:0px;word-spacing:0px;text-anchor:middle;display:inline;fill:#2e3436;fill-opacity:1;stroke:none;stroke-width:0.264583"
       x="103.09782"
       y="44.289413"
       id="text411429"><tspan
         sodipodi:role="line"
         id="tspan411427"
         x="103.09782"
         y="44.289413"
         style="font-style:normal;font-variant:normal;font-weight:bold;font-stretch:normal;font-size:3.88056px;line-height:1.25;font-family:Cantarell;-inkscape-font-specification:'Cantarell Bold';text-align:center;text-anchor:middle;fill:#2e3436;fill-opacity:1;stroke-width:0.264583">Preferences</tspan></text><g
       id="g411528"
       transform="matrix(0.26458333,0,0,0.26458333,-336.29514,1900.2513)"
       style="display:inline"><circle
         style="fill:#d8d8d8;fill-opacity:1;stroke:#3584e4;stroke-width:0;stroke-miterlimit:4;stroke-dasharray:none"
         id="circle411515"
         cx="1936.0212"
         cy="-7020.0078"
         r="10.999997" /><g
         style="display:inline;fill:#2e3436;fill-opacity:1"
         transform="translate(1868.0245,-7545.9934)"
         id="g411521"><g
           transform="translate(19,-242)"
           id="g411519"
           style="display:inline;fill:#2e3436;fill-opacity:1"><path
             inkscape:connector-curvature="0"
             d="m 45,764 h 1 c 0.01037,-1.2e-4 0.02079,-4.6e-4 0.03125,0 0.254951,0.0112 0.50987,0.12858 0.6875,0.3125 L 49,766.59375 51.3125,764.3125 C 51.578125,764.082 51.759172,764.007 52,764 h 1 v 1 c 0,0.28647 -0.03434,0.55065 -0.25,0.75 l -2.28125,2.28125 2.25,2.25 C 52.906938,770.46942 52.999992,770.7347 53,771 v 1 h -1 c -0.265301,-10e-6 -0.530586,-0.0931 -0.71875,-0.28125 L 49,769.4375 46.71875,771.71875 C 46.530586,771.90694 46.26529,772 46,772 h -1 v -1 c -3e-6,-0.26529 0.09306,-0.53058 0.28125,-0.71875 l 2.28125,-2.25 L 45.28125,765.75 C 45.070508,765.55537 44.97809,765.28075 45,765 Z"
             id="path411517"
             style="color:#bebebe;font-style:normal;font-variant:normal;font-weight:normal;font-stretch:normal;font-size:medium;line-height:normal;font-family:'Andale Mono';-inkscape-font-specification:'Andale Mono';text-indent:0;text-align:start;text-decoration:none;text-decoration-line:none;letter-spacing:normal;word-spacing:normal;text-transform:none;writing-mode:lr-tb;direction:ltr;text-anchor:start;display:inline;overflow:visible;visibility:visible;fill:#2e3436;fill-opacity:1;fill-rule:nonzero;stroke:none;stroke-width:1.78125;marker:none;enable-background:new" /></g></g></g><text
       xml:space="preserve"
       style="font-style:normal;font-variant:normal;font-weight:normal;font-stretch:normal;font-size:8.46667px;line-height:0%;font-family:Cantarell;-inkscape-font-specification:Cantarell;text-align:start;letter-spacing:0px;word-spacing:0px;text-anchor:start;display:inline;fill:#2e3436;fill-opacity:1;stroke:none;stroke-width:0.264583"
       x="21.166666"
       y="22.489576"
       id="text423956"
       inkscape:export-filename="/home/aday/Dropbox/Public/settings/sound.png"
       inkscape:export-xdpi="90"
       inkscape:export-ydpi="90"><tspan
         style="font-style:normal;font-variant:normal;font-weight:800;font-stretch:normal;font-size:8.46667px;line-height:1.25;font-family:Cantarell;-inkscape-font-specification:'Cantarell Ultra-Bold';text-align:start;text-anchor:start;stroke-width:0.264583"
         sodipodi:role="line"
         id="tspan423954"
         x="21.166666"
         y="22.489576">Console Preferences</tspan></text><rect
       style="fill:#ffffff;fill-opacity:1;stroke:#dbdbdb;stroke-width:0;stroke-linecap:round;stroke-linejoin:round"
       id="rect427638"
       width="50.633556"
       height="27.516665"
       x="232.83334"
       y="84.402115"
       rx="3.175"
       ry="3.175" /><rect
       style="fill:#c01c28;fill-opacity:1;stroke:#dbdbdb;stroke-width:0;stroke-linecap:round;stroke-linejoin:round"
       id="rect427640"
       width="4.7624621"
       height="4.7624531"
       x="237.06665"
       y="103.98112"
       rx="3.1750002"
       ry="3.1749995" /><rect
       style="fill:#26a269;fill-opacity:1;stroke:#dbdbdb;stroke-width:0;stroke-linecap:round;stroke-linejoin:round"
       id="rect427642"
       width="4.7624989"
       height="4.7624898"
       x="244.47495"
       y="103.98112"
       rx="3.1750002"
       ry="3.1749995" /><rect
       style="fill:#a2734c;fill-opacity:1;stroke:#dbdbdb;stroke-width:0;stroke-linecap:round;stroke-linejoin:round"
       id="rect427644"
       width="4.7625079"
       height="4.7624993"
       x="251.88324"
       y="103.98112"
       rx="3.175"
       ry="3.1749995" /><rect
       style="fill:#12488b;fill-opacity:1;stroke:#dbdbdb;stroke-width:0;stroke-linecap:round;stroke-linejoin:round"
       id="rect427646"
       width="4.7625079"
       height="4.7624993"
       x="258.76239"
       y="103.98112"
       rx="3.175"
       ry="3.1749995" /><rect
       style="fill:#a347ba;fill-opacity:1;stroke:#dbdbdb;stroke-width:0;stroke-linecap:round;stroke-linejoin:round"
       id="rect427648"
       width="4.7625079"
       height="4.7624993"
       x="266.17072"
       y="103.98112"
       rx="3.175"
       ry="3.1749995" /><rect
       style="fill:#2aa1b3;fill-opacity:1;stroke:#dbdbdb;stroke-width:0;stroke-linecap:round;stroke-linejoin:round"
       id="rect427650"
       width="4.7625079"
       height="4.7624993"
       x="273.57901"
       y="103.98112"
       rx="3.175"
       ry="3.1749995" /><text
       xml:space="preserve"
       transform="matrix(0.26458333,0,0,0.26458333,65.119513,68.857828)"
       id="text427658"
       style="font-style:normal;font-variant:normal;font-weight:normal;font-stretch:normal;font-size:13.3333px;line-height:125%;font-family:monospace;-inkscape-font-specification:monospace;font-variant-numeric:tabular-nums;white-space:pre;shape-inside:url(#rect427704);display:inline;fill:#171421;fill-opacity:1;stroke:#dbdbdb;stroke-width:0;stroke-linecap:round;stroke-linejoin:round"><tspan
         x="650"
         y="84.039033"
         id="tspan446624">The quick brown fox </tspan><tspan
         x="650"
         y="100.70566"
         id="tspan446626">jumps over the lazy </tspan><tspan
         x="650"
         y="117.37228"
         id="tspan446628">dog</tspan></text><rect
       style="fill:#fdf6e3;fill-opacity:1;stroke:#dbdbdb;stroke-width:0;stroke-linecap:round;stroke-linejoin:round"
       id="rect427660"
       width="50.633556"
       height="27.516665"
       x="286.80823"
       y="84.402115"
       rx="3.175"
       ry="3.175" /><rect
       style="fill:#dc322f;fill-opacity:1;stroke:#dbdbdb;stroke-width:0;stroke-linecap:round;stroke-linejoin:round"
       id="rect427662"
       width="4.7624621"
       height="4.7624531"
       x="291.04153"
       y="103.98112"
       rx="3.1750002"
       ry="3.1749995" /><rect
       style="fill:#859900;fill-opacity:1;stroke:#dbdbdb;stroke-width:0;stroke-linecap:round;stroke-linejoin:round"
       id="rect427664"
       width="4.7624989"
       height="4.7624898"
       x="298.44983"
       y="103.98112"
       rx="3.1750002"
       ry="3.1749995" /><rect
       style="fill:#b58900;fill-opacity:1;stroke:#dbdbdb;stroke-width:0;stroke-linecap:round;stroke-linejoin:round"
       id="rect427666"
       width="4.7625079"
       height="4.7624993"
       x="305.85812"
       y="103.98112"
       rx="3.175"
       ry="3.1749995" /><rect
       style="fill:#268bd2;fill-opacity:1;stroke:#dbdbdb;stroke-width:0;stroke-linecap:round;stroke-linejoin:round"
       id="rect427668"
       width="4.7625079"
       height="4.7624993"
       x="312.73727"
       y="103.98112"
       rx="3.175"
       ry="3.1749995" /><rect
       style="fill:#d33682;fill-opacity:1;stroke:#dbdbdb;stroke-width:0;stroke-linecap:round;stroke-linejoin:round"
       id="rect427670"
       width="4.7625079"
       height="4.7624993"
       x="320.1456"
       y="103.98112"
       rx="3.175"
       ry="3.1749995" /><rect
       style="fill:#2aa198;fill-opacity:1;stroke:#dbdbdb;stroke-width:0;stroke-linecap:round;stroke-linejoin:round"
       id="rect427672"
       width="4.7625079"
       height="4.7624993"
       x="327.55389"
       y="103.98112"
       rx="3.175"
       ry="3.1749995" /><text
       xml:space="preserve"
       transform="matrix(0.26458333,0,0,0.26458333,119.09457,68.857828)"
       id="text427680"
       style="font-style:normal;font-variant:normal;font-weight:normal;font-stretch:normal;font-size:13.3333px;line-height:125%;font-family:monospace;-inkscape-font-specification:monospace;font-variant-numeric:tabular-nums;white-space:pre;shape-inside:url(#rect427706);display:inline;fill:#657b83;fill-opacity:1;stroke:#dbdbdb;stroke-width:0;stroke-linecap:round;stroke-linejoin:round"><tspan
         x="650"
         y="84.039033"
         id="tspan446630">The quick brown fox </tspan><tspan
         x="650"
         y="100.70566"
         id="tspan446632">jumps over the lazy </tspan><tspan
         x="650"
         y="117.37228"
         id="tspan446634">dog</tspan></text><rect
       style="fill:#eeeeec;fill-opacity:1;stroke:#dbdbdb;stroke-width:0;stroke-linecap:round;stroke-linejoin:round"
       id="rect427682"
       width="50.633556"
       height="27.516665"
       x="340.78314"
       y="84.402115"
       rx="3.175"
       ry="3.175" /><rect
       style="fill:#cc0000;fill-opacity:1;stroke:#dbdbdb;stroke-width:0;stroke-linecap:round;stroke-linejoin:round"
       id="rect427684"
       width="4.7624621"
       height="4.7624531"
       x="345.01645"
       y="103.98112"
       rx="3.1750002"
       ry="3.1749995" /><rect
       style="fill:#4e9a06;fill-opacity:1;stroke:#dbdbdb;stroke-width:0;stroke-linecap:round;stroke-linejoin:round"
       id="rect427686"
       width="4.7624989"
       height="4.7624898"
       x="352.42471"
       y="103.98112"
       rx="3.1750002"
       ry="3.1749995" /><rect
       style="fill:#c4a000;fill-opacity:1;stroke:#dbdbdb;stroke-width:0;stroke-linecap:round;stroke-linejoin:round"
       id="rect427688"
       width="4.7625079"
       height="4.7624993"
       x="359.83301"
       y="103.98112"
       rx="3.175"
       ry="3.1749995" /><rect
       style="fill:#3465a4;fill-opacity:1;stroke:#dbdbdb;stroke-width:0;stroke-linecap:round;stroke-linejoin:round"
       id="rect427690"
       width="4.7625079"
       height="4.7624993"
       x="366.71216"
       y="103.98112"
       rx="3.175"
       ry="3.1749995" /><rect
       style="fill:#75507b;fill-opacity:1;stroke:#dbdbdb;stroke-width:0;stroke-linecap:round;stroke-linejoin:round"
       id="rect427692"
       width="4.7625079"
       height="4.7624993"
       x="374.12045"
       y="103.98112"
       rx="3.175"
       ry="3.1749995" /><rect
       style="fill:#06989a;fill-opacity:1;stroke:#dbdbdb;stroke-width:0;stroke-linecap:round;stroke-linejoin:round"
       id="rect427694"
       width="4.7625079"
       height="4.7624993"
       x="381.52875"
       y="103.98112"
       rx="3.175"
       ry="3.1749995" /><text
       xml:space="preserve"
       transform="matrix(0.26458333,0,0,0.26458333,173.06973,68.857828)"
       id="text427702"
       style="font-style:normal;font-variant:normal;font-weight:normal;font-stretch:normal;font-size:13.3333px;line-height:125%;font-family:monospace;-inkscape-font-specification:monospace;font-variant-numeric:tabular-nums;white-space:pre;shape-inside:url(#rect427708);display:inline;fill:#2e3436;fill-opacity:1;stroke:#dbdbdb;stroke-width:0;stroke-linecap:round;stroke-linejoin:round"><tspan
         x="650"
         y="84.039033"
         id="tspan446636">The quick brown fox </tspan><tspan
         x="650"
         y="100.70566"
         id="tspan446638">jumps over the lazy </tspan><tspan
         x="650"
         y="117.37228"
         id="tspan446640">dog</tspan></text><g
       inkscape:label="select selected selection check approve done good small"
       id="g159197"
       transform="matrix(0,0.26458333,-0.26458333,0,138.36659,120.20498)"
       style="display:inline;opacity:0.457736"><title
         id="title159191">object-select</title><path
         style="fill:#deddda"
         d="m 167.79479,197.25019 a 1,1 0 0 0 -1.41211,0.0937 1,1 0 0 0 0.0937,1.41211 l 7.19532,6.29687 -2.24415,2.24414 a 1,1 0 0 0 0,1.41407 1,1 0 0 0 1.41602,0 l 3,-3 a 1.0001,1.0001 0 0 0 -0.0488,-1.46094 z"
         id="path159193" /><rect
         y="195.00317"
         x="163.1358"
         height="16"
         width="16"
         id="rect159195"
         style="fill:none;fill-opacity:1" /></g><rect
       inkscape:export-ydpi="90"
       inkscape:export-xdpi="90"
       style="display:inline;fill:#000000;fill-opacity:0.08;stroke:#000000;stroke-width:0;stroke-miterlimit:4;stroke-dasharray:none;stroke-opacity:1"
       id="rect427825"
       width="57.149998"
       height="28.839584"
       x="292.62732"
       y="131.76242"
       rx="2.5508921"
       ry="2.5508921" /><rect
       inkscape:export-ydpi="90"
       inkscape:export-xdpi="90"
       style="display:inline;fill:#000000;fill-opacity:0.08;stroke:#000000;stroke-width:0;stroke-miterlimit:4;stroke-dasharray:none;stroke-opacity:1"
       id="rect411393"
       width="116.94583"
       height="30.1625"
       x="44.715656"
       y="144.46582"
       rx="2.6694336"
       ry="2.6694336" /><rect
       inkscape:export-ydpi="90"
       inkscape:export-xdpi="90"
       style="display:inline;fill:#000000;fill-opacity:0.08;stroke:#000000;stroke-width:0;stroke-miterlimit:4;stroke-dasharray:none;stroke-opacity:1"
       id="rect411395"
       width="116.94583"
       height="15.610416"
       x="44.715656"
       y="188.64998"
       rx="2.557441"
       ry="2.557441" /><rect
       inkscape:export-ydpi="90"
       inkscape:export-xdpi="90"
       style="display:inline;fill:#fcfdff;fill-opacity:1;stroke:#ececec;stroke-width:0;stroke-miterlimit:4;stroke-dasharray:none;stroke-opacity:1"
       id="rect411397"
       width="116.41702"
       height="14.287514"
       x="44.979206"
       y="188.91443"
       rx="2.3812499"
       ry="2.3812499" /><text
       xml:space="preserve"
       style="font-style:normal;font-variant:normal;font-weight:normal;font-stretch:normal;font-size:3.88056px;line-height:0%;font-family:Cantarell;-inkscape-font-specification:Cantarell;letter-spacing:0px;word-spacing:0px;display:inline;fill:#2e3436;fill-opacity:1;stroke:none;stroke-width:0.264583"
       x="49.73925"
       y="197.47256"
       id="text411401"><tspan
         style="font-size:3.88056px;line-height:1.25;stroke-width:0.264583"
         sodipodi:role="line"
         id="tspan411399"
         x="49.73925"
         y="197.47256">Terminal Bell</tspan></text><g
       id="g411407"
       transform="matrix(-0.26458333,0,0,-0.26458333,1832.1119,527.90914)"
       style="display:inline"><rect
         ry="12.499999"
         rx="12.499998"
         y="1241.7408"
         x="6334.6094"
         height="24.999998"
         width="48.000031"
         id="rect411403"
         style="fill:#d2d2d2;fill-opacity:1;stroke:none;stroke-width:1;stroke-linecap:round;stroke-miterlimit:4;stroke-dasharray:none;stroke-opacity:1" /><rect
         ry="9.7844191"
         rx="9.7846107"
         y="1244.4564"
         x="6360.0034"
         height="19.568962"
         width="19.569344"
         id="rect411405"
         style="fill:#ffffff;fill-opacity:1;stroke:none;stroke-width:1;stroke-linecap:round;stroke-miterlimit:4;stroke-dasharray:none;stroke-opacity:1" /></g><rect
       inkscape:export-ydpi="90"
       inkscape:export-xdpi="90"
       style="display:inline;fill:#fcfdff;fill-opacity:1;stroke:#ececec;stroke-width:0;stroke-miterlimit:4;stroke-dasharray:none;stroke-opacity:1"
       id="rect411431"
       width="116.41702"
       height="28.839611"
       x="44.979206"
       y="144.73039"
       rx="2.3812499"
       ry="2.3812499" /><text
       xml:space="preserve"
       style="font-style:normal;font-variant:normal;font-weight:normal;font-stretch:normal;font-size:3.88056px;line-height:0%;font-family:Cantarell;-inkscape-font-specification:Cantarell;text-align:start;letter-spacing:0px;word-spacing:0px;text-anchor:start;display:inline;fill:#2e3436;fill-opacity:1;stroke:none;stroke-width:0.264583"
       x="49.73925"
       y="153.17627"
       id="text411441"><tspan
         style="font-size:3.88056px;line-height:1.25;text-align:start;text-anchor:start;stroke-width:0.264583"
         sodipodi:role="line"
         id="tspan411439"
         x="49.73925"
         y="153.17627">Use System Default</tspan></text><text
       xml:space="preserve"
       style="font-style:normal;font-variant:normal;font-weight:normal;font-stretch:normal;font-size:3.88056px;line-height:0%;font-family:Cantarell;-inkscape-font-specification:Cantarell;text-align:start;letter-spacing:0px;word-spacing:0px;text-anchor:start;display:inline;opacity:0.457736;fill:#2e3436;fill-opacity:1;stroke:none;stroke-width:0.264583"
       x="49.73925"
       y="167.7285"
       id="text411451"><tspan
         style="font-size:3.88056px;line-height:1.25;text-align:start;text-anchor:start;stroke-width:0.264583"
         sodipodi:role="line"
         id="tspan411449"
         x="49.73925"
         y="167.7285">Custom Font</tspan></text><text
       inkscape:export-ydpi="90"
       inkscape:export-xdpi="90"
       inkscape:export-filename="/home/aday/Dropbox/Public/settings/sound.png"
       id="text411455"
       y="184.23535"
       x="44.987087"
       style="font-style:normal;font-variant:normal;font-weight:normal;font-stretch:normal;font-size:3.88056px;line-height:0%;font-family:Cantarell;-inkscape-font-specification:'Cantarell, Normal';font-variant-ligatures:normal;font-variant-caps:normal;font-variant-numeric:normal;font-variant-east-asian:normal;text-align:start;letter-spacing:0px;word-spacing:0px;text-anchor:start;display:inline;fill:#2e3436;fill-opacity:1;stroke:none;stroke-width:0.264583"
       xml:space="preserve"><tspan
         y="184.23535"
         x="44.987087"
         id="tspan411453"
         sodipodi:role="line"
         style="font-style:normal;font-variant:normal;font-weight:bold;font-stretch:normal;font-size:3.88056px;line-height:1.25;font-family:Cantarell;-inkscape-font-specification:'Cantarell, Normal';font-variant-ligatures:normal;font-variant-caps:normal;font-variant-numeric:normal;font-variant-east-asian:normal;text-align:start;text-anchor:start;stroke-width:0.264583">Sounds</tspan></text><text
       inkscape:export-ydpi="90"
       inkscape:export-xdpi="90"
       inkscape:export-filename="/home/aday/Dropbox/Public/settings/sound.png"
       id="text411459"
       y="140.31438"
       x="44.987087"
       style="font-style:normal;font-variant:normal;font-weight:normal;font-stretch:normal;font-size:3.88056px;line-height:0%;font-family:Cantarell;-inkscape-font-specification:'Cantarell, Normal';font-variant-ligatures:normal;font-variant-caps:normal;font-variant-numeric:normal;font-variant-east-asian:normal;text-align:start;letter-spacing:0px;word-spacing:0px;text-anchor:start;display:inline;fill:#2e3436;fill-opacity:1;stroke:none;stroke-width:0.264583"
       xml:space="preserve"><tspan
         y="140.31438"
         x="44.987087"
         id="tspan411457"
         sodipodi:role="line"
         style="font-style:normal;font-variant:normal;font-weight:bold;font-stretch:normal;font-size:3.88056px;line-height:1.25;font-family:Cantarell;-inkscape-font-specification:'Cantarell, Normal';font-variant-ligatures:normal;font-variant-caps:normal;font-variant-numeric:normal;font-variant-east-asian:normal;text-align:start;text-anchor:start;stroke-width:0.264583">Font</tspan></text><rect
       inkscape:export-ydpi="90"
       inkscape:export-xdpi="90"
       style="display:inline;fill:#000000;fill-opacity:0.08;stroke:#000000;stroke-width:0;stroke-miterlimit:4;stroke-dasharray:none;stroke-opacity:1"
       id="rect411461"
       width="116.94583"
       height="43.127083"
       x="44.715656"
       y="217.7551"
       rx="2.4038651"
       ry="2.4038651" /><rect
       inkscape:export-ydpi="90"
       inkscape:export-xdpi="90"
       style="display:inline;fill:#fcfdff;fill-opacity:1;stroke:#ececec;stroke-width:0;stroke-miterlimit:4;stroke-dasharray:none;stroke-opacity:1"
       id="rect411463"
       width="116.41702"
       height="41.804207"
       x="44.974297"
       y="218.01968"
       rx="2.3812499"
       ry="2.3812499" /><path
       style="display:inline;fill:none;stroke:#ebebeb;stroke-width:0.264581px;stroke-linecap:butt;stroke-linejoin:miter;stroke-opacity:1"
       d="M 161.39522,231.91109 H 44.979425"
       id="path411465" /><text
       xml:space="preserve"
       style="font-style:normal;font-variant:normal;font-weight:normal;font-stretch:normal;font-size:3.88056px;line-height:0%;font-family:Cantarell;-inkscape-font-specification:Cantarell;letter-spacing:0px;word-spacing:0px;display:inline;fill:#2e3436;fill-opacity:1;stroke:none;stroke-width:0.264583"
       x="49.73925"
       y="226.3121"
       id="text411481"><tspan
         style="font-size:3.88056px;line-height:1.25;stroke-width:0.264583"
         sodipodi:role="line"
         id="tspan411479"
         x="49.73925"
         y="226.3121">Run Command as Login Shell</tspan></text><text
       xml:space="preserve"
       style="font-style:normal;font-variant:normal;font-weight:normal;font-stretch:normal;font-size:3.88056px;line-height:0%;font-family:Cantarell;-inkscape-font-specification:Cantarell;letter-spacing:0px;word-spacing:0px;display:inline;fill:#2e3436;fill-opacity:1;stroke:none;stroke-width:0.264583"
       x="49.73925"
       y="239.80518"
       id="text411485"><tspan
         style="font-size:3.88056px;line-height:1.25;stroke-width:0.264583"
         sodipodi:role="line"
         id="tspan411483"
         x="49.73925"
         y="239.80518">Use Custom Command</tspan></text><text
       inkscape:export-ydpi="90"
       inkscape:export-xdpi="90"
       inkscape:export-filename="/home/aday/Dropbox/Public/settings/sound.png"
       id="text411489"
       y="213.86876"
       x="45.51548"
       style="font-style:normal;font-variant:normal;font-weight:normal;font-stretch:normal;font-size:3.88056px;line-height:0%;font-family:Cantarell;-inkscape-font-specification:'Cantarell, Normal';font-variant-ligatures:normal;font-variant-caps:normal;font-variant-numeric:normal;font-variant-east-asian:normal;text-align:start;letter-spacing:0px;word-spacing:0px;text-anchor:start;display:inline;fill:#2e3436;fill-opacity:1;stroke:none;stroke-width:0.264583"
       xml:space="preserve"><tspan
         y="213.86876"
         x="45.51548"
         id="tspan411487"
         sodipodi:role="line"
         style="font-style:normal;font-variant:normal;font-weight:bold;font-stretch:normal;font-size:3.88056px;line-height:1.25;font-family:Cantarell;-inkscape-font-specification:'Cantarell, Normal';font-variant-ligatures:normal;font-variant-caps:normal;font-variant-numeric:normal;font-variant-east-asian:normal;text-align:start;text-anchor:start;stroke-width:0.264583">Command</tspan></text><path
       style="display:inline;fill:none;stroke:#ebebeb;stroke-width:0.264581px;stroke-linecap:butt;stroke-linejoin:miter;stroke-opacity:1"
       d="M 161.39771,159.15027 H 44.981938"
       id="path411511" /><g
       id="g411641"
       transform="matrix(0.26458333,0,0,0.26458333,-328.63731,1697.0284)"
       style="display:inline"><g
         id="g411636"
         transform="translate(-4550.6078,-6927.1988)"
         style="opacity:1"><rect
           ry="12.499999"
           rx="12.499998"
           y="1241.7408"
           x="6334.6094"
           height="24.999998"
           width="48.000031"
           id="rect411632"
           style="fill:#3584e4;fill-opacity:1;stroke:none;stroke-width:1;stroke-linecap:round;stroke-miterlimit:4;stroke-dasharray:none;stroke-opacity:1" /><rect
           ry="9.7844191"
           rx="9.7846107"
           y="1244.4564"
           x="6360.0034"
           height="19.568962"
           width="19.569344"
           id="rect411634"
           style="fill:#ffffff;fill-opacity:1;stroke:none;stroke-width:1;stroke-linecap:round;stroke-miterlimit:4;stroke-dasharray:none;stroke-opacity:1" /></g></g><g
       id="g411649"
       transform="matrix(0.26458333,0,0,0.26458333,-328.63731,1652.8199)"
       style="display:inline"><g
         id="g411647"
         transform="translate(-4550.6078,-6927.1988)"
         style="opacity:1"><rect
           ry="12.499999"
           rx="12.499998"
           y="1241.7408"
           x="6334.6094"
           height="24.999998"
           width="48.000031"
           id="rect411643"
           style="fill:#3584e4;fill-opacity:1;stroke:none;stroke-width:1;stroke-linecap:round;stroke-miterlimit:4;stroke-dasharray:none;stroke-opacity:1" /><rect
           ry="9.7844191"
           rx="9.7846107"
           y="1244.4564"
           x="6360.0034"
           height="19.568962"
           width="19.569344"
           id="rect411645"
           style="fill:#ffffff;fill-opacity:1;stroke:none;stroke-width:1;stroke-linecap:round;stroke-miterlimit:4;stroke-dasharray:none;stroke-opacity:1" /></g></g><g
       inkscape:label="go next following arrow right back"
       id="g412387"
       transform="matrix(0,0.26458333,0.26458333,0,99.50952,121.12174)"
       style="display:inline;opacity:0.457736"><title
         id="title412381">go-next</title><path
         d="m 165.13672,199.00391 a 1,1 0 0 0 -0.70899,0.29296 1,1 0 0 0 0,1.41407 l 6,6 a 1.0001,1.0001 0 0 0 1.41602,0 l 6,-6 a 1,1 0 0 0 0,-1.41407 1,1 0 0 0 -1.41602,0 l -5.29101,5.29297 -5.29297,-5.29297 a 1,1 0 0 0 -0.70703,-0.29296 z"
         id="path412383"
         style="fill:#2e3436;fill-opacity:1" /><rect
         y="195.00317"
         x="163.1358"
         height="16"
         width="16"
         id="rect412385"
         style="fill:none;fill-opacity:1" /></g><text
       xml:space="preserve"
       style="font-style:normal;font-variant:normal;font-weight:normal;font-stretch:normal;font-size:3.52777px;line-height:0%;font-family:Cantarell;-inkscape-font-specification:Cantarell;text-align:start;letter-spacing:0px;word-spacing:0px;text-anchor:start;display:inline;opacity:0.457736;fill:#2e3436;fill-opacity:1;stroke:none;stroke-width:0.264583"
       x="112.71007"
       y="167.70706"
       id="text413162"><tspan
         style="font-style:normal;font-variant:normal;font-weight:normal;font-stretch:normal;font-size:3.52777px;line-height:1.25;font-family:'Roboto Mono';-inkscape-font-specification:'Roboto Mono';text-align:start;text-anchor:start;stroke-width:0.264583"
         sodipodi:role="line"
         id="tspan413160"
         x="112.71007"
         y="167.70706">Roboto Mono, 10pt</tspan></text><text
       xml:space="preserve"
       style="font-style:normal;font-variant:normal;font-weight:normal;font-stretch:normal;font-size:3.88056px;line-height:0%;font-family:Cantarell;-inkscape-font-specification:Cantarell;letter-spacing:0px;word-spacing:0px;display:inline;opacity:0.486564;fill:#2e3436;fill-opacity:1;stroke:none;stroke-width:0.264583"
       x="49.73925"
       y="254.09335"
       id="text413174"><tspan
         style="font-size:3.88056px;line-height:1.25;stroke-width:0.264583"
         sodipodi:role="line"
         id="tspan413172"
         x="49.73925"
         y="254.09335">Custom Command</tspan></text><path
       style="display:inline;fill:none;stroke:#ebebeb;stroke-width:0.264581px;stroke-linecap:butt;stroke-linejoin:miter;stroke-opacity:1"
       d="M 161.39522,245.40103 H 44.979425"
       id="path413190" /><g
       id="g413198"
       transform="matrix(0.26458333,0,0,0.26458333,-328.63731,1725.8681)"
       style="display:inline"><g
         id="g413196"
         transform="translate(-4550.6078,-6927.1988)"
         style="opacity:1"><rect
           ry="12.499999"
           rx="12.499998"
           y="1241.7408"
           x="6334.6094"
           height="24.999998"
           width="48.000031"
           id="rect413192"
           style="fill:#3584e4;fill-opacity:1;stroke:none;stroke-width:1;stroke-linecap:round;stroke-miterlimit:4;stroke-dasharray:none;stroke-opacity:1" /><rect
           ry="9.7844191"
           rx="9.7846107"
           y="1244.4564"
           x="6360.0034"
           height="19.568962"
           width="19.569344"
           id="rect413194"
           style="fill:#ffffff;fill-opacity:1;stroke:none;stroke-width:1;stroke-linecap:round;stroke-miterlimit:4;stroke-dasharray:none;stroke-opacity:1" /></g></g><g
       id="g413204"
       transform="matrix(-0.26458333,0,0,-0.26458333,1832.1119,570.50726)"
       style="display:inline"><rect
         ry="12.499999"
         rx="12.499998"
         y="1241.7408"
         x="6334.6094"
         height="24.999998"
         width="48.000031"
         id="rect413200"
         style="fill:#d2d2d2;fill-opacity:1;stroke:none;stroke-width:1;stroke-linecap:round;stroke-miterlimit:4;stroke-dasharray:none;stroke-opacity:1" /><rect
         ry="9.7844191"
         rx="9.7846107"
         y="1244.4564"
         x="6360.0034"
         height="19.568962"
         width="19.569344"
         id="rect413202"
         style="fill:#ffffff;fill-opacity:1;stroke:none;stroke-width:1;stroke-linecap:round;stroke-miterlimit:4;stroke-dasharray:none;stroke-opacity:1" /></g><g
       id="g413938"
       inkscape:label="document save as name pencil write change "
       transform="matrix(0.26458333,0,0,0.26458333,66.121432,261.14511)"
       style="display:inline;opacity:0.486564"><title
         id="title413932">document-edit</title><path
         id="path413934"
         style="fill:#2e3436"
         d="m 332.27734,-39.16797 c -0.57966,0.007 -1.16955,0.23205 -1.6914,0.75391 l -9,9 C 321.21087,-29.03904 321.0001,-28.5304 321,-28 v 3 h 3 c 0.5304,-10e-5 1.03904,-0.21087 1.41406,-0.58594 l 9,-9 c 1.78921,-1.78921 0.0827,-4.39013 -1.88867,-4.57226 -0.0821,-0.008 -0.16524,-0.0108 -0.24805,-0.01 z m -1.77734,3.60742 1.06055,1.06055 -0.5293,0.53125 -6,6 -0.53125,0.5293 -1.06055,-1.06055 0.5293,-0.53125 6,-6 z" /><rect
         y="-336"
         x="-40.000008"
         height="16"
         width="16"
         id="rect413936"
         style="fill:none;fill-opacity:1"
         transform="rotate(90)" /></g><rect
       style="fill:#ffffff;fill-opacity:1;stroke:#dbdbdb;stroke-width:0;stroke-linecap:round;stroke-linejoin:round"
       id="rect426895"
       width="56.620823"
       height="27.516665"
       x="233.09612"
       y="132.02707"
       rx="2.3812499"
       ry="2.3812499" /><rect
       style="fill:#c01c28;fill-opacity:1;stroke:#dbdbdb;stroke-width:0;stroke-linecap:round;stroke-linejoin:round"
       id="rect426897"
       width="4.7624621"
       height="4.7624531"
       x="238.38776"
       y="151.60628"
       rx="3.1750002"
       ry="3.1749995" /><rect
       style="fill:#26a269;fill-opacity:1;stroke:#dbdbdb;stroke-width:0;stroke-linecap:round;stroke-linejoin:round"
       id="rect426899"
       width="4.7624989"
       height="4.7624898"
       x="245.79602"
       y="151.60628"
       rx="3.1750002"
       ry="3.1749995" /><rect
       style="fill:#a2734c;fill-opacity:1;stroke:#dbdbdb;stroke-width:0;stroke-linecap:round;stroke-linejoin:round"
       id="rect426901"
       width="4.7625079"
       height="4.7624993"
       x="253.20436"
       y="151.60628"
       rx="3.175"
       ry="3.1749995" /><rect
       style="fill:#12488b;fill-opacity:1;stroke:#dbdbdb;stroke-width:0;stroke-linecap:round;stroke-linejoin:round"
       id="rect426903"
       width="4.7625079"
       height="4.7624993"
       x="260.6127"
       y="151.60628"
       rx="3.175"
       ry="3.1749995" /><rect
       style="fill:#a347ba;fill-opacity:1;stroke:#dbdbdb;stroke-width:0;stroke-linecap:round;stroke-linejoin:round"
       id="rect426905"
       width="4.7625079"
       height="4.7624993"
       x="268.02292"
       y="151.60619"
       rx="3.175"
       ry="3.1749995" /><rect
       style="fill:#2aa1b3;fill-opacity:1;stroke:#dbdbdb;stroke-width:0;stroke-linecap:round;stroke-linejoin:round"
       id="rect426907"
       width="4.7625079"
       height="4.7624993"
       x="275.42932"
       y="151.60628"
       rx="3.175"
       ry="3.1749995" /><text
       xml:space="preserve"
       transform="matrix(0.26458333,0,0,0.26458333,66.440701,116.48276)"
       id="text426911"
       style="font-style:normal;font-variant:normal;font-weight:normal;font-stretch:normal;font-size:13.3333px;line-height:125%;font-family:monospace;-inkscape-font-specification:monospace;font-variant-numeric:tabular-nums;white-space:pre;shape-inside:url(#rect426949);display:inline;fill:#171421;fill-opacity:1;stroke:#dbdbdb;stroke-width:0;stroke-linecap:round;stroke-linejoin:round"><tspan
         x="650"
         y="84.039033"
         id="tspan446642">The quick brown fox </tspan><tspan
         x="650"
         y="100.70566"
         id="tspan446644">jumps over the lazy </tspan><tspan
         x="650"
         y="117.37228"
         id="tspan446646">dog</tspan></text><rect
       style="fill:#fdf6e3;fill-opacity:1;stroke:#dbdbdb;stroke-width:0;stroke-linecap:round;stroke-linejoin:round"
       id="rect426913"
       width="56.620834"
       height="27.516665"
       x="292.89191"
       y="132.02707"
       rx="2.3812499"
       ry="2.3812499" /><rect
       style="fill:#dc322f;fill-opacity:1;stroke:#dbdbdb;stroke-width:0;stroke-linecap:round;stroke-linejoin:round"
       id="rect426915"
       width="4.7624621"
       height="4.7624531"
       x="298.18356"
       y="151.60628"
       rx="3.1750002"
       ry="3.1749995" /><rect
       style="fill:#859900;fill-opacity:1;stroke:#dbdbdb;stroke-width:0;stroke-linecap:round;stroke-linejoin:round"
       id="rect426917"
       width="4.7624989"
       height="4.7624898"
       x="306.12103"
       y="151.60628"
       rx="3.1750002"
       ry="3.1749995" /><rect
       style="fill:#b58900;fill-opacity:1;stroke:#dbdbdb;stroke-width:0;stroke-linecap:round;stroke-linejoin:round"
       id="rect426919"
       width="4.7625079"
       height="4.7624993"
       x="314.0585"
       y="151.60628"
       rx="3.175"
       ry="3.1749995" /><rect
       style="fill:#268bd2;fill-opacity:1;stroke:#dbdbdb;stroke-width:0;stroke-linecap:round;stroke-linejoin:round"
       id="rect426921"
       width="4.7625079"
       height="4.7624993"
       x="321.99597"
       y="151.60628"
       rx="3.175"
       ry="3.1749995" /><rect
       style="fill:#d33682;fill-opacity:1;stroke:#dbdbdb;stroke-width:0;stroke-linecap:round;stroke-linejoin:round"
       id="rect426923"
       width="4.7625079"
       height="4.7624993"
       x="329.93347"
       y="151.60628"
       rx="3.175"
       ry="3.1749995" /><rect
       style="fill:#2aa198;fill-opacity:1;stroke:#dbdbdb;stroke-width:0;stroke-linecap:round;stroke-linejoin:round"
       id="rect426925"
       width="4.7625079"
       height="4.7624993"
       x="337.87091"
       y="151.60628"
       rx="3.175"
       ry="3.1749995" /><text
       xml:space="preserve"
       transform="matrix(0.26458333,0,0,0.26458333,126.23655,116.48276)"
       id="text426929"
       style="font-style:normal;font-variant:normal;font-weight:normal;font-stretch:normal;font-size:13.3333px;line-height:125%;font-family:monospace;-inkscape-font-specification:monospace;font-variant-numeric:tabular-nums;white-space:pre;shape-inside:url(#rect426951);display:inline;fill:#657b83;fill-opacity:1;stroke:#dbdbdb;stroke-width:0;stroke-linecap:round;stroke-linejoin:round"><tspan
         x="650"
         y="84.039033"
         id="tspan446648">The quick brown fox </tspan><tspan
         x="650"
         y="100.70566"
         id="tspan446650">jumps over the lazy </tspan><tspan
         x="650"
         y="117.37228"
         id="tspan446652">dog</tspan></text><rect
       inkscape:export-ydpi="90"
       inkscape:export-xdpi="90"
       style="display:inline;fill:#000000;fill-opacity:0.08;stroke:#000000;stroke-width:0;stroke-miterlimit:4;stroke-dasharray:none;stroke-opacity:1"
       id="rect427827"
       width="57.149998"
       height="28.839584"
       x="292.62732"
       y="163.51248"
       rx="2.5508921"
       ry="2.5508921" /><rect
       inkscape:export-ydpi="90"
       inkscape:export-xdpi="90"
       style="display:inline;fill:#000000;fill-opacity:0.08;stroke:#000000;stroke-width:0;stroke-miterlimit:4;stroke-dasharray:none;stroke-opacity:1"
       id="rect427829"
       width="57.149998"
       height="28.839584"
       x="232.83333"
       y="163.51248"
       rx="2.5508921"
       ry="2.5508921" /><rect
       style="fill:#eeeeec;fill-opacity:1;stroke:#dbdbdb;stroke-width:0;stroke-linecap:round;stroke-linejoin:round"
       id="rect426931"
       width="56.620823"
       height="27.516665"
       x="233.0961"
       y="163.77713"
       rx="2.3812499"
       ry="2.3812499" /><rect
       style="fill:#cc0000;fill-opacity:1;stroke:#dbdbdb;stroke-width:0;stroke-linecap:round;stroke-linejoin:round"
       id="rect426933"
       width="4.7624621"
       height="4.7624531"
       x="238.38773"
       y="183.35632"
       rx="3.1750002"
       ry="3.1749995" /><rect
       style="fill:#4e9a06;fill-opacity:1;stroke:#dbdbdb;stroke-width:0;stroke-linecap:round;stroke-linejoin:round"
       id="rect426935"
       width="4.7624989"
       height="4.7624898"
       x="245.79602"
       y="183.35632"
       rx="3.1750002"
       ry="3.1749995" /><rect
       style="fill:#c4a000;fill-opacity:1;stroke:#dbdbdb;stroke-width:0;stroke-linecap:round;stroke-linejoin:round"
       id="rect426937"
       width="4.7625079"
       height="4.7624993"
       x="253.20436"
       y="183.35632"
       rx="3.175"
       ry="3.1749995" /><rect
       style="fill:#3465a4;fill-opacity:1;stroke:#dbdbdb;stroke-width:0;stroke-linecap:round;stroke-linejoin:round"
       id="rect426939"
       width="4.7625079"
       height="4.7624993"
       x="260.6127"
       y="183.35632"
       rx="3.175"
       ry="3.1749995" /><rect
       style="fill:#75507b;fill-opacity:1;stroke:#dbdbdb;stroke-width:0;stroke-linecap:round;stroke-linejoin:round"
       id="rect426941"
       width="4.7625079"
       height="4.7624993"
       x="268.02292"
       y="183.35632"
       rx="3.175"
       ry="3.1749995" /><rect
       style="fill:#06989a;fill-opacity:1;stroke:#dbdbdb;stroke-width:0;stroke-linecap:round;stroke-linejoin:round"
       id="rect426943"
       width="4.7625079"
       height="4.7624993"
       x="275.42932"
       y="183.35632"
       rx="3.175"
       ry="3.1749995" /><text
       xml:space="preserve"
       transform="matrix(0.26458333,0,0,0.26458333,66.440881,148.23275)"
       id="text426947"
       style="font-style:normal;font-variant:normal;font-weight:normal;font-stretch:normal;font-size:13.3333px;line-height:125%;font-family:monospace;-inkscape-font-specification:monospace;font-variant-numeric:tabular-nums;white-space:pre;shape-inside:url(#rect426953);display:inline;fill:#2e3436;fill-opacity:1;stroke:#dbdbdb;stroke-width:0;stroke-linecap:round;stroke-linejoin:round"><tspan
         x="650"
         y="84.039033"
         id="tspan446654">The quick brown fox </tspan><tspan
         x="650"
         y="100.70566"
         id="tspan446656">jumps over the lazy </tspan><tspan
         x="650"
         y="117.37228"
         id="tspan446658">dog</tspan></text><rect
       style="fill:#ffffff;fill-opacity:1;stroke:#dbdbdb;stroke-width:0;stroke-linecap:round;stroke-linejoin:round"
       id="rect427723"
       width="56.620834"
       height="27.516665"
       x="292.89191"
       y="163.77713"
       rx="2.3812499"
       ry="2.3812499" /><rect
       style="fill:#d43e36;fill-opacity:1;stroke:#dbdbdb;stroke-width:0;stroke-linecap:round;stroke-linejoin:round"
       id="rect427725"
       width="4.7624621"
       height="4.7624531"
       x="298.18356"
       y="183.35632"
       rx="3.1750002"
       ry="3.1749995" /><rect
       style="fill:#839b00;fill-opacity:1;stroke:#dbdbdb;stroke-width:0;stroke-linecap:round;stroke-linejoin:round"
       id="rect427727"
       width="4.7624989"
       height="4.7624898"
       x="306.12103"
       y="183.35632"
       rx="3.1750002"
       ry="3.1749995" /><rect
       style="fill:#f99927;fill-opacity:1;stroke:#dbdbdb;stroke-width:0;stroke-linecap:round;stroke-linejoin:round"
       id="rect427729"
       width="4.7625079"
       height="4.7624993"
       x="314.0585"
       y="183.35632"
       rx="3.175"
       ry="3.1749995" /><rect
       style="fill:#5286bc;fill-opacity:1;stroke:#dbdbdb;stroke-width:0;stroke-linecap:round;stroke-linejoin:round"
       id="rect427731"
       width="4.7625079"
       height="4.7624993"
       x="321.99597"
       y="183.35632"
       rx="3.175"
       ry="3.1749995" /><rect
       style="fill:#9c71b7;fill-opacity:1;stroke:#dbdbdb;stroke-width:0;stroke-linecap:round;stroke-linejoin:round"
       id="rect427733"
       width="4.7625079"
       height="4.7624993"
       x="329.93347"
       y="183.35632"
       rx="3.175"
       ry="3.1749995" /><rect
       style="fill:#4ba8af;fill-opacity:1;stroke:#dbdbdb;stroke-width:0;stroke-linecap:round;stroke-linejoin:round"
       id="rect427735"
       width="4.7625079"
       height="4.7624993"
       x="337.87091"
       y="183.35632"
       rx="3.175"
       ry="3.1749995" /><text
       xml:space="preserve"
       transform="matrix(0.26458333,0,0,0.26458333,126.23667,148.23275)"
       id="text427743"
       style="font-style:normal;font-variant:normal;font-weight:normal;font-stretch:normal;font-size:13.3333px;line-height:125%;font-family:monospace;-inkscape-font-specification:monospace;font-variant-numeric:tabular-nums;white-space:pre;shape-inside:url(#rect427747);display:inline;fill:#575156;fill-opacity:1;stroke:#dbdbdb;stroke-width:0;stroke-linecap:round;stroke-linejoin:round"><tspan
         x="650"
         y="84.039033"
         id="tspan446660">The quick brown fox </tspan><tspan
         x="650"
         y="100.70566"
         id="tspan446662">jumps over the lazy </tspan><tspan
         x="650"
         y="117.37228"
         id="tspan446664">dog</tspan></text><rect
       style="fill:none;fill-opacity:1;stroke:#3584e4;stroke-width:0.529167;stroke-linecap:round;stroke-linejoin:round;stroke-dasharray:none;stroke-opacity:1"
       id="rect427831"
       width="56.620823"
       height="28.045818"
       x="233.36252"
       y="131.76245"
       rx="2.6428604"
       ry="2.6428602" /><text
       inkscape:export-ydpi="90"
       inkscape:export-xdpi="90"
       inkscape:export-filename="/home/aday/Dropbox/Public/settings/sound.png"
       id="text428595"
       y="60.410263"
       x="44.987087"
       style="font-style:normal;font-variant:normal;font-weight:normal;font-stretch:normal;font-size:3.88056px;line-height:0%;font-family:Cantarell;-inkscape-font-specification:'Cantarell, Normal';font-variant-ligatures:normal;font-variant-caps:normal;font-variant-numeric:normal;font-variant-east-asian:normal;text-align:start;letter-spacing:0px;word-spacing:0px;text-anchor:start;display:inline;fill:#2e3436;fill-opacity:1;stroke:none;stroke-width:0.264583"
       xml:space="preserve"><tspan
         y="60.410263"
         x="44.987087"
         id="tspan428593"
         sodipodi:role="line"
         style="font-style:normal;font-variant:normal;font-weight:bold;font-stretch:normal;font-size:3.88056px;line-height:1.25;font-family:Cantarell;-inkscape-font-specification:'Cantarell, Normal';font-variant-ligatures:normal;font-variant-caps:normal;font-variant-numeric:normal;font-variant-east-asian:normal;text-align:start;text-anchor:start;stroke-width:0.264583">Colors</tspan></text><circle
       style="fill:#3584e4;fill-opacity:1;stroke:#3584e4;stroke-width:0;stroke-linecap:round;stroke-linejoin:round;stroke-dasharray:none;stroke-opacity:1"
       id="path436825"
       cx="284.95624"
       cy="136.78952"
       r="2.910419" /><g
       inkscape:label="select selected selection check approve done good small"
       id="g436833"
       transform="matrix(0,0.26458333,-0.26458333,0,338.66751,91.509856)"><title
         id="title436827">object-select</title><path
         style="fill:#ffffff;fill-opacity:1"
         d="m 167.79479,197.25019 a 1,1 0 0 0 -1.41211,0.0937 1,1 0 0 0 0.0937,1.41211 l 7.19532,6.29687 -2.24415,2.24414 a 1,1 0 0 0 0,1.41407 1,1 0 0 0 1.41602,0 l 3,-3 a 1.0001,1.0001 0 0 0 -0.0488,-1.46094 z"
         id="path436829" /><rect
         y="195.00317"
         x="163.1358"
         height="16"
         width="16"
         id="rect436831"
         style="fill:none;fill-opacity:1" /></g><rect
       inkscape:export-ydpi="90"
       inkscape:export-xdpi="90"
       style="display:inline;fill:#000000;fill-opacity:0.08;stroke:#000000;stroke-width:0;stroke-miterlimit:4;stroke-dasharray:none;stroke-opacity:1"
       id="rect438215"
       width="57.149998"
       height="31.485415"
       x="104.5104"
       y="64.558319"
       rx="2.5508921"
       ry="2.5508921" /><rect
       style="fill:#fdf6e3;fill-opacity:1;stroke:#dbdbdb;stroke-width:0;stroke-linecap:round;stroke-linejoin:round"
       id="rect438217"
       width="56.620834"
       height="30.162498"
       x="104.77499"
       y="64.82296"
       rx="2.3812499"
       ry="2.3812499" /><rect
       style="fill:#dc322f;fill-opacity:1;stroke:#dbdbdb;stroke-width:0;stroke-linecap:round;stroke-linejoin:round"
       id="rect438219"
       width="6.349999"
       height="5.2914925"
       x="109.53747"
       y="85.989662"
       rx="1.0583333"
       ry="1.0583332" /><rect
       style="fill:#859900;fill-opacity:1;stroke:#dbdbdb;stroke-width:0;stroke-linecap:round;stroke-linejoin:round"
       id="rect438221"
       width="6.349999"
       height="5.2915707"
       x="117.73949"
       y="85.98967"
       rx="1.0583333"
       ry="1.0583333" /><rect
       style="fill:#b58900;fill-opacity:1;stroke:#dbdbdb;stroke-width:0;stroke-linecap:round;stroke-linejoin:round"
       id="rect438223"
       width="6.349999"
       height="5.2915807"
       x="125.67699"
       y="85.989662"
       rx="1.0583333"
       ry="1.0583333" /><rect
       style="fill:#268bd2;fill-opacity:1;stroke:#dbdbdb;stroke-width:0;stroke-linecap:round;stroke-linejoin:round"
       id="rect438225"
       width="6.349999"
       height="5.2915807"
       x="133.87909"
       y="85.989662"
       rx="1.0583333"
       ry="1.0583333" /><rect
       style="fill:#d33682;fill-opacity:1;stroke:#dbdbdb;stroke-width:0;stroke-linecap:round;stroke-linejoin:round"
       id="rect438227"
       width="6.349999"
       height="5.2915807"
       x="142.08118"
       y="85.989578"
       rx="1.0583333"
       ry="1.0583333" /><rect
       style="fill:#2aa198;fill-opacity:1;stroke:#dbdbdb;stroke-width:0;stroke-linecap:round;stroke-linejoin:round"
       id="rect438229"
       width="6.349999"
       height="5.2915807"
       x="150.28314"
       y="85.989662"
       rx="1.0583333"
       ry="1.0583333" /><text
       xml:space="preserve"
       transform="matrix(0.26458333,0,0,0.26458333,-62.409593,49.278632)"
       id="text438237"
       style="font-style:normal;font-variant:normal;font-weight:normal;font-stretch:normal;font-size:13.3333px;line-height:145%;font-family:monospace;-inkscape-font-specification:monospace;font-variant-numeric:tabular-nums;white-space:pre;shape-inside:url(#rect438239);display:inline;fill:#657b83;fill-opacity:1;stroke:#dbdbdb;stroke-width:0;stroke-linecap:round;stroke-linejoin:round"><tspan
         x="650"
         y="85.372363"
         id="tspan446666">The quick brown fox </tspan><tspan
         x="650"
         y="104.70565"
         id="tspan446668">jumps over the lazy </tspan><tspan
         x="650"
         y="124.03893"
         id="tspan446670">dog</tspan></text><rect
       style="opacity:1;fill:#dc322f;fill-opacity:1;stroke:#3584e4;stroke-width:0;stroke-linecap:round;stroke-linejoin:round;stroke-dasharray:none;stroke-opacity:1"
       id="rect438376"
       width="0.41770652"
       height="0.027542593"
       x="142.67572"
       y="90.565765"
       rx="1.0583333"
       ry="0.027542593" /><rect
       style="fill:#ffffff;fill-opacity:1;stroke:#dbdbdb;stroke-width:0;stroke-linecap:round;stroke-linejoin:round"
       id="rect439381"
       width="56.620834"
       height="30.162498"
       x="44.97924"
       y="64.82296"
       rx="2.3812499"
       ry="2.3812499" /><rect
       style="fill:#c01c28;fill-opacity:1;stroke:#dbdbdb;stroke-width:0;stroke-linecap:round;stroke-linejoin:round"
       id="rect439383"
       width="6.349999"
       height="5.2914925"
       x="49.741707"
       y="85.989662"
       rx="1.0583333"
       ry="1.0583332" /><rect
       style="fill:#26a269;fill-opacity:1;stroke:#dbdbdb;stroke-width:0;stroke-linecap:round;stroke-linejoin:round"
       id="rect439385"
       width="6.349999"
       height="5.2915707"
       x="57.943748"
       y="85.98967"
       rx="1.0583333"
       ry="1.0583333" /><rect
       style="fill:#a2734c;fill-opacity:1;stroke:#dbdbdb;stroke-width:0;stroke-linecap:round;stroke-linejoin:round"
       id="rect439387"
       width="6.349999"
       height="5.2915807"
       x="65.881264"
       y="85.989662"
       rx="1.0583333"
       ry="1.0583333" /><rect
       style="fill:#12488b;fill-opacity:1;stroke:#dbdbdb;stroke-width:0;stroke-linecap:round;stroke-linejoin:round"
       id="rect439389"
       width="6.349999"
       height="5.2915807"
       x="74.083336"
       y="85.989662"
       rx="1.0583333"
       ry="1.0583333" /><rect
       style="fill:#a347ba;fill-opacity:1;stroke:#dbdbdb;stroke-width:0;stroke-linecap:round;stroke-linejoin:round"
       id="rect439391"
       width="6.349999"
       height="5.2915807"
       x="82.285423"
       y="85.989578"
       rx="1.0583333"
       ry="1.0583333" /><rect
       style="fill:#a5d7df;fill-opacity:1;stroke:#dbdbdb;stroke-width:0;stroke-linecap:round;stroke-linejoin:round"
       id="rect439393"
       width="6.349999"
       height="5.2915807"
       x="90.487389"
       y="85.989662"
       rx="1.0583333"
       ry="1.0583333" /><text
       xml:space="preserve"
       transform="matrix(0.26458333,0,0,0.26458333,-122.20541,49.278632)"
       id="text439401"
       style="font-style:normal;font-variant:normal;font-weight:normal;font-stretch:normal;font-size:13.3333px;line-height:145%;font-family:monospace;-inkscape-font-specification:monospace;font-variant-numeric:tabular-nums;white-space:pre;shape-inside:url(#rect439405);display:inline;fill:#171421;fill-opacity:1;stroke:#dbdbdb;stroke-width:0;stroke-linecap:round;stroke-linejoin:round"><tspan
         x="650"
         y="85.372363"
         id="tspan446672">The quick brown fox </tspan><tspan
         x="650"
         y="104.70565"
         id="tspan446674">jumps over the lazy </tspan><tspan
         x="650"
         y="124.03893"
         id="tspan446676">dog</tspan></text><rect
       style="opacity:1;fill:#dc322f;fill-opacity:1;stroke:#3584e4;stroke-width:0;stroke-linecap:round;stroke-linejoin:round;stroke-dasharray:none;stroke-opacity:1"
       id="rect439403"
       width="0.41770652"
       height="0.027542593"
       x="82.879967"
       y="90.565765"
       rx="1.0583333"
       ry="0.027542593" /><rect
       inkscape:export-ydpi="90"
       inkscape:export-xdpi="90"
       style="display:inline;fill:#000000;fill-opacity:0.08;stroke:#000000;stroke-width:0;stroke-miterlimit:4;stroke-dasharray:none;stroke-opacity:1"
       id="rect443102"
       width="57.149998"
       height="31.485415"
       x="104.5104"
       y="98.424988"
       rx="2.5508921"
       ry="2.5508921" /><rect
       style="fill:#ffffff;fill-opacity:1;stroke:#dbdbdb;stroke-width:0;stroke-linecap:round;stroke-linejoin:round"
       id="rect443104"
       width="56.620834"
       height="30.162498"
       x="104.77499"
       y="98.68959"
       rx="2.3812499"
       ry="2.3812499" /><rect
       style="fill:#d43e36;fill-opacity:1;stroke:#dbdbdb;stroke-width:0;stroke-linecap:round;stroke-linejoin:round"
       id="rect443106"
       width="6.349999"
       height="5.2914925"
       x="109.53747"
       y="119.85629"
       rx="1.0583333"
       ry="1.0583332" /><rect
       style="fill:#839b00;fill-opacity:1;stroke:#dbdbdb;stroke-width:0;stroke-linecap:round;stroke-linejoin:round"
       id="rect443108"
       width="6.349999"
       height="5.2915707"
       x="117.73949"
       y="119.85629"
       rx="1.0583333"
       ry="1.0583333" /><rect
       style="fill:#f99927;fill-opacity:1;stroke:#dbdbdb;stroke-width:0;stroke-linecap:round;stroke-linejoin:round"
       id="rect443110"
       width="6.349999"
       height="5.2915807"
       x="125.67699"
       y="119.85629"
       rx="1.0583333"
       ry="1.0583333" /><rect
       style="fill:#5286bc;fill-opacity:1;stroke:#dbdbdb;stroke-width:0;stroke-linecap:round;stroke-linejoin:round"
       id="rect443112"
       width="6.349999"
       height="5.2915807"
       x="133.87909"
       y="119.85629"
       rx="1.0583333"
       ry="1.0583333" /><rect
       style="fill:#9c71b7;fill-opacity:1;stroke:#dbdbdb;stroke-width:0;stroke-linecap:round;stroke-linejoin:round"
       id="rect443114"
       width="6.349999"
       height="5.2915807"
       x="142.08118"
       y="119.85626"
       rx="1.0583333"
       ry="1.0583333" /><rect
       style="fill:#4ba8af;fill-opacity:1;stroke:#dbdbdb;stroke-width:0;stroke-linecap:round;stroke-linejoin:round"
       id="rect443116"
       width="6.349999"
       height="5.2915807"
       x="150.28314"
       y="119.85629"
       rx="1.0583333"
       ry="1.0583333" /><text
       xml:space="preserve"
       transform="matrix(0.26458333,0,0,0.26458333,-62.409593,83.145302)"
       id="text443124"
       style="font-style:normal;font-variant:normal;font-weight:normal;font-stretch:normal;font-size:13.3333px;line-height:145%;font-family:monospace;-inkscape-font-specification:monospace;font-variant-numeric:tabular-nums;white-space:pre;shape-inside:url(#rect443154);display:inline;fill:#575156;fill-opacity:1;stroke:#dbdbdb;stroke-width:0;stroke-linecap:round;stroke-linejoin:round"><tspan
         x="650"
         y="85.372363"
         id="tspan446678">The quick brown fox </tspan><tspan
         x="650"
         y="104.70565"
         id="tspan446680">jumps over the lazy </tspan><tspan
         x="650"
         y="124.03893"
         id="tspan446682">dog</tspan></text><rect
       style="opacity:1;fill:#dc322f;fill-opacity:1;stroke:#3584e4;stroke-width:0;stroke-linecap:round;stroke-linejoin:round;stroke-dasharray:none;stroke-opacity:1"
       id="rect443126"
       width="0.41770652"
       height="0.027542593"
       x="142.67572"
       y="124.43245"
       rx="1.0583333"
       ry="0.027542593" /><rect
       inkscape:export-ydpi="90"
       inkscape:export-xdpi="90"
       style="display:inline;fill:#000000;fill-opacity:0.08;stroke:#000000;stroke-width:0;stroke-miterlimit:4;stroke-dasharray:none;stroke-opacity:1"
       id="rect443128"
       width="57.149998"
       height="31.485415"
       x="44.714653"
       y="98.424988"
       rx="2.5508921"
       ry="2.5508921" /><rect
       style="fill:#eeeeec;fill-opacity:1;stroke:#dbdbdb;stroke-width:0;stroke-linecap:round;stroke-linejoin:round"
       id="rect443130"
       width="56.620834"
       height="30.162498"
       x="44.97924"
       y="98.68959"
       rx="2.3812499"
       ry="2.3812499" /><rect
       style="fill:#cc0000;fill-opacity:1;stroke:#dbdbdb;stroke-width:0;stroke-linecap:round;stroke-linejoin:round"
       id="rect443132"
       width="6.349999"
       height="5.2914925"
       x="49.741707"
       y="119.85629"
       rx="1.0583333"
       ry="1.0583332" /><rect
       style="fill:#4e9a06;fill-opacity:1;stroke:#dbdbdb;stroke-width:0;stroke-linecap:round;stroke-linejoin:round"
       id="rect443134"
       width="6.349999"
       height="5.2915707"
       x="57.943748"
       y="119.85629"
       rx="1.0583333"
       ry="1.0583333" /><rect
       style="fill:#c4a000;fill-opacity:1;stroke:#dbdbdb;stroke-width:0;stroke-linecap:round;stroke-linejoin:round"
       id="rect443136"
       width="6.349999"
       height="5.2915807"
       x="65.881264"
       y="119.85629"
       rx="1.0583333"
       ry="1.0583333" /><rect
       style="fill:#3465a4;fill-opacity:1;stroke:#dbdbdb;stroke-width:0;stroke-linecap:round;stroke-linejoin:round"
       id="rect443138"
       width="6.349999"
       height="5.2915807"
       x="-80.433342"
       y="119.85629"
       rx="1.0583333"
       ry="1.0583333"
       transform="scale(-1,1)" /><rect
       style="fill:#75507b;fill-opacity:1;stroke:#dbdbdb;stroke-width:0;stroke-linecap:round;stroke-linejoin:round"
       id="rect443140"
       width="6.349999"
       height="5.2915807"
       x="-88.635429"
       y="119.85626"
       rx="1.0583333"
       ry="1.0583333"
       transform="scale(-1,1)" /><rect
       style="fill:#06989a;fill-opacity:1;stroke:#dbdbdb;stroke-width:0;stroke-linecap:round;stroke-linejoin:round"
       id="rect443142"
       width="6.349999"
       height="5.2915807"
       x="90.487389"
       y="119.85629"
       rx="1.0583333"
       ry="1.0583333" /><text
       xml:space="preserve"
       transform="matrix(0.26458333,0,0,0.26458333,-122.20541,83.145302)"
       id="text443150"
       style="font-style:normal;font-variant:normal;font-weight:normal;font-stretch:normal;font-size:13.3333px;line-height:145%;font-family:monospace;-inkscape-font-specification:monospace;font-variant-numeric:tabular-nums;white-space:pre;shape-inside:url(#rect443156);display:inline;fill:#2e3436;fill-opacity:1;stroke:#dbdbdb;stroke-width:0;stroke-linecap:round;stroke-linejoin:round"><tspan
         x="650"
         y="85.372363"
         id="tspan446684">The quick brown fox </tspan><tspan
         x="650"
         y="104.70565"
         id="tspan446686">jumps over the lazy </tspan><tspan
         x="650"
         y="124.03893"
         id="tspan446688">dog</tspan></text><rect
       style="opacity:1;fill:#dc322f;fill-opacity:1;stroke:#3584e4;stroke-width:0;stroke-linecap:round;stroke-linejoin:round;stroke-dasharray:none;stroke-opacity:1"
       id="rect443152"
       width="0.41770652"
       height="0.027542593"
       x="82.879967"
       y="124.43245"
       rx="1.0583333"
       ry="0.027542593" /><g
       id="g443969"
       transform="translate(182.56249,-61.383399)"><rect
         style="fill:#cc0000;fill-opacity:1;stroke:#dbdbdb;stroke-width:0;stroke-linecap:round;stroke-linejoin:round"
         id="rect443933"
         width="4.7624621"
         height="4.7624531"
         x="50.270844"
         y="119.85632"
         rx="3.1750002"
         ry="3.1749995" /><rect
         style="fill:#4e9a06;fill-opacity:1;stroke:#dbdbdb;stroke-width:0;stroke-linecap:round;stroke-linejoin:round"
         id="rect443935"
         width="4.7624989"
         height="4.7624898"
         x="57.679146"
         y="119.85632"
         rx="3.1750002"
         ry="3.1749995" /><rect
         style="fill:#c4a000;fill-opacity:1;stroke:#dbdbdb;stroke-width:0;stroke-linecap:round;stroke-linejoin:round"
         id="rect443937"
         width="4.7625079"
         height="4.7624993"
         x="65.087471"
         y="119.85632"
         rx="3.175"
         ry="3.1749995" /><rect
         style="fill:#3465a4;fill-opacity:1;stroke:#dbdbdb;stroke-width:0;stroke-linecap:round;stroke-linejoin:round"
         id="rect443939"
         width="4.7625079"
         height="4.7624993"
         x="72.495781"
         y="119.85632"
         rx="3.175"
         ry="3.1749995" /><rect
         style="fill:#75507b;fill-opacity:1;stroke:#dbdbdb;stroke-width:0;stroke-linecap:round;stroke-linejoin:round"
         id="rect443941"
         width="4.7625079"
         height="4.7624993"
         x="79.906006"
         y="119.85632"
         rx="3.175"
         ry="3.1749995" /><rect
         style="fill:#06989a;fill-opacity:1;stroke:#dbdbdb;stroke-width:0;stroke-linecap:round;stroke-linejoin:round"
         id="rect443943"
         width="4.7625079"
         height="4.7624993"
         x="87.312424"
         y="119.85632"
         rx="3.175"
         ry="3.1749995" /><rect
         style="fill:#d43e36;fill-opacity:1;stroke:#dbdbdb;stroke-width:0;stroke-linecap:round;stroke-linejoin:round"
         id="rect443945"
         width="4.7624621"
         height="4.7624531"
         x="110.06664"
         y="119.85632"
         rx="3.1750002"
         ry="3.1749995" /><rect
         style="fill:#839b00;fill-opacity:1;stroke:#dbdbdb;stroke-width:0;stroke-linecap:round;stroke-linejoin:round"
         id="rect443947"
         width="4.7624989"
         height="4.7624898"
         x="118.00412"
         y="119.85632"
         rx="3.1750002"
         ry="3.1749995" /><rect
         style="fill:#f99927;fill-opacity:1;stroke:#dbdbdb;stroke-width:0;stroke-linecap:round;stroke-linejoin:round"
         id="rect443949"
         width="4.7625079"
         height="4.7624993"
         x="125.9416"
         y="119.85632"
         rx="3.175"
         ry="3.1749995" /><rect
         style="fill:#5286bc;fill-opacity:1;stroke:#dbdbdb;stroke-width:0;stroke-linecap:round;stroke-linejoin:round"
         id="rect443951"
         width="4.7625079"
         height="4.7624993"
         x="133.87906"
         y="119.85632"
         rx="3.175"
         ry="3.1749995" /><rect
         style="fill:#9c71b7;fill-opacity:1;stroke:#dbdbdb;stroke-width:0;stroke-linecap:round;stroke-linejoin:round"
         id="rect443953"
         width="4.7625079"
         height="4.7624993"
         x="141.81656"
         y="119.85632"
         rx="3.175"
         ry="3.1749995" /><rect
         style="fill:#4ba8af;fill-opacity:1;stroke:#dbdbdb;stroke-width:0;stroke-linecap:round;stroke-linejoin:round"
         id="rect443955"
         width="4.7625079"
         height="4.7624993"
         x="149.75401"
         y="119.85632"
         rx="3.175"
         ry="3.1749995" /></g><rect
       style="fill:none;fill-opacity:1;stroke:#3584e4;stroke-width:0.529167;stroke-linecap:round;stroke-linejoin:round;stroke-dasharray:none;stroke-opacity:1"
       id="rect445075"
       width="56.885399"
       height="30.162498"
       x="44.979164"
       y="64.822914"
       rx="2.6428604"
       ry="2.6428604" /><circle
       style="fill:#3584e4;fill-opacity:1;stroke:#3584e4;stroke-width:0;stroke-linecap:round;stroke-linejoin:round;stroke-dasharray:none;stroke-opacity:1"
       id="circle445077"
       cx="96.310234"
       cy="70.114578"
       r="2.910419" /><g
       inkscape:label="select selected selection check approve done good small"
       id="g445085"
       transform="matrix(0,0.26458333,-0.26458333,0,150.02154,24.834884)"><title
         id="title445079">object-select</title><path
         style="fill:#ffffff;fill-opacity:1"
         d="m 167.79479,197.25019 a 1,1 0 0 0 -1.41211,0.0937 1,1 0 0 0 0.0937,1.41211 l 7.19532,6.29687 -2.24415,2.24414 a 1,1 0 0 0 0,1.41407 1,1 0 0 0 1.41602,0 l 3,-3 a 1.0001,1.0001 0 0 0 -0.0488,-1.46094 z"
         id="path445081" /><rect
         y="195.00317"
         x="163.1358"
         height="16"
         width="16"
         id="rect445083"
         style="fill:none;fill-opacity:1" /></g></g></svg>
