<?xml version="1.0" encoding="UTF-8" standalone="no"?>
<!-- Created with Inkscape (http://www.inkscape.org/) -->

<svg
   xmlns:dc="http://purl.org/dc/elements/1.1/"
   xmlns:cc="http://creativecommons.org/ns#"
   xmlns:rdf="http://www.w3.org/1999/02/22-rdf-syntax-ns#"
   xmlns:svg="http://www.w3.org/2000/svg"
   xmlns="http://www.w3.org/2000/svg"
   xmlns:sodipodi="http://sodipodi.sourceforge.net/DTD/sodipodi-0.dtd"
   xmlns:inkscape="http://www.inkscape.org/namespaces/inkscape"
   width="1198"
   height="1280"
   viewBox="0 0 316.97083 338.66668"
   version="1.1"
   id="svg8"
   inkscape:version="0.92.4 5da689c313, 2019-01-14"
   sodipodi:docname="color-palette.svg"
   inkscape:export-filename="../terminal-palette.png"
   inkscape:export-xdpi="90"
   inkscape:export-ydpi="90">
  <defs
     id="defs2" />
  <sodipodi:namedview
     id="base"
     pagecolor="#f0f0f0"
     bordercolor="#666666"
     borderopacity="1.0"
     inkscape:pageopacity="1"
     inkscape:pageshadow="2"
     inkscape:zoom="0.70710678"
     inkscape:cx="452.95431"
     inkscape:cy="599.8559"
     inkscape:document-units="px"
     inkscape:current-layer="layer1"
     showgrid="false"
     units="px"
     inkscape:showpageshadow="false"
     inkscape:window-width="1920"
     inkscape:window-height="1136"
     inkscape:window-x="0"
     inkscape:window-y="27"
     inkscape:window-maximized="1">
    <inkscape:grid
       type="xygrid"
       id="grid841" />
  </sodipodi:namedview>
  <metadata
     id="metadata5">
    <rdf:RDF>
      <cc:Work
         rdf:about="">
        <dc:format>image/svg+xml</dc:format>
        <dc:type
           rdf:resource="http://purl.org/dc/dcmitype/StillImage" />
        <dc:title></dc:title>
      </cc:Work>
    </rdf:RDF>
  </metadata>
  <g
     inkscape:label="Layer 1"
     inkscape:groupmode="layer"
     id="layer1"
     transform="translate(0,41.666684)">
    <rect
       y="134.54581"
       x="11.641668"
       height="150.8125"
       width="140.22917"
       id="rect889"
       style="fill:#242424;fill-opacity:1;stroke-width:0.62415874" />
    <rect
       style="fill:#241f31;fill-opacity:1;stroke-width:0.05563209"
       id="rect815"
       width="10.583333"
       height="15.875"
       x="24.870834"
       y="145.12918" />
    <rect
       y="161.0042"
       x="24.870834"
       height="15.874995"
       width="10.583333"
       id="rect817"
       style="fill:#c01c28;fill-opacity:1;stroke-width:0.05563207" />
    <rect
       y="176.87921"
       x="24.870834"
       height="15.874993"
       width="10.583333"
       id="rect821"
       style="fill:#26a269;fill-opacity:1;stroke-width:0.05563207" />
    <rect
       style="fill:#b5835a;fill-opacity:1;stroke-width:0.05563206"
       id="rect823"
       width="10.583333"
       height="15.87499"
       x="24.870834"
       y="192.75418" />
    <rect
       y="208.62918"
       x="24.870834"
       height="15.874987"
       width="10.583333"
       id="rect825"
       style="fill:#1e5098;fill-opacity:1;stroke-width:0.05563206" />
    <rect
       style="fill:#a347ba;fill-opacity:1;stroke-width:0.05563204"
       id="rect827"
       width="10.583333"
       height="15.87498"
       x="24.870834"
       y="224.5042" />
    <rect
       y="240.3792"
       x="24.870834"
       height="15.87498"
       width="10.583333"
       id="rect829"
       style="fill:#30b7cb;fill-opacity:1;stroke-width:0.05563204" />
    <rect
       style="fill:#deddda;fill-opacity:1;stroke-width:0.05563209"
       id="rect831"
       width="10.583333"
       height="15.875"
       x="24.870834"
       y="256.25418" />
    <rect
       y="145.12918"
       x="88.370819"
       height="15.875"
       width="10.583333"
       id="rect833"
       style="fill:#5e5c64;fill-opacity:1;stroke-width:0.05563209" />
    <rect
       style="fill:#ed333b;fill-opacity:1;stroke-width:0.05563207"
       id="rect835"
       width="10.583333"
       height="15.874995"
       x="88.370819"
       y="161.00421" />
    <rect
       y="176.87921"
       x="88.370819"
       height="15.874993"
       width="10.583333"
       id="rect837"
       style="fill:#33d17a;fill-opacity:1;stroke-width:0.05563207" />
    <rect
       style="fill:#f8e45c;fill-opacity:1;stroke-width:0.05563206"
       id="rect839"
       width="10.583333"
       height="15.87499"
       x="88.370819"
       y="192.75421" />
    <rect
       y="208.62923"
       x="88.370819"
       height="15.874987"
       width="10.583333"
       id="rect843"
       style="fill:#1c71d8;fill-opacity:1;stroke-width:0.05563206" />
    <rect
       style="fill:#c061cb;fill-opacity:1;stroke-width:0.05563204"
       id="rect845"
       width="10.583333"
       height="15.87498"
       x="88.370819"
       y="224.50423" />
    <rect
       y="240.37923"
       x="88.370819"
       height="15.87498"
       width="10.583333"
       id="rect847"
       style="fill:#38daf3;fill-opacity:1;stroke-width:0.05563204" />
    <flowRoot
       xml:space="preserve"
       id="flowRoot881"
       style="font-style:normal;font-variant:normal;font-weight:normal;font-stretch:normal;font-size:14.66666698px;line-height:1.25;font-family:monospace;-inkscape-font-specification:monospace;letter-spacing:0px;word-spacing:0px;fill:#000000;fill-opacity:1;stroke:none"
       transform="matrix(0.26458333,0,0,0.26458333,-17.462501,53.459127)"><flowRegion
         id="flowRegion883"
         style="font-style:normal;font-variant:normal;font-weight:normal;font-stretch:normal;font-size:14.66666698px;font-family:monospace;-inkscape-font-specification:monospace"><rect
           id="rect885"
           width="384"
           height="74"
           x="225"
           y="369"
           style="font-style:normal;font-variant:normal;font-weight:normal;font-stretch:normal;font-size:14.66666698px;font-family:monospace;-inkscape-font-specification:monospace" /></flowRegion><flowPara
         id="flowPara887"
         style="font-style:normal;font-variant:normal;font-weight:normal;font-stretch:normal;font-size:14.66666698px;font-family:monospace;-inkscape-font-specification:monospace">black</flowPara></flowRoot>    <flowRoot
       transform="matrix(0.26458333,0,0,0.26458333,-17.462501,69.323688)"
       style="font-style:normal;font-variant:normal;font-weight:normal;font-stretch:normal;font-size:14.66666698px;line-height:1.25;font-family:monospace;-inkscape-font-specification:monospace;letter-spacing:0px;word-spacing:0px;fill:#c01c28;fill-opacity:1;stroke:none"
       id="flowRoot908"
       xml:space="preserve"><flowRegion
         id="flowRegion904"
         style="font-style:normal;font-variant:normal;font-weight:normal;font-stretch:normal;font-size:14.66666698px;font-family:monospace;-inkscape-font-specification:monospace;fill:#c01c28;fill-opacity:1"><rect
           y="369"
           x="225"
           height="74"
           width="384"
           id="rect902"
           style="font-style:normal;font-variant:normal;font-weight:normal;font-stretch:normal;font-size:14.66666698px;font-family:monospace;-inkscape-font-specification:monospace;fill:#c01c28;fill-opacity:1" /></flowRegion><flowPara
         style="font-style:normal;font-variant:normal;font-weight:normal;font-stretch:normal;font-size:14.66666698px;font-family:monospace;-inkscape-font-specification:monospace;fill:#c01c28;fill-opacity:1"
         id="flowPara906">red</flowPara></flowRoot>    <flowRoot
       xml:space="preserve"
       id="flowRoot916"
       style="font-style:normal;font-variant:normal;font-weight:normal;font-stretch:normal;font-size:14.66666698px;line-height:1.25;font-family:monospace;-inkscape-font-specification:monospace;letter-spacing:0px;word-spacing:0px;fill:#26a269;fill-opacity:1;stroke:none"
       transform="matrix(0.26458333,0,0,0.26458333,-17.462501,85.463285)"><flowRegion
         style="font-style:normal;font-variant:normal;font-weight:normal;font-stretch:normal;font-size:14.66666698px;font-family:monospace;-inkscape-font-specification:monospace;fill:#26a269;fill-opacity:1"
         id="flowRegion912"><rect
           style="font-style:normal;font-variant:normal;font-weight:normal;font-stretch:normal;font-size:14.66666698px;font-family:monospace;-inkscape-font-specification:monospace;fill:#26a269;fill-opacity:1"
           id="rect910"
           width="384"
           height="74"
           x="225"
           y="369" /></flowRegion><flowPara
         id="flowPara914"
         style="font-style:normal;font-variant:normal;font-weight:normal;font-stretch:normal;font-size:14.66666698px;font-family:monospace;-inkscape-font-specification:monospace;fill:#26a269;fill-opacity:1">green</flowPara></flowRoot>    <flowRoot
       transform="matrix(0.26458333,0,0,0.26458333,-17.462501,100.56138)"
       style="font-style:normal;font-variant:normal;font-weight:normal;font-stretch:normal;font-size:14.66666698px;line-height:1.25;font-family:monospace;-inkscape-font-specification:monospace;letter-spacing:0px;word-spacing:0px;fill:#b5835a;fill-opacity:1;stroke:none"
       id="flowRoot924"
       xml:space="preserve"><flowRegion
         id="flowRegion920"
         style="font-style:normal;font-variant:normal;font-weight:normal;font-stretch:normal;font-size:14.66666698px;font-family:monospace;-inkscape-font-specification:monospace;fill:#b5835a;fill-opacity:1"><rect
           y="369"
           x="225"
           height="74"
           width="384"
           id="rect918"
           style="font-style:normal;font-variant:normal;font-weight:normal;font-stretch:normal;font-size:14.66666698px;font-family:monospace;-inkscape-font-specification:monospace;fill:#b5835a;fill-opacity:1" /></flowRegion><flowPara
         style="font-style:normal;font-variant:normal;font-weight:normal;font-stretch:normal;font-size:14.66666698px;font-family:monospace;-inkscape-font-specification:monospace;fill:#b5835a;fill-opacity:1"
         id="flowPara922">yellow</flowPara></flowRoot>    <flowRoot
       transform="matrix(0.26458333,0,0,0.26458333,-17.462501,116.1718)"
       style="font-style:normal;font-variant:normal;font-weight:normal;font-stretch:normal;font-size:14.66666698px;line-height:1.25;font-family:monospace;-inkscape-font-specification:monospace;letter-spacing:0px;word-spacing:0px;fill:#1e5098;fill-opacity:1;stroke:none"
       id="flowRoot932"
       xml:space="preserve"><flowRegion
         id="flowRegion928"
         style="font-style:normal;font-variant:normal;font-weight:normal;font-stretch:normal;font-size:14.66666698px;font-family:monospace;-inkscape-font-specification:monospace;fill:#1e5098;fill-opacity:1"><rect
           y="369"
           x="225"
           height="74"
           width="384"
           id="rect926"
           style="font-style:normal;font-variant:normal;font-weight:normal;font-stretch:normal;font-size:14.66666698px;font-family:monospace;-inkscape-font-specification:monospace;fill:#1e5098;fill-opacity:1" /></flowRegion><flowPara
         style="font-style:normal;font-variant:normal;font-weight:normal;font-stretch:normal;font-size:14.66666698px;font-family:monospace;-inkscape-font-specification:monospace;fill:#1e5098;fill-opacity:1"
         id="flowPara930">blue</flowPara></flowRoot>    <flowRoot
       xml:space="preserve"
       id="flowRoot940"
       style="font-style:normal;font-variant:normal;font-weight:normal;font-stretch:normal;font-size:14.66666698px;line-height:1.25;font-family:monospace;-inkscape-font-specification:monospace;letter-spacing:0px;word-spacing:0px;fill:#a347ba;fill-opacity:1;stroke:none"
       transform="matrix(0.26458333,0,0,0.26458333,-17.462501,132.31137)"><flowRegion
         style="font-style:normal;font-variant:normal;font-weight:normal;font-stretch:normal;font-size:14.66666698px;font-family:monospace;-inkscape-font-specification:monospace;fill:#a347ba;fill-opacity:1"
         id="flowRegion936"><rect
           style="font-style:normal;font-variant:normal;font-weight:normal;font-stretch:normal;font-size:14.66666698px;font-family:monospace;-inkscape-font-specification:monospace;fill:#a347ba;fill-opacity:1"
           id="rect934"
           width="384"
           height="74"
           x="225"
           y="369" /></flowRegion><flowPara
         id="flowPara938"
         style="font-style:normal;font-variant:normal;font-weight:normal;font-stretch:normal;font-size:14.66666698px;font-family:monospace;-inkscape-font-specification:monospace;fill:#a347ba;fill-opacity:1">magenta</flowPara></flowRoot>    <flowRoot
       transform="matrix(0.26458333,0,0,0.26458333,-17.462501,148.18637)"
       style="font-style:normal;font-variant:normal;font-weight:normal;font-stretch:normal;font-size:14.66666698px;line-height:1.25;font-family:monospace;-inkscape-font-specification:monospace;letter-spacing:0px;word-spacing:0px;fill:#30b7cb;fill-opacity:1;stroke:none"
       id="flowRoot948"
       xml:space="preserve"><flowRegion
         id="flowRegion944"
         style="font-style:normal;font-variant:normal;font-weight:normal;font-stretch:normal;font-size:14.66666698px;font-family:monospace;-inkscape-font-specification:monospace;fill:#30b7cb;fill-opacity:1"><rect
           y="369"
           x="225"
           height="74"
           width="384"
           id="rect942"
           style="font-style:normal;font-variant:normal;font-weight:normal;font-stretch:normal;font-size:14.66666698px;font-family:monospace;-inkscape-font-specification:monospace;fill:#30b7cb;fill-opacity:1" /></flowRegion><flowPara
         style="font-style:normal;font-variant:normal;font-weight:normal;font-stretch:normal;font-size:14.66666698px;font-family:monospace;-inkscape-font-specification:monospace;fill:#30b7cb;fill-opacity:1"
         id="flowPara946">cyan</flowPara></flowRoot>    <flowRoot
       xml:space="preserve"
       id="flowRoot956"
       style="font-style:normal;font-variant:normal;font-weight:normal;font-stretch:normal;font-size:14.66666698px;line-height:1.25;font-family:monospace;-inkscape-font-specification:monospace;letter-spacing:0px;word-spacing:0px;fill:#deddda;fill-opacity:1;stroke:none"
       transform="matrix(0.26458333,0,0,0.26458333,-17.462501,164.0614)"><flowRegion
         style="font-style:normal;font-variant:normal;font-weight:normal;font-stretch:normal;font-size:14.66666698px;font-family:monospace;-inkscape-font-specification:monospace;fill:#deddda;fill-opacity:1"
         id="flowRegion952"><rect
           style="font-style:normal;font-variant:normal;font-weight:normal;font-stretch:normal;font-size:14.66666698px;font-family:monospace;-inkscape-font-specification:monospace;fill:#deddda;fill-opacity:1"
           id="rect950"
           width="384"
           height="74"
           x="225"
           y="369" /></flowRegion><flowPara
         id="flowPara954"
         style="font-style:normal;font-variant:normal;font-weight:normal;font-stretch:normal;font-size:14.66666698px;font-family:monospace;-inkscape-font-specification:monospace;fill:#deddda;fill-opacity:1">light grey</flowPara></flowRoot>    <flowRoot
       transform="matrix(0.26458333,0,0,0.26458333,46.037501,53.72371)"
       style="font-style:normal;font-variant:normal;font-weight:normal;font-stretch:normal;font-size:14.66666698px;line-height:1.25;font-family:monospace;-inkscape-font-specification:monospace;letter-spacing:0px;word-spacing:0px;fill:#5e5c64;fill-opacity:1;stroke:none"
       id="flowRoot964"
       xml:space="preserve"><flowRegion
         style="font-style:normal;font-variant:normal;font-weight:normal;font-stretch:normal;font-size:14.66666698px;font-family:monospace;-inkscape-font-specification:monospace;fill:#5e5c64;fill-opacity:1"
         id="flowRegion960"><rect
           style="font-style:normal;font-variant:normal;font-weight:normal;font-stretch:normal;font-size:14.66666698px;font-family:monospace;-inkscape-font-specification:monospace;fill:#5e5c64;fill-opacity:1"
           y="369"
           x="225"
           height="74"
           width="384"
           id="rect958" /></flowRegion><flowPara
         style="font-style:normal;font-variant:normal;font-weight:normal;font-stretch:normal;font-size:14.66666698px;font-family:monospace;-inkscape-font-specification:monospace;fill:#5e5c64;fill-opacity:1"
         id="flowPara962">dark grey</flowPara></flowRoot>    <flowRoot
       xml:space="preserve"
       id="flowRoot972"
       style="font-style:normal;font-variant:normal;font-weight:normal;font-stretch:normal;font-size:14.66666698px;line-height:1.25;font-family:monospace;-inkscape-font-specification:monospace;letter-spacing:0px;word-spacing:0px;fill:#ed333b;fill-opacity:1;stroke:none"
       transform="matrix(0.26458333,0,0,0.26458333,46.037501,69.588271)"><flowRegion
         style="font-style:normal;font-variant:normal;font-weight:normal;font-stretch:normal;font-size:14.66666698px;font-family:monospace;-inkscape-font-specification:monospace;fill:#ed333b;fill-opacity:1"
         id="flowRegion968"><rect
           style="font-style:normal;font-variant:normal;font-weight:normal;font-stretch:normal;font-size:14.66666698px;font-family:monospace;-inkscape-font-specification:monospace;fill:#ed333b;fill-opacity:1"
           id="rect966"
           width="384"
           height="74"
           x="225"
           y="369" /></flowRegion><flowPara
         id="flowPara970"
         style="font-style:normal;font-variant:normal;font-weight:normal;font-stretch:normal;font-size:14.66666698px;font-family:monospace;-inkscape-font-specification:monospace;fill:#ed333b;fill-opacity:1">light red</flowPara></flowRoot>    <flowRoot
       transform="matrix(0.26458333,0,0,0.26458333,46.037501,85.463285)"
       style="font-style:normal;font-variant:normal;font-weight:normal;font-stretch:normal;font-size:14.66666698px;line-height:1.25;font-family:monospace;-inkscape-font-specification:monospace;letter-spacing:0px;word-spacing:0px;fill:#33d17a;fill-opacity:1;stroke:none"
       id="flowRoot980"
       xml:space="preserve"><flowRegion
         id="flowRegion976"
         style="font-style:normal;font-variant:normal;font-weight:normal;font-stretch:normal;font-size:14.66666698px;font-family:monospace;-inkscape-font-specification:monospace;fill:#33d17a;fill-opacity:1"><rect
           y="369"
           x="225"
           height="74"
           width="384"
           id="rect974"
           style="font-style:normal;font-variant:normal;font-weight:normal;font-stretch:normal;font-size:14.66666698px;font-family:monospace;-inkscape-font-specification:monospace;fill:#33d17a;fill-opacity:1" /></flowRegion><flowPara
         style="font-style:normal;font-variant:normal;font-weight:normal;font-stretch:normal;font-size:14.66666698px;font-family:monospace;-inkscape-font-specification:monospace;fill:#33d17a;fill-opacity:1"
         id="flowPara978">light green</flowPara></flowRoot>    <flowRoot
       xml:space="preserve"
       id="flowRoot988"
       style="font-style:normal;font-variant:normal;font-weight:normal;font-stretch:normal;font-size:14.66666698px;line-height:1.25;font-family:monospace;-inkscape-font-specification:monospace;letter-spacing:0px;word-spacing:0px;fill:#f8e45c;fill-opacity:1;stroke:none"
       transform="matrix(0.26458333,0,0,0.26458333,46.037501,100.56138)"><flowRegion
         style="font-style:normal;font-variant:normal;font-weight:normal;font-stretch:normal;font-size:14.66666698px;font-family:monospace;-inkscape-font-specification:monospace;fill:#f8e45c;fill-opacity:1"
         id="flowRegion984"><rect
           style="font-style:normal;font-variant:normal;font-weight:normal;font-stretch:normal;font-size:14.66666698px;font-family:monospace;-inkscape-font-specification:monospace;fill:#f8e45c;fill-opacity:1"
           id="rect982"
           width="384"
           height="74"
           x="225"
           y="369" /></flowRegion><flowPara
         id="flowPara986"
         style="font-style:normal;font-variant:normal;font-weight:normal;font-stretch:normal;font-size:14.66666698px;font-family:monospace;-inkscape-font-specification:monospace;fill:#f8e45c;fill-opacity:1">light yellow</flowPara></flowRoot>    <flowRoot
       xml:space="preserve"
       id="flowRoot996"
       style="font-style:normal;font-variant:normal;font-weight:normal;font-stretch:normal;font-size:14.66666698px;line-height:1.25;font-family:monospace;-inkscape-font-specification:monospace;letter-spacing:0px;word-spacing:0px;fill:#1c71d8;fill-opacity:1;stroke:none"
       transform="matrix(0.26458333,0,0,0.26458333,46.037501,116.43638)"><flowRegion
         style="font-style:normal;font-variant:normal;font-weight:normal;font-stretch:normal;font-size:14.66666698px;font-family:monospace;-inkscape-font-specification:monospace;fill:#1c71d8;fill-opacity:1"
         id="flowRegion992"><rect
           style="font-style:normal;font-variant:normal;font-weight:normal;font-stretch:normal;font-size:14.66666698px;font-family:monospace;-inkscape-font-specification:monospace;fill:#1c71d8;fill-opacity:1"
           id="rect990"
           width="384"
           height="74"
           x="225"
           y="369" /></flowRegion><flowPara
         id="flowPara994"
         style="font-style:normal;font-variant:normal;font-weight:normal;font-stretch:normal;font-size:14.66666698px;font-family:monospace;-inkscape-font-specification:monospace;fill:#1c71d8;fill-opacity:1">light blue</flowPara></flowRoot>    <flowRoot
       transform="matrix(0.26458333,0,0,0.26458333,46.037501,132.31137)"
       style="font-style:normal;font-variant:normal;font-weight:normal;font-stretch:normal;font-size:14.66666698px;line-height:1.25;font-family:monospace;-inkscape-font-specification:monospace;letter-spacing:0px;word-spacing:0px;fill:#c061cb;fill-opacity:1;stroke:none"
       id="flowRoot1004"
       xml:space="preserve"><flowRegion
         id="flowRegion1000"
         style="font-style:normal;font-variant:normal;font-weight:normal;font-stretch:normal;font-size:14.66666698px;font-family:monospace;-inkscape-font-specification:monospace;fill:#c061cb;fill-opacity:1"><rect
           y="369"
           x="225"
           height="74"
           width="384"
           id="rect998"
           style="font-style:normal;font-variant:normal;font-weight:normal;font-stretch:normal;font-size:14.66666698px;font-family:monospace;-inkscape-font-specification:monospace;fill:#c061cb;fill-opacity:1" /></flowRegion><flowPara
         style="font-style:normal;font-variant:normal;font-weight:normal;font-stretch:normal;font-size:14.66666698px;font-family:monospace;-inkscape-font-specification:monospace;fill:#c061cb;fill-opacity:1"
         id="flowPara1002">light magenta</flowPara></flowRoot>    <flowRoot
       xml:space="preserve"
       id="flowRoot1012"
       style="font-style:normal;font-variant:normal;font-weight:normal;font-stretch:normal;font-size:14.66666698px;line-height:1.25;font-family:monospace;-inkscape-font-specification:monospace;letter-spacing:0px;word-spacing:0px;fill:#38daf3;fill-opacity:1;stroke:none"
       transform="matrix(0.26458333,0,0,0.26458333,46.037501,148.18637)"><flowRegion
         style="font-style:normal;font-variant:normal;font-weight:normal;font-stretch:normal;font-size:14.66666698px;font-family:monospace;-inkscape-font-specification:monospace;fill:#38daf3;fill-opacity:1"
         id="flowRegion1008"><rect
           style="font-style:normal;font-variant:normal;font-weight:normal;font-stretch:normal;font-size:14.66666698px;font-family:monospace;-inkscape-font-specification:monospace;fill:#38daf3;fill-opacity:1"
           id="rect1006"
           width="384"
           height="74"
           x="225"
           y="369" /></flowRegion><flowPara
         id="flowPara1010"
         style="font-style:normal;font-variant:normal;font-weight:normal;font-stretch:normal;font-size:14.66666698px;font-family:monospace;-inkscape-font-specification:monospace;fill:#38daf3;fill-opacity:1">light cyan</flowPara></flowRoot>    <rect
       style="fill:#1e1e1e;fill-opacity:1;stroke-width:0.62415868"
       id="rect1014"
       width="140.22917"
       height="150.8125"
       x="165.10004"
       y="134.54581" />
    <rect
       y="145.12918"
       x="178.32919"
       height="15.875"
       width="10.583333"
       id="rect1016"
       style="fill:#5e5c64;fill-opacity:1;stroke-width:0.05563209" />
    <rect
       style="fill:#ed333b;fill-opacity:1;stroke-width:0.05563207"
       id="rect1018"
       width="10.583333"
       height="15.874995"
       x="178.32919"
       y="161.0042" />
    <rect
       style="fill:#2ec27e;fill-opacity:1;stroke-width:0.05563207"
       id="rect1020"
       width="10.583333"
       height="15.874993"
       x="178.32919"
       y="176.87921" />
    <rect
       y="192.75417"
       x="178.32919"
       height="15.87499"
       width="10.583333"
       id="rect1022"
       style="fill:#f6d32d;fill-opacity:1;stroke-width:0.05563206" />
    <rect
       style="fill:#3584e4;fill-opacity:1;stroke-width:0.05563206"
       id="rect1024"
       width="10.583333"
       height="15.874987"
       x="178.32919"
       y="208.62918" />
    <rect
       y="224.5042"
       x="178.32919"
       height="15.87498"
       width="10.583333"
       id="rect1026"
       style="fill:#c061cb;fill-opacity:1;stroke-width:0.05563204" />
    <rect
       style="fill:#30b7cb;fill-opacity:1;stroke-width:0.05563204"
       id="rect1028"
       width="10.583333"
       height="15.87498"
       x="178.32919"
       y="240.37918" />
    <rect
       y="256.25418"
       x="178.32919"
       height="15.875"
       width="10.583333"
       id="rect1030"
       style="fill:#deddda;fill-opacity:1;stroke-width:0.05563209" />
    <rect
       style="fill:#9a9996;fill-opacity:1;stroke-width:0.05563209"
       id="rect1032"
       width="10.583333"
       height="15.875"
       x="241.82925"
       y="145.12918" />
    <rect
       y="161.0042"
       x="241.82925"
       height="15.874995"
       width="10.583333"
       id="rect1034"
       style="fill:#f66151;fill-opacity:1;stroke-width:0.05563207" />
    <rect
       style="fill:#57e389;fill-opacity:1;stroke-width:0.05563207"
       id="rect1036"
       width="10.583333"
       height="15.874993"
       x="241.82925"
       y="176.87921" />
    <rect
       y="192.7542"
       x="241.82925"
       height="15.87499"
       width="10.583333"
       id="rect1038"
       style="fill:#f8e45c;fill-opacity:1;stroke-width:0.05563206" />
    <rect
       style="fill:#62a0ea;fill-opacity:1;stroke-width:0.05563206"
       id="rect1040"
       width="10.583333"
       height="15.874987"
       x="241.82925"
       y="208.62921" />
    <rect
       y="224.50423"
       x="241.82925"
       height="15.87498"
       width="10.583333"
       id="rect1042"
       style="fill:#dc8add;fill-opacity:1;stroke-width:0.05563204" />
    <rect
       style="fill:#38daf3;fill-opacity:1;stroke-width:0.05563204"
       id="rect1044"
       width="10.583333"
       height="15.87498"
       x="241.82925"
       y="240.37921" />
    <flowRoot
       transform="matrix(0.26458333,0,0,0.26458333,135.99585,53.459128)"
       style="font-style:normal;font-variant:normal;font-weight:normal;font-stretch:normal;font-size:14.66666698px;line-height:1.25;font-family:monospace;-inkscape-font-specification:monospace;letter-spacing:0px;word-spacing:0px;fill:#5e5c64;fill-opacity:1;stroke:none;"
       id="flowRoot1052"
       xml:space="preserve"><flowRegion
         style="font-style:normal;font-variant:normal;font-weight:normal;font-stretch:normal;font-size:14.66666698px;font-family:monospace;-inkscape-font-specification:monospace;fill:#5e5c64;fill-opacity:1;"
         id="flowRegion1048"><rect
           style="font-style:normal;font-variant:normal;font-weight:normal;font-stretch:normal;font-size:14.66666698px;font-family:monospace;-inkscape-font-specification:monospace;fill:#5e5c64;fill-opacity:1;"
           y="369"
           x="225"
           height="74"
           width="384"
           id="rect1046" /></flowRegion><flowPara
         style="font-style:normal;font-variant:normal;font-weight:normal;font-stretch:normal;font-size:14.66666698px;font-family:monospace;-inkscape-font-specification:monospace;fill:#5e5c64;fill-opacity:1;"
         id="flowPara1050">black</flowPara></flowRoot>    <flowRoot
       xml:space="preserve"
       id="flowRoot1060"
       style="font-style:normal;font-variant:normal;font-weight:normal;font-stretch:normal;font-size:14.66666698px;line-height:1.25;font-family:monospace;-inkscape-font-specification:monospace;letter-spacing:0px;word-spacing:0px;fill:#ed333b;fill-opacity:1;stroke:none"
       transform="matrix(0.26458333,0,0,0.26458333,135.99585,69.323689)"><flowRegion
         style="font-style:normal;font-variant:normal;font-weight:normal;font-stretch:normal;font-size:14.66666698px;font-family:monospace;-inkscape-font-specification:monospace;fill:#ed333b;fill-opacity:1"
         id="flowRegion1056"><rect
           style="font-style:normal;font-variant:normal;font-weight:normal;font-stretch:normal;font-size:14.66666698px;font-family:monospace;-inkscape-font-specification:monospace;fill:#ed333b;fill-opacity:1"
           id="rect1054"
           width="384"
           height="74"
           x="225"
           y="369" /></flowRegion><flowPara
         id="flowPara1058"
         style="font-style:normal;font-variant:normal;font-weight:normal;font-stretch:normal;font-size:14.66666698px;font-family:monospace;-inkscape-font-specification:monospace;fill:#ed333b;fill-opacity:1">red</flowPara></flowRoot>    <flowRoot
       transform="matrix(0.26458333,0,0,0.26458333,135.99585,85.46328)"
       style="font-style:normal;font-variant:normal;font-weight:normal;font-stretch:normal;font-size:14.66666698px;line-height:1.25;font-family:monospace;-inkscape-font-specification:monospace;letter-spacing:0px;word-spacing:0px;fill:#2ec27e;fill-opacity:1;stroke:none;"
       id="flowRoot1068"
       xml:space="preserve"><flowRegion
         id="flowRegion1064"
         style="font-style:normal;font-variant:normal;font-weight:normal;font-stretch:normal;font-size:14.66666698px;font-family:monospace;-inkscape-font-specification:monospace;fill:#2ec27e;fill-opacity:1;"><rect
           y="369"
           x="225"
           height="74"
           width="384"
           id="rect1062"
           style="font-style:normal;font-variant:normal;font-weight:normal;font-stretch:normal;font-size:14.66666698px;font-family:monospace;-inkscape-font-specification:monospace;fill:#2ec27e;fill-opacity:1;" /></flowRegion><flowPara
         style="font-style:normal;font-variant:normal;font-weight:normal;font-stretch:normal;font-size:14.66666698px;font-family:monospace;-inkscape-font-specification:monospace;fill:#2ec27e;fill-opacity:1;"
         id="flowPara1066">green</flowPara></flowRoot>    <flowRoot
       xml:space="preserve"
       id="flowRoot1076"
       style="font-style:normal;font-variant:normal;font-weight:normal;font-stretch:normal;font-size:14.66666698px;line-height:1.25;font-family:monospace;-inkscape-font-specification:monospace;letter-spacing:0px;word-spacing:0px;fill:#f6d32d;fill-opacity:1;stroke:none"
       transform="matrix(0.26458333,0,0,0.26458333,135.99585,100.56138)"><flowRegion
         style="font-style:normal;font-variant:normal;font-weight:normal;font-stretch:normal;font-size:14.66666698px;font-family:monospace;-inkscape-font-specification:monospace;fill:#f6d32d;fill-opacity:1"
         id="flowRegion1072"><rect
           style="font-style:normal;font-variant:normal;font-weight:normal;font-stretch:normal;font-size:14.66666698px;font-family:monospace;-inkscape-font-specification:monospace;fill:#f6d32d;fill-opacity:1"
           id="rect1070"
           width="384"
           height="74"
           x="225"
           y="369" /></flowRegion><flowPara
         id="flowPara1074"
         style="font-style:normal;font-variant:normal;font-weight:normal;font-stretch:normal;font-size:14.66666698px;font-family:monospace;-inkscape-font-specification:monospace;fill:#f6d32d;fill-opacity:1">yellow</flowPara></flowRoot>    <flowRoot
       xml:space="preserve"
       id="flowRoot1084"
       style="font-style:normal;font-variant:normal;font-weight:normal;font-stretch:normal;font-size:14.66666698px;line-height:1.25;font-family:monospace;-inkscape-font-specification:monospace;letter-spacing:0px;word-spacing:0px;fill:#3584e4;fill-opacity:1;stroke:none"
       transform="matrix(0.26458333,0,0,0.26458333,135.99585,116.1718)"><flowRegion
         style="font-style:normal;font-variant:normal;font-weight:normal;font-stretch:normal;font-size:14.66666698px;font-family:monospace;-inkscape-font-specification:monospace;fill:#3584e4;fill-opacity:1"
         id="flowRegion1080"><rect
           style="font-style:normal;font-variant:normal;font-weight:normal;font-stretch:normal;font-size:14.66666698px;font-family:monospace;-inkscape-font-specification:monospace;fill:#3584e4;fill-opacity:1"
           id="rect1078"
           width="384"
           height="74"
           x="225"
           y="369" /></flowRegion><flowPara
         id="flowPara1082"
         style="font-style:normal;font-variant:normal;font-weight:normal;font-stretch:normal;font-size:14.66666698px;font-family:monospace;-inkscape-font-specification:monospace;fill:#3584e4;fill-opacity:1">blue</flowPara></flowRoot>    <flowRoot
       transform="matrix(0.26458333,0,0,0.26458333,135.99585,132.31137)"
       style="font-style:normal;font-variant:normal;font-weight:normal;font-stretch:normal;font-size:14.66666698px;line-height:1.25;font-family:monospace;-inkscape-font-specification:monospace;letter-spacing:0px;word-spacing:0px;fill:#c061cb;fill-opacity:1;stroke:none"
       id="flowRoot1092"
       xml:space="preserve"><flowRegion
         id="flowRegion1088"
         style="font-style:normal;font-variant:normal;font-weight:normal;font-stretch:normal;font-size:14.66666698px;font-family:monospace;-inkscape-font-specification:monospace;fill:#c061cb;fill-opacity:1"><rect
           y="369"
           x="225"
           height="74"
           width="384"
           id="rect1086"
           style="font-style:normal;font-variant:normal;font-weight:normal;font-stretch:normal;font-size:14.66666698px;font-family:monospace;-inkscape-font-specification:monospace;fill:#c061cb;fill-opacity:1" /></flowRegion><flowPara
         style="font-style:normal;font-variant:normal;font-weight:normal;font-stretch:normal;font-size:14.66666698px;font-family:monospace;-inkscape-font-specification:monospace;fill:#c061cb;fill-opacity:1"
         id="flowPara1090">magenta</flowPara></flowRoot>    <flowRoot
       xml:space="preserve"
       id="flowRoot1100"
       style="font-style:normal;font-variant:normal;font-weight:normal;font-stretch:normal;font-size:14.66666698px;line-height:1.25;font-family:monospace;-inkscape-font-specification:monospace;letter-spacing:0px;word-spacing:0px;fill:#30b7cb;fill-opacity:1;stroke:none"
       transform="matrix(0.26458333,0,0,0.26458333,135.99585,148.18637)"><flowRegion
         style="font-style:normal;font-variant:normal;font-weight:normal;font-stretch:normal;font-size:14.66666698px;font-family:monospace;-inkscape-font-specification:monospace;fill:#30b7cb;fill-opacity:1"
         id="flowRegion1096"><rect
           style="font-style:normal;font-variant:normal;font-weight:normal;font-stretch:normal;font-size:14.66666698px;font-family:monospace;-inkscape-font-specification:monospace;fill:#30b7cb;fill-opacity:1"
           id="rect1094"
           width="384"
           height="74"
           x="225"
           y="369" /></flowRegion><flowPara
         id="flowPara1098"
         style="font-style:normal;font-variant:normal;font-weight:normal;font-stretch:normal;font-size:14.66666698px;font-family:monospace;-inkscape-font-specification:monospace;fill:#30b7cb;fill-opacity:1">cyan</flowPara></flowRoot>    <flowRoot
       transform="matrix(0.26458333,0,0,0.26458333,135.99585,164.0614)"
       style="font-style:normal;font-variant:normal;font-weight:normal;font-stretch:normal;font-size:14.66666698px;line-height:1.25;font-family:monospace;-inkscape-font-specification:monospace;letter-spacing:0px;word-spacing:0px;fill:#deddda;fill-opacity:1;stroke:none"
       id="flowRoot1108"
       xml:space="preserve"><flowRegion
         id="flowRegion1104"
         style="font-style:normal;font-variant:normal;font-weight:normal;font-stretch:normal;font-size:14.66666698px;font-family:monospace;-inkscape-font-specification:monospace;fill:#deddda;fill-opacity:1"><rect
           y="369"
           x="225"
           height="74"
           width="384"
           id="rect1102"
           style="font-style:normal;font-variant:normal;font-weight:normal;font-stretch:normal;font-size:14.66666698px;font-family:monospace;-inkscape-font-specification:monospace;fill:#deddda;fill-opacity:1" /></flowRegion><flowPara
         style="font-style:normal;font-variant:normal;font-weight:normal;font-stretch:normal;font-size:14.66666698px;font-family:monospace;-inkscape-font-specification:monospace;fill:#deddda;fill-opacity:1"
         id="flowPara1106">light grey</flowPara></flowRoot>    <flowRoot
       xml:space="preserve"
       id="flowRoot1116"
       style="font-style:normal;font-variant:normal;font-weight:normal;font-stretch:normal;font-size:14.66666698px;line-height:1.25;font-family:monospace;-inkscape-font-specification:monospace;letter-spacing:0px;word-spacing:0px;fill:#9a9996;fill-opacity:1;stroke:none;"
       transform="matrix(0.26458333,0,0,0.26458333,199.49589,53.723708)"><flowRegion
         id="flowRegion1112"
         style="font-style:normal;font-variant:normal;font-weight:normal;font-stretch:normal;font-size:14.66666698px;font-family:monospace;-inkscape-font-specification:monospace;fill:#9a9996;fill-opacity:1;"><rect
           id="rect1110"
           width="384"
           height="74"
           x="225"
           y="369"
           style="font-style:normal;font-variant:normal;font-weight:normal;font-stretch:normal;font-size:14.66666698px;font-family:monospace;-inkscape-font-specification:monospace;fill:#9a9996;fill-opacity:1;" /></flowRegion><flowPara
         id="flowPara1114"
         style="font-style:normal;font-variant:normal;font-weight:normal;font-stretch:normal;font-size:14.66666698px;font-family:monospace;-inkscape-font-specification:monospace;fill:#9a9996;fill-opacity:1;">dark grey</flowPara></flowRoot>    <flowRoot
       transform="matrix(0.26458333,0,0,0.26458333,199.49589,69.588269)"
       style="font-style:normal;font-variant:normal;font-weight:normal;font-stretch:normal;font-size:14.66666698px;line-height:1.25;font-family:monospace;-inkscape-font-specification:monospace;letter-spacing:0px;word-spacing:0px;fill:#f66151;fill-opacity:1;stroke:none"
       id="flowRoot1124"
       xml:space="preserve"><flowRegion
         id="flowRegion1120"
         style="font-style:normal;font-variant:normal;font-weight:normal;font-stretch:normal;font-size:14.66666698px;font-family:monospace;-inkscape-font-specification:monospace;fill:#f66151;fill-opacity:1"><rect
           y="369"
           x="225"
           height="74"
           width="384"
           id="rect1118"
           style="font-style:normal;font-variant:normal;font-weight:normal;font-stretch:normal;font-size:14.66666698px;font-family:monospace;-inkscape-font-specification:monospace;fill:#f66151;fill-opacity:1" /></flowRegion><flowPara
         style="font-style:normal;font-variant:normal;font-weight:normal;font-stretch:normal;font-size:14.66666698px;font-family:monospace;-inkscape-font-specification:monospace;fill:#f66151;fill-opacity:1"
         id="flowPara1122">light red</flowPara></flowRoot>    <flowRoot
       xml:space="preserve"
       id="flowRoot1132"
       style="font-style:normal;font-variant:normal;font-weight:normal;font-stretch:normal;font-size:14.66666698px;line-height:1.25;font-family:monospace;-inkscape-font-specification:monospace;letter-spacing:0px;word-spacing:0px;fill:#33d17a;fill-opacity:1;stroke:none"
       transform="matrix(0.26458333,0,0,0.26458333,199.49589,85.46328)"><flowRegion
         style="font-style:normal;font-variant:normal;font-weight:normal;font-stretch:normal;font-size:14.66666698px;font-family:monospace;-inkscape-font-specification:monospace;fill:#33d17a;fill-opacity:1"
         id="flowRegion1128"><rect
           style="font-style:normal;font-variant:normal;font-weight:normal;font-stretch:normal;font-size:14.66666698px;font-family:monospace;-inkscape-font-specification:monospace;fill:#33d17a;fill-opacity:1"
           id="rect1126"
           width="384"
           height="74"
           x="225"
           y="369" /></flowRegion><flowPara
         id="flowPara1130"
         style="font-style:normal;font-variant:normal;font-weight:normal;font-stretch:normal;font-size:14.66666698px;font-family:monospace;-inkscape-font-specification:monospace;fill:#33d17a;fill-opacity:1">light green</flowPara></flowRoot>    <flowRoot
       transform="matrix(0.26458333,0,0,0.26458333,199.49589,100.56138)"
       style="font-style:normal;font-variant:normal;font-weight:normal;font-stretch:normal;font-size:14.66666698px;line-height:1.25;font-family:monospace;-inkscape-font-specification:monospace;letter-spacing:0px;word-spacing:0px;fill:#f8e45c;fill-opacity:1;stroke:none"
       id="flowRoot1140"
       xml:space="preserve"><flowRegion
         id="flowRegion1136"
         style="font-style:normal;font-variant:normal;font-weight:normal;font-stretch:normal;font-size:14.66666698px;font-family:monospace;-inkscape-font-specification:monospace;fill:#f8e45c;fill-opacity:1"><rect
           y="369"
           x="225"
           height="74"
           width="384"
           id="rect1134"
           style="font-style:normal;font-variant:normal;font-weight:normal;font-stretch:normal;font-size:14.66666698px;font-family:monospace;-inkscape-font-specification:monospace;fill:#f8e45c;fill-opacity:1" /></flowRegion><flowPara
         style="font-style:normal;font-variant:normal;font-weight:normal;font-stretch:normal;font-size:14.66666698px;font-family:monospace;-inkscape-font-specification:monospace;fill:#f8e45c;fill-opacity:1"
         id="flowPara1138">light yellow</flowPara></flowRoot>    <flowRoot
       transform="matrix(0.26458333,0,0,0.26458333,199.49589,116.43638)"
       style="font-style:normal;font-variant:normal;font-weight:normal;font-stretch:normal;font-size:14.66666698px;line-height:1.25;font-family:monospace;-inkscape-font-specification:monospace;letter-spacing:0px;word-spacing:0px;fill:#62a0ea;fill-opacity:1;stroke:none"
       id="flowRoot1148"
       xml:space="preserve"><flowRegion
         id="flowRegion1144"
         style="font-style:normal;font-variant:normal;font-weight:normal;font-stretch:normal;font-size:14.66666698px;font-family:monospace;-inkscape-font-specification:monospace;fill:#62a0ea;fill-opacity:1"><rect
           y="369"
           x="225"
           height="74"
           width="384"
           id="rect1142"
           style="font-style:normal;font-variant:normal;font-weight:normal;font-stretch:normal;font-size:14.66666698px;font-family:monospace;-inkscape-font-specification:monospace;fill:#62a0ea;fill-opacity:1" /></flowRegion><flowPara
         style="font-style:normal;font-variant:normal;font-weight:normal;font-stretch:normal;font-size:14.66666698px;font-family:monospace;-inkscape-font-specification:monospace;fill:#62a0ea;fill-opacity:1"
         id="flowPara1146">light blue</flowPara></flowRoot>    <flowRoot
       xml:space="preserve"
       id="flowRoot1156"
       style="font-style:normal;font-variant:normal;font-weight:normal;font-stretch:normal;font-size:14.66666698px;line-height:1.25;font-family:monospace;-inkscape-font-specification:monospace;letter-spacing:0px;word-spacing:0px;fill:#dc8add;fill-opacity:1;stroke:none"
       transform="matrix(0.26458333,0,0,0.26458333,199.49589,132.31137)"><flowRegion
         style="font-style:normal;font-variant:normal;font-weight:normal;font-stretch:normal;font-size:14.66666698px;font-family:monospace;-inkscape-font-specification:monospace;fill:#dc8add;fill-opacity:1"
         id="flowRegion1152"><rect
           style="font-style:normal;font-variant:normal;font-weight:normal;font-stretch:normal;font-size:14.66666698px;font-family:monospace;-inkscape-font-specification:monospace;fill:#dc8add;fill-opacity:1"
           id="rect1150"
           width="384"
           height="74"
           x="225"
           y="369" /></flowRegion><flowPara
         id="flowPara1154"
         style="font-style:normal;font-variant:normal;font-weight:normal;font-stretch:normal;font-size:14.66666698px;font-family:monospace;-inkscape-font-specification:monospace;fill:#dc8add;fill-opacity:1">light magenta</flowPara></flowRoot>    <flowRoot
       transform="matrix(0.26458333,0,0,0.26458333,199.49589,148.18637)"
       style="font-style:normal;font-variant:normal;font-weight:normal;font-stretch:normal;font-size:14.66666698px;line-height:1.25;font-family:monospace;-inkscape-font-specification:monospace;letter-spacing:0px;word-spacing:0px;fill:#38daf3;fill-opacity:1;stroke:none"
       id="flowRoot1164"
       xml:space="preserve"><flowRegion
         id="flowRegion1160"
         style="font-style:normal;font-variant:normal;font-weight:normal;font-stretch:normal;font-size:14.66666698px;font-family:monospace;-inkscape-font-specification:monospace;fill:#38daf3;fill-opacity:1"><rect
           y="369"
           x="225"
           height="74"
           width="384"
           id="rect1158"
           style="font-style:normal;font-variant:normal;font-weight:normal;font-stretch:normal;font-size:14.66666698px;font-family:monospace;-inkscape-font-specification:monospace;fill:#38daf3;fill-opacity:1" /></flowRegion><flowPara
         style="font-style:normal;font-variant:normal;font-weight:normal;font-stretch:normal;font-size:14.66666698px;font-family:monospace;-inkscape-font-specification:monospace;fill:#38daf3;fill-opacity:1"
         id="flowPara1162">light cyan</flowPara></flowRoot>    <rect
       y="-15.737464"
       x="165.10004"
       height="150.8125"
       width="140.22917"
       id="rect1166"
       style="fill:#ffffff;fill-opacity:1;stroke-width:0.62415868" />
    <rect
       style="fill:#241f31;fill-opacity:1;stroke-width:0.05563209"
       id="rect1168"
       width="10.583333"
       height="15.875"
       x="178.32919"
       y="-5.15413" />
    <rect
       y="10.720825"
       x="178.32919"
       height="15.874995"
       width="10.583333"
       id="rect1170"
       style="fill:#c01c28;fill-opacity:1;stroke-width:0.05563207" />
    <rect
       y="26.595823"
       x="178.32919"
       height="15.874993"
       width="10.583333"
       id="rect1172"
       style="fill:#218d5b;fill-opacity:1;stroke-width:0.05563207" />
    <rect
       style="fill:#d09609;fill-opacity:1;stroke-width:0.05563206"
       id="rect1174"
       width="10.583333"
       height="15.87499"
       x="178.32919"
       y="42.470779" />
    <rect
       y="58.345783"
       x="178.32919"
       height="15.874987"
       width="10.583333"
       id="rect1176"
       style="fill:#1a5fb4;fill-opacity:1;stroke-width:0.05563206" />
    <rect
       style="fill:#9141ac;fill-opacity:1;stroke-width:0.05563204"
       id="rect1178"
       width="10.583333"
       height="15.87498"
       x="178.32919"
       y="74.220711" />
    <rect
       y="90.095657"
       x="178.32919"
       height="15.87498"
       width="10.583333"
       id="rect1180"
       style="fill:#29878b;fill-opacity:1;stroke-width:0.05563204" />
    <rect
       style="fill:#9a9996;fill-opacity:1;stroke-width:0.05563209"
       id="rect1182"
       width="10.583333"
       height="15.875"
       x="178.32919"
       y="105.97066" />
    <rect
       y="-5.15413"
       x="241.82925"
       height="15.875"
       width="10.583333"
       id="rect1184"
       style="fill:#77767b;fill-opacity:1;stroke-width:0.05563209" />
    <rect
       style="fill:#e01b24;fill-opacity:1;stroke-width:0.05563207"
       id="rect1186"
       width="10.583333"
       height="15.874995"
       x="241.82925"
       y="10.720825" />
    <rect
       y="26.595823"
       x="241.82925"
       height="15.874993"
       width="10.583333"
       id="rect1188"
       style="fill:#26a269;fill-opacity:1;stroke-width:0.05563207" />
    <rect
       style="fill:#f5c211;fill-opacity:1;stroke-width:0.05563206"
       id="rect1190"
       width="10.583333"
       height="15.87499"
       x="241.82925"
       y="42.470825" />
    <rect
       y="58.345829"
       x="241.82925"
       height="15.874987"
       width="10.583333"
       id="rect1192"
       style="fill:#1c71d8;fill-opacity:1;stroke-width:0.05563206" />
    <rect
       style="fill:#c061cb;fill-opacity:1;stroke-width:0.05563204"
       id="rect1194"
       width="10.583333"
       height="15.87498"
       x="241.82925"
       y="74.220779" />
    <rect
       y="90.095703"
       x="241.82925"
       height="15.87498"
       width="10.583333"
       id="rect1196"
       style="fill:#0a95ae;fill-opacity:1;stroke-width:0.05563204" />
    <flowRoot
       xml:space="preserve"
       id="flowRoot1204"
       style="font-style:normal;font-variant:normal;font-weight:normal;font-stretch:normal;font-size:14.66666698px;line-height:1.25;font-family:monospace;-inkscape-font-specification:monospace;letter-spacing:0px;word-spacing:0px;fill:#241f31;fill-opacity:1;stroke:none;"
       transform="matrix(0.26458333,0,0,0.26458333,135.99585,-96.82422)"><flowRegion
         id="flowRegion1200"
         style="font-style:normal;font-variant:normal;font-weight:normal;font-stretch:normal;font-size:14.66666698px;font-family:monospace;-inkscape-font-specification:monospace;fill:#241f31;fill-opacity:1;"><rect
           id="rect1198"
           width="384"
           height="74"
           x="225"
           y="369"
           style="font-style:normal;font-variant:normal;font-weight:normal;font-stretch:normal;font-size:14.66666698px;font-family:monospace;-inkscape-font-specification:monospace;fill:#241f31;fill-opacity:1;" /></flowRegion><flowPara
         id="flowPara1202"
         style="font-style:normal;font-variant:normal;font-weight:normal;font-stretch:normal;font-size:14.66666698px;font-family:monospace;-inkscape-font-specification:monospace;fill:#241f31;fill-opacity:1;">black</flowPara></flowRoot>    <flowRoot
       transform="matrix(0.26458333,0,0,0.26458333,135.99585,-80.959659)"
       style="font-style:normal;font-variant:normal;font-weight:normal;font-stretch:normal;font-size:14.66666698px;line-height:1.25;font-family:monospace;-inkscape-font-specification:monospace;letter-spacing:0px;word-spacing:0px;fill:#c01c28;fill-opacity:1;stroke:none"
       id="flowRoot1212"
       xml:space="preserve"><flowRegion
         id="flowRegion1208"
         style="font-style:normal;font-variant:normal;font-weight:normal;font-stretch:normal;font-size:14.66666698px;font-family:monospace;-inkscape-font-specification:monospace;fill:#c01c28;fill-opacity:1"><rect
           y="369"
           x="225"
           height="74"
           width="384"
           id="rect1206"
           style="font-style:normal;font-variant:normal;font-weight:normal;font-stretch:normal;font-size:14.66666698px;font-family:monospace;-inkscape-font-specification:monospace;fill:#c01c28;fill-opacity:1" /></flowRegion><flowPara
         style="font-style:normal;font-variant:normal;font-weight:normal;font-stretch:normal;font-size:14.66666698px;font-family:monospace;-inkscape-font-specification:monospace;fill:#c01c28;fill-opacity:1"
         id="flowPara1210">red</flowPara></flowRoot>    <flowRoot
       xml:space="preserve"
       id="flowRoot1220"
       style="font-style:normal;font-variant:normal;font-weight:normal;font-stretch:normal;font-size:14.66666698px;line-height:1.25;font-family:monospace;-inkscape-font-specification:monospace;letter-spacing:0px;word-spacing:0px;fill:#26a269;fill-opacity:1;stroke:none"
       transform="matrix(0.26458333,0,0,0.26458333,135.99585,-64.820068)"><flowRegion
         style="font-style:normal;font-variant:normal;font-weight:normal;font-stretch:normal;font-size:14.66666698px;font-family:monospace;-inkscape-font-specification:monospace;fill:#26a269;fill-opacity:1"
         id="flowRegion1216"><rect
           style="font-style:normal;font-variant:normal;font-weight:normal;font-stretch:normal;font-size:14.66666698px;font-family:monospace;-inkscape-font-specification:monospace;fill:#26a269;fill-opacity:1"
           id="rect1214"
           width="384"
           height="74"
           x="225"
           y="369" /></flowRegion><flowPara
         id="flowPara1218"
         style="font-style:normal;font-variant:normal;font-weight:normal;font-stretch:normal;font-size:14.66666698px;font-family:monospace;-inkscape-font-specification:monospace;fill:#26a269;fill-opacity:1">green</flowPara></flowRoot>    <flowRoot
       transform="matrix(0.26458333,0,0,0.26458333,135.99585,-49.721968)"
       style="font-style:normal;font-variant:normal;font-weight:normal;font-stretch:normal;font-size:14.66666698px;line-height:1.25;font-family:monospace;-inkscape-font-specification:monospace;letter-spacing:0px;word-spacing:0px;fill:#d09609;fill-opacity:1;stroke:none;"
       id="flowRoot1228"
       xml:space="preserve"><flowRegion
         id="flowRegion1224"
         style="font-style:normal;font-variant:normal;font-weight:normal;font-stretch:normal;font-size:14.66666698px;font-family:monospace;-inkscape-font-specification:monospace;fill:#d09609;fill-opacity:1;"><rect
           y="369"
           x="225"
           height="74"
           width="384"
           id="rect1222"
           style="font-style:normal;font-variant:normal;font-weight:normal;font-stretch:normal;font-size:14.66666698px;font-family:monospace;-inkscape-font-specification:monospace;fill:#d09609;fill-opacity:1;" /></flowRegion><flowPara
         style="font-style:normal;font-variant:normal;font-weight:normal;font-stretch:normal;font-size:14.66666698px;font-family:monospace;-inkscape-font-specification:monospace;fill:#d09609;fill-opacity:1;"
         id="flowPara1226">yellow</flowPara></flowRoot>    <flowRoot
       transform="matrix(0.26458333,0,0,0.26458333,135.99585,-34.111557)"
       style="font-style:normal;font-variant:normal;font-weight:normal;font-stretch:normal;font-size:14.66666698px;line-height:1.25;font-family:monospace;-inkscape-font-specification:monospace;letter-spacing:0px;word-spacing:0px;fill:#1a5fb4;fill-opacity:1;stroke:none"
       id="flowRoot1236"
       xml:space="preserve"><flowRegion
         id="flowRegion1232"
         style="font-style:normal;font-variant:normal;font-weight:normal;font-stretch:normal;font-size:14.66666698px;font-family:monospace;-inkscape-font-specification:monospace;fill:#1a5fb4;fill-opacity:1"><rect
           y="369"
           x="225"
           height="74"
           width="384"
           id="rect1230"
           style="font-style:normal;font-variant:normal;font-weight:normal;font-stretch:normal;font-size:14.66666698px;font-family:monospace;-inkscape-font-specification:monospace;fill:#1a5fb4;fill-opacity:1" /></flowRegion><flowPara
         style="font-style:normal;font-variant:normal;font-weight:normal;font-stretch:normal;font-size:14.66666698px;font-family:monospace;-inkscape-font-specification:monospace;fill:#1a5fb4;fill-opacity:1"
         id="flowPara1234">blue</flowPara></flowRoot>    <flowRoot
       xml:space="preserve"
       id="flowRoot1244"
       style="font-style:normal;font-variant:normal;font-weight:normal;font-stretch:normal;font-size:14.66666698px;line-height:1.25;font-family:monospace;-inkscape-font-specification:monospace;letter-spacing:0px;word-spacing:0px;fill:#9141ac;fill-opacity:1;stroke:none"
       transform="matrix(0.26458333,0,0,0.26458333,135.99585,-17.971976)"><flowRegion
         style="font-style:normal;font-variant:normal;font-weight:normal;font-stretch:normal;font-size:14.66666698px;font-family:monospace;-inkscape-font-specification:monospace;fill:#9141ac;fill-opacity:1"
         id="flowRegion1240"><rect
           style="font-style:normal;font-variant:normal;font-weight:normal;font-stretch:normal;font-size:14.66666698px;font-family:monospace;-inkscape-font-specification:monospace;fill:#9141ac;fill-opacity:1"
           id="rect1238"
           width="384"
           height="74"
           x="225"
           y="369" /></flowRegion><flowPara
         id="flowPara1242"
         style="font-style:normal;font-variant:normal;font-weight:normal;font-stretch:normal;font-size:14.66666698px;font-family:monospace;-inkscape-font-specification:monospace;fill:#9141ac;fill-opacity:1">magenta</flowPara></flowRoot>    <flowRoot
       transform="matrix(0.26458333,0,0,0.26458333,135.99585,-2.0969853)"
       style="font-style:normal;font-variant:normal;font-weight:normal;font-stretch:normal;font-size:14.66666698px;line-height:1.25;font-family:monospace;-inkscape-font-specification:monospace;letter-spacing:0px;word-spacing:0px;fill:#29878b;fill-opacity:1;stroke:none;"
       id="flowRoot1252"
       xml:space="preserve"><flowRegion
         id="flowRegion1248"
         style="font-style:normal;font-variant:normal;font-weight:normal;font-stretch:normal;font-size:14.66666698px;font-family:monospace;-inkscape-font-specification:monospace;fill:#29878b;fill-opacity:1;"><rect
           y="369"
           x="225"
           height="74"
           width="384"
           id="rect1246"
           style="font-style:normal;font-variant:normal;font-weight:normal;font-stretch:normal;font-size:14.66666698px;font-family:monospace;-inkscape-font-specification:monospace;fill:#29878b;fill-opacity:1;" /></flowRegion><flowPara
         style="font-style:normal;font-variant:normal;font-weight:normal;font-stretch:normal;font-size:14.66666698px;font-family:monospace;-inkscape-font-specification:monospace;fill:#29878b;fill-opacity:1;"
         id="flowPara1250">cyan</flowPara></flowRoot>    <flowRoot
       xml:space="preserve"
       id="flowRoot1260"
       style="font-style:normal;font-variant:normal;font-weight:normal;font-stretch:normal;font-size:14.66666698px;line-height:1.25;font-family:monospace;-inkscape-font-specification:monospace;letter-spacing:0px;word-spacing:0px;fill:#9a9996;fill-opacity:1;stroke:none;"
       transform="matrix(0.26458333,0,0,0.26458333,135.99585,13.778035)"><flowRegion
         style="font-style:normal;font-variant:normal;font-weight:normal;font-stretch:normal;font-size:14.66666698px;font-family:monospace;-inkscape-font-specification:monospace;fill:#9a9996;fill-opacity:1;"
         id="flowRegion1256"><rect
           style="font-style:normal;font-variant:normal;font-weight:normal;font-stretch:normal;font-size:14.66666698px;font-family:monospace;-inkscape-font-specification:monospace;fill:#9a9996;fill-opacity:1;"
           id="rect1254"
           width="384"
           height="74"
           x="225"
           y="369" /></flowRegion><flowPara
         id="flowPara1258"
         style="font-style:normal;font-variant:normal;font-weight:normal;font-stretch:normal;font-size:14.66666698px;font-family:monospace;-inkscape-font-specification:monospace;fill:#9a9996;fill-opacity:1;">light grey</flowPara></flowRoot>    <flowRoot
       transform="matrix(0.26458333,0,0,0.26458333,199.49589,-96.55964)"
       style="font-style:normal;font-variant:normal;font-weight:normal;font-stretch:normal;font-size:14.66666698px;line-height:1.25;font-family:monospace;-inkscape-font-specification:monospace;letter-spacing:0px;word-spacing:0px;fill:#77767b;fill-opacity:1;stroke:none"
       id="flowRoot1268"
       xml:space="preserve"><flowRegion
         style="font-style:normal;font-variant:normal;font-weight:normal;font-stretch:normal;font-size:14.66666698px;font-family:monospace;-inkscape-font-specification:monospace;fill:#77767b;fill-opacity:1"
         id="flowRegion1264"><rect
           style="font-style:normal;font-variant:normal;font-weight:normal;font-stretch:normal;font-size:14.66666698px;font-family:monospace;-inkscape-font-specification:monospace;fill:#77767b;fill-opacity:1"
           y="369"
           x="225"
           height="74"
           width="384"
           id="rect1262" /></flowRegion><flowPara
         style="font-style:normal;font-variant:normal;font-weight:normal;font-stretch:normal;font-size:14.66666698px;font-family:monospace;-inkscape-font-specification:monospace;fill:#77767b;fill-opacity:1"
         id="flowPara1266">dark grey</flowPara></flowRoot>    <flowRoot
       xml:space="preserve"
       id="flowRoot1276"
       style="font-style:normal;font-variant:normal;font-weight:normal;font-stretch:normal;font-size:14.66666698px;line-height:1.25;font-family:monospace;-inkscape-font-specification:monospace;letter-spacing:0px;word-spacing:0px;fill:#e01b24;fill-opacity:1;stroke:none"
       transform="matrix(0.26458333,0,0,0.26458333,199.49589,-80.695079)"><flowRegion
         style="font-style:normal;font-variant:normal;font-weight:normal;font-stretch:normal;font-size:14.66666698px;font-family:monospace;-inkscape-font-specification:monospace;fill:#e01b24;fill-opacity:1"
         id="flowRegion1272"><rect
           style="font-style:normal;font-variant:normal;font-weight:normal;font-stretch:normal;font-size:14.66666698px;font-family:monospace;-inkscape-font-specification:monospace;fill:#e01b24;fill-opacity:1"
           id="rect1270"
           width="384"
           height="74"
           x="225"
           y="369" /></flowRegion><flowPara
         id="flowPara1274"
         style="font-style:normal;font-variant:normal;font-weight:normal;font-stretch:normal;font-size:14.66666698px;font-family:monospace;-inkscape-font-specification:monospace;fill:#e01b24;fill-opacity:1">light red</flowPara></flowRoot>    <flowRoot
       transform="matrix(0.26458333,0,0,0.26458333,199.49589,-64.820068)"
       style="font-style:normal;font-variant:normal;font-weight:normal;font-stretch:normal;font-size:14.66666698px;line-height:1.25;font-family:monospace;-inkscape-font-specification:monospace;letter-spacing:0px;word-spacing:0px;fill:#26a269;fill-opacity:1;stroke:none;"
       id="flowRoot1284"
       xml:space="preserve"><flowRegion
         id="flowRegion1280"
         style="font-style:normal;font-variant:normal;font-weight:normal;font-stretch:normal;font-size:14.66666698px;font-family:monospace;-inkscape-font-specification:monospace;fill:#26a269;fill-opacity:1;"><rect
           y="369"
           x="225"
           height="74"
           width="384"
           id="rect1278"
           style="font-style:normal;font-variant:normal;font-weight:normal;font-stretch:normal;font-size:14.66666698px;font-family:monospace;-inkscape-font-specification:monospace;fill:#26a269;fill-opacity:1;" /></flowRegion><flowPara
         style="font-style:normal;font-variant:normal;font-weight:normal;font-stretch:normal;font-size:14.66666698px;font-family:monospace;-inkscape-font-specification:monospace;fill:#26a269;fill-opacity:1;"
         id="flowPara1282">light green</flowPara></flowRoot>    <flowRoot
       xml:space="preserve"
       id="flowRoot1292"
       style="font-style:normal;font-variant:normal;font-weight:normal;font-stretch:normal;font-size:14.66666698px;line-height:1.25;font-family:monospace;-inkscape-font-specification:monospace;letter-spacing:0px;word-spacing:0px;fill:#e5a50a;fill-opacity:1;stroke:none;"
       transform="matrix(0.26458333,0,0,0.26458333,199.49589,-49.721968)"><flowRegion
         style="font-style:normal;font-variant:normal;font-weight:normal;font-stretch:normal;font-size:14.66666698px;font-family:monospace;-inkscape-font-specification:monospace;fill:#e5a50a;fill-opacity:1;"
         id="flowRegion1288"><rect
           style="font-style:normal;font-variant:normal;font-weight:normal;font-stretch:normal;font-size:14.66666698px;font-family:monospace;-inkscape-font-specification:monospace;fill:#e5a50a;fill-opacity:1;"
           id="rect1286"
           width="384"
           height="74"
           x="225"
           y="369" /></flowRegion><flowPara
         id="flowPara1290"
         style="font-style:normal;font-variant:normal;font-weight:normal;font-stretch:normal;font-size:14.66666698px;font-family:monospace;-inkscape-font-specification:monospace;fill:#e5a50a;fill-opacity:1;">light yellow</flowPara></flowRoot>    <flowRoot
       xml:space="preserve"
       id="flowRoot1300"
       style="font-style:normal;font-variant:normal;font-weight:normal;font-stretch:normal;font-size:14.66666698px;line-height:1.25;font-family:monospace;-inkscape-font-specification:monospace;letter-spacing:0px;word-spacing:0px;fill:#1c71d8;fill-opacity:1;stroke:none;"
       transform="matrix(0.26458333,0,0,0.26458333,199.49589,-33.846977)"><flowRegion
         style="font-style:normal;font-variant:normal;font-weight:normal;font-stretch:normal;font-size:14.66666698px;font-family:monospace;-inkscape-font-specification:monospace;fill:#1c71d8;fill-opacity:1;"
         id="flowRegion1296"><rect
           style="font-style:normal;font-variant:normal;font-weight:normal;font-stretch:normal;font-size:14.66666698px;font-family:monospace;-inkscape-font-specification:monospace;fill:#1c71d8;fill-opacity:1;"
           id="rect1294"
           width="384"
           height="74"
           x="225"
           y="369" /></flowRegion><flowPara
         id="flowPara1298"
         style="font-style:normal;font-variant:normal;font-weight:normal;font-stretch:normal;font-size:14.66666698px;font-family:monospace;-inkscape-font-specification:monospace;fill:#1c71d8;fill-opacity:1;">light blue</flowPara></flowRoot>    <flowRoot
       transform="matrix(0.26458333,0,0,0.26458333,199.49589,-17.971976)"
       style="font-style:normal;font-variant:normal;font-weight:normal;font-stretch:normal;font-size:14.66666698px;line-height:1.25;font-family:monospace;-inkscape-font-specification:monospace;letter-spacing:0px;word-spacing:0px;fill:#c061cb;fill-opacity:1;stroke:none"
       id="flowRoot1308"
       xml:space="preserve"><flowRegion
         id="flowRegion1304"
         style="font-style:normal;font-variant:normal;font-weight:normal;font-stretch:normal;font-size:14.66666698px;font-family:monospace;-inkscape-font-specification:monospace;fill:#c061cb;fill-opacity:1"><rect
           y="369"
           x="225"
           height="74"
           width="384"
           id="rect1302"
           style="font-style:normal;font-variant:normal;font-weight:normal;font-stretch:normal;font-size:14.66666698px;font-family:monospace;-inkscape-font-specification:monospace;fill:#c061cb;fill-opacity:1" /></flowRegion><flowPara
         style="font-style:normal;font-variant:normal;font-weight:normal;font-stretch:normal;font-size:14.66666698px;font-family:monospace;-inkscape-font-specification:monospace;fill:#c061cb;fill-opacity:1"
         id="flowPara1306">light magenta</flowPara></flowRoot>    <flowRoot
       xml:space="preserve"
       id="flowRoot1316"
       style="font-style:normal;font-variant:normal;font-weight:normal;font-stretch:normal;font-size:14.66666698px;line-height:1.25;font-family:monospace;-inkscape-font-specification:monospace;letter-spacing:0px;word-spacing:0px;fill:#0a95ae;fill-opacity:1;stroke:none;"
       transform="matrix(0.26458333,0,0,0.26458333,199.49589,-2.0969853)"><flowRegion
         style="font-style:normal;font-variant:normal;font-weight:normal;font-stretch:normal;font-size:14.66666698px;font-family:monospace;-inkscape-font-specification:monospace;fill:#0a95ae;fill-opacity:1;"
         id="flowRegion1312"><rect
           style="font-style:normal;font-variant:normal;font-weight:normal;font-stretch:normal;font-size:14.66666698px;font-family:monospace;-inkscape-font-specification:monospace;fill:#0a95ae;fill-opacity:1;"
           id="rect1310"
           width="384"
           height="74"
           x="225"
           y="369" /></flowRegion><flowPara
         id="flowPara1314"
         style="font-style:normal;font-variant:normal;font-weight:normal;font-stretch:normal;font-size:14.66666698px;font-family:monospace;-inkscape-font-specification:monospace;fill:#0a95ae;fill-opacity:1;">light cyan</flowPara></flowRoot>    <rect
       style="fill:#ffffff;fill-opacity:1;stroke-width:0.62415874"
       id="rect1318"
       width="140.22917"
       height="150.8125"
       x="11.641668"
       y="-15.73751" />
    <rect
       y="-5.1541758"
       x="24.870834"
       height="15.875"
       width="10.583333"
       id="rect1320"
       style="fill:#241f31;fill-opacity:1;stroke-width:0.05563209" />
    <rect
       style="fill:#c01c28;fill-opacity:1;stroke-width:0.05563207"
       id="rect1322"
       width="10.583333"
       height="15.874995"
       x="24.870834"
       y="10.720795" />
    <rect
       style="fill:#26a269;fill-opacity:1;stroke-width:0.05563207"
       id="rect1324"
       width="10.583333"
       height="15.874993"
       x="24.870834"
       y="26.595793" />
    <rect
       y="42.470749"
       x="24.870834"
       height="15.87499"
       width="10.583333"
       id="rect1326"
       style="fill:#b5835a;fill-opacity:1;stroke-width:0.05563206" />
    <rect
       style="fill:#1e5098;fill-opacity:1;stroke-width:0.05563206"
       id="rect1328"
       width="10.583333"
       height="15.874987"
       x="24.870834"
       y="58.345745" />
    <rect
       y="74.220741"
       x="24.870834"
       height="15.87498"
       width="10.583333"
       id="rect1330"
       style="fill:#a347ba;fill-opacity:1;stroke-width:0.05563204" />
    <rect
       style="fill:#30b7cb;fill-opacity:1;stroke-width:0.05563204"
       id="rect1332"
       width="10.583333"
       height="15.87498"
       x="24.870834"
       y="90.095734" />
    <rect
       y="105.97073"
       x="24.870834"
       height="15.875"
       width="10.583333"
       id="rect1334"
       style="fill:#deddda;fill-opacity:1;stroke-width:0.05563209" />
    <rect
       style="fill:#5e5c64;fill-opacity:1;stroke-width:0.05563209"
       id="rect1336"
       width="10.583333"
       height="15.875"
       x="88.370819"
       y="-5.1541758" />
    <rect
       y="10.720825"
       x="88.370819"
       height="15.874995"
       width="10.583333"
       id="rect1338"
       style="fill:#ed333b;fill-opacity:1;stroke-width:0.05563207" />
    <rect
       style="fill:#33d17a;fill-opacity:1;stroke-width:0.05563207"
       id="rect1340"
       width="10.583333"
       height="15.874993"
       x="88.370819"
       y="26.595793" />
    <rect
       y="42.470779"
       x="88.370819"
       height="15.87499"
       width="10.583333"
       id="rect1342"
       style="fill:#f8e45c;fill-opacity:1;stroke-width:0.05563206" />
    <rect
       style="fill:#1c71d8;fill-opacity:1;stroke-width:0.05563206"
       id="rect1344"
       width="10.583333"
       height="15.874987"
       x="88.370819"
       y="58.345783" />
    <rect
       y="74.220779"
       x="88.370819"
       height="15.87498"
       width="10.583333"
       id="rect1346"
       style="fill:#c061cb;fill-opacity:1;stroke-width:0.05563204" />
    <rect
       style="fill:#38daf3;fill-opacity:1;stroke-width:0.05563204"
       id="rect1348"
       width="10.583333"
       height="15.87498"
       x="88.370819"
       y="90.095741" />
    <flowRoot
       transform="matrix(0.26458333,0,0,0.26458333,-17.462501,-96.82421)"
       style="font-style:normal;font-variant:normal;font-weight:normal;font-stretch:normal;font-size:14.66666698px;line-height:1.25;font-family:monospace;-inkscape-font-specification:monospace;letter-spacing:0px;word-spacing:0px;fill:#000000;fill-opacity:1;stroke:none"
       id="flowRoot1356"
       xml:space="preserve"><flowRegion
         style="font-style:normal;font-variant:normal;font-weight:normal;font-stretch:normal;font-size:14.66666698px;font-family:monospace;-inkscape-font-specification:monospace"
         id="flowRegion1352"><rect
           style="font-style:normal;font-variant:normal;font-weight:normal;font-stretch:normal;font-size:14.66666698px;font-family:monospace;-inkscape-font-specification:monospace"
           y="369"
           x="225"
           height="74"
           width="384"
           id="rect1350" /></flowRegion><flowPara
         style="font-style:normal;font-variant:normal;font-weight:normal;font-stretch:normal;font-size:14.66666698px;font-family:monospace;-inkscape-font-specification:monospace"
         id="flowPara1354">black</flowPara></flowRoot>    <flowRoot
       xml:space="preserve"
       id="flowRoot1364"
       style="font-style:normal;font-variant:normal;font-weight:normal;font-stretch:normal;font-size:14.66666698px;line-height:1.25;font-family:monospace;-inkscape-font-specification:monospace;letter-spacing:0px;word-spacing:0px;fill:#c01c28;fill-opacity:1;stroke:none"
       transform="matrix(0.26458333,0,0,0.26458333,-17.462501,-80.959649)"><flowRegion
         style="font-style:normal;font-variant:normal;font-weight:normal;font-stretch:normal;font-size:14.66666698px;font-family:monospace;-inkscape-font-specification:monospace;fill:#c01c28;fill-opacity:1"
         id="flowRegion1360"><rect
           style="font-style:normal;font-variant:normal;font-weight:normal;font-stretch:normal;font-size:14.66666698px;font-family:monospace;-inkscape-font-specification:monospace;fill:#c01c28;fill-opacity:1"
           id="rect1358"
           width="384"
           height="74"
           x="225"
           y="369" /></flowRegion><flowPara
         id="flowPara1362"
         style="font-style:normal;font-variant:normal;font-weight:normal;font-stretch:normal;font-size:14.66666698px;font-family:monospace;-inkscape-font-specification:monospace;fill:#c01c28;fill-opacity:1">red</flowPara></flowRoot>    <flowRoot
       transform="matrix(0.26458333,0,0,0.26458333,-17.462501,-64.820054)"
       style="font-style:normal;font-variant:normal;font-weight:normal;font-stretch:normal;font-size:14.66666698px;line-height:1.25;font-family:monospace;-inkscape-font-specification:monospace;letter-spacing:0px;word-spacing:0px;fill:#26a269;fill-opacity:1;stroke:none"
       id="flowRoot1372"
       xml:space="preserve"><flowRegion
         id="flowRegion1368"
         style="font-style:normal;font-variant:normal;font-weight:normal;font-stretch:normal;font-size:14.66666698px;font-family:monospace;-inkscape-font-specification:monospace;fill:#26a269;fill-opacity:1"><rect
           y="369"
           x="225"
           height="74"
           width="384"
           id="rect1366"
           style="font-style:normal;font-variant:normal;font-weight:normal;font-stretch:normal;font-size:14.66666698px;font-family:monospace;-inkscape-font-specification:monospace;fill:#26a269;fill-opacity:1" /></flowRegion><flowPara
         style="font-style:normal;font-variant:normal;font-weight:normal;font-stretch:normal;font-size:14.66666698px;font-family:monospace;-inkscape-font-specification:monospace;fill:#26a269;fill-opacity:1"
         id="flowPara1370">green</flowPara></flowRoot>    <flowRoot
       xml:space="preserve"
       id="flowRoot1380"
       style="font-style:normal;font-variant:normal;font-weight:normal;font-stretch:normal;font-size:14.66666698px;line-height:1.25;font-family:monospace;-inkscape-font-specification:monospace;letter-spacing:0px;word-spacing:0px;fill:#b5835a;fill-opacity:1;stroke:none"
       transform="matrix(0.26458333,0,0,0.26458333,-17.462501,-49.721955)"><flowRegion
         style="font-style:normal;font-variant:normal;font-weight:normal;font-stretch:normal;font-size:14.66666698px;font-family:monospace;-inkscape-font-specification:monospace;fill:#b5835a;fill-opacity:1"
         id="flowRegion1376"><rect
           style="font-style:normal;font-variant:normal;font-weight:normal;font-stretch:normal;font-size:14.66666698px;font-family:monospace;-inkscape-font-specification:monospace;fill:#b5835a;fill-opacity:1"
           id="rect1374"
           width="384"
           height="74"
           x="225"
           y="369" /></flowRegion><flowPara
         id="flowPara1378"
         style="font-style:normal;font-variant:normal;font-weight:normal;font-stretch:normal;font-size:14.66666698px;font-family:monospace;-inkscape-font-specification:monospace;fill:#b5835a;fill-opacity:1">yellow</flowPara></flowRoot>    <flowRoot
       xml:space="preserve"
       id="flowRoot1388"
       style="font-style:normal;font-variant:normal;font-weight:normal;font-stretch:normal;font-size:14.66666698px;line-height:1.25;font-family:monospace;-inkscape-font-specification:monospace;letter-spacing:0px;word-spacing:0px;fill:#1e5098;fill-opacity:1;stroke:none"
       transform="matrix(0.26458333,0,0,0.26458333,-17.462501,-34.111547)"><flowRegion
         style="font-style:normal;font-variant:normal;font-weight:normal;font-stretch:normal;font-size:14.66666698px;font-family:monospace;-inkscape-font-specification:monospace;fill:#1e5098;fill-opacity:1"
         id="flowRegion1384"><rect
           style="font-style:normal;font-variant:normal;font-weight:normal;font-stretch:normal;font-size:14.66666698px;font-family:monospace;-inkscape-font-specification:monospace;fill:#1e5098;fill-opacity:1"
           id="rect1382"
           width="384"
           height="74"
           x="225"
           y="369" /></flowRegion><flowPara
         id="flowPara1386"
         style="font-style:normal;font-variant:normal;font-weight:normal;font-stretch:normal;font-size:14.66666698px;font-family:monospace;-inkscape-font-specification:monospace;fill:#1e5098;fill-opacity:1">blue</flowPara></flowRoot>    <flowRoot
       transform="matrix(0.26458333,0,0,0.26458333,-17.462501,-17.971966)"
       style="font-style:normal;font-variant:normal;font-weight:normal;font-stretch:normal;font-size:14.66666698px;line-height:1.25;font-family:monospace;-inkscape-font-specification:monospace;letter-spacing:0px;word-spacing:0px;fill:#a347ba;fill-opacity:1;stroke:none"
       id="flowRoot1396"
       xml:space="preserve"><flowRegion
         id="flowRegion1392"
         style="font-style:normal;font-variant:normal;font-weight:normal;font-stretch:normal;font-size:14.66666698px;font-family:monospace;-inkscape-font-specification:monospace;fill:#a347ba;fill-opacity:1"><rect
           y="369"
           x="225"
           height="74"
           width="384"
           id="rect1390"
           style="font-style:normal;font-variant:normal;font-weight:normal;font-stretch:normal;font-size:14.66666698px;font-family:monospace;-inkscape-font-specification:monospace;fill:#a347ba;fill-opacity:1" /></flowRegion><flowPara
         style="font-style:normal;font-variant:normal;font-weight:normal;font-stretch:normal;font-size:14.66666698px;font-family:monospace;-inkscape-font-specification:monospace;fill:#a347ba;fill-opacity:1"
         id="flowPara1394">magenta</flowPara></flowRoot>    <flowRoot
       xml:space="preserve"
       id="flowRoot1404"
       style="font-style:normal;font-variant:normal;font-weight:normal;font-stretch:normal;font-size:14.66666698px;line-height:1.25;font-family:monospace;-inkscape-font-specification:monospace;letter-spacing:0px;word-spacing:0px;fill:#30b7cb;fill-opacity:1;stroke:none"
       transform="matrix(0.26458333,0,0,0.26458333,-17.462501,-2.0969753)"><flowRegion
         style="font-style:normal;font-variant:normal;font-weight:normal;font-stretch:normal;font-size:14.66666698px;font-family:monospace;-inkscape-font-specification:monospace;fill:#30b7cb;fill-opacity:1"
         id="flowRegion1400"><rect
           style="font-style:normal;font-variant:normal;font-weight:normal;font-stretch:normal;font-size:14.66666698px;font-family:monospace;-inkscape-font-specification:monospace;fill:#30b7cb;fill-opacity:1"
           id="rect1398"
           width="384"
           height="74"
           x="225"
           y="369" /></flowRegion><flowPara
         id="flowPara1402"
         style="font-style:normal;font-variant:normal;font-weight:normal;font-stretch:normal;font-size:14.66666698px;font-family:monospace;-inkscape-font-specification:monospace;fill:#30b7cb;fill-opacity:1">cyan</flowPara></flowRoot>    <flowRoot
       transform="matrix(0.26458333,0,0,0.26458333,-17.462501,13.778044)"
       style="font-style:normal;font-variant:normal;font-weight:normal;font-stretch:normal;font-size:14.66666698px;line-height:1.25;font-family:monospace;-inkscape-font-specification:monospace;letter-spacing:0px;word-spacing:0px;fill:#deddda;fill-opacity:1;stroke:none"
       id="flowRoot1412"
       xml:space="preserve"><flowRegion
         id="flowRegion1408"
         style="font-style:normal;font-variant:normal;font-weight:normal;font-stretch:normal;font-size:14.66666698px;font-family:monospace;-inkscape-font-specification:monospace;fill:#deddda;fill-opacity:1"><rect
           y="369"
           x="225"
           height="74"
           width="384"
           id="rect1406"
           style="font-style:normal;font-variant:normal;font-weight:normal;font-stretch:normal;font-size:14.66666698px;font-family:monospace;-inkscape-font-specification:monospace;fill:#deddda;fill-opacity:1" /></flowRegion><flowPara
         style="font-style:normal;font-variant:normal;font-weight:normal;font-stretch:normal;font-size:14.66666698px;font-family:monospace;-inkscape-font-specification:monospace;fill:#deddda;fill-opacity:1"
         id="flowPara1410">light grey</flowPara></flowRoot>    <flowRoot
       xml:space="preserve"
       id="flowRoot1420"
       style="font-style:normal;font-variant:normal;font-weight:normal;font-stretch:normal;font-size:14.66666698px;line-height:1.25;font-family:monospace;-inkscape-font-specification:monospace;letter-spacing:0px;word-spacing:0px;fill:#5e5c64;fill-opacity:1;stroke:none"
       transform="matrix(0.26458333,0,0,0.26458333,46.037501,-96.55963)"><flowRegion
         id="flowRegion1416"
         style="font-style:normal;font-variant:normal;font-weight:normal;font-stretch:normal;font-size:14.66666698px;font-family:monospace;-inkscape-font-specification:monospace;fill:#5e5c64;fill-opacity:1"><rect
           id="rect1414"
           width="384"
           height="74"
           x="225"
           y="369"
           style="font-style:normal;font-variant:normal;font-weight:normal;font-stretch:normal;font-size:14.66666698px;font-family:monospace;-inkscape-font-specification:monospace;fill:#5e5c64;fill-opacity:1" /></flowRegion><flowPara
         id="flowPara1418"
         style="font-style:normal;font-variant:normal;font-weight:normal;font-stretch:normal;font-size:14.66666698px;font-family:monospace;-inkscape-font-specification:monospace;fill:#5e5c64;fill-opacity:1">dark grey</flowPara></flowRoot>    <flowRoot
       transform="matrix(0.26458333,0,0,0.26458333,46.037501,-80.695069)"
       style="font-style:normal;font-variant:normal;font-weight:normal;font-stretch:normal;font-size:14.66666698px;line-height:1.25;font-family:monospace;-inkscape-font-specification:monospace;letter-spacing:0px;word-spacing:0px;fill:#ed333b;fill-opacity:1;stroke:none"
       id="flowRoot1428"
       xml:space="preserve"><flowRegion
         id="flowRegion1424"
         style="font-style:normal;font-variant:normal;font-weight:normal;font-stretch:normal;font-size:14.66666698px;font-family:monospace;-inkscape-font-specification:monospace;fill:#ed333b;fill-opacity:1"><rect
           y="369"
           x="225"
           height="74"
           width="384"
           id="rect1422"
           style="font-style:normal;font-variant:normal;font-weight:normal;font-stretch:normal;font-size:14.66666698px;font-family:monospace;-inkscape-font-specification:monospace;fill:#ed333b;fill-opacity:1" /></flowRegion><flowPara
         style="font-style:normal;font-variant:normal;font-weight:normal;font-stretch:normal;font-size:14.66666698px;font-family:monospace;-inkscape-font-specification:monospace;fill:#ed333b;fill-opacity:1"
         id="flowPara1426">light red</flowPara></flowRoot>    <flowRoot
       xml:space="preserve"
       id="flowRoot1436"
       style="font-style:normal;font-variant:normal;font-weight:normal;font-stretch:normal;font-size:14.66666698px;line-height:1.25;font-family:monospace;-inkscape-font-specification:monospace;letter-spacing:0px;word-spacing:0px;fill:#33d17a;fill-opacity:1;stroke:none"
       transform="matrix(0.26458333,0,0,0.26458333,46.037501,-64.820054)"><flowRegion
         style="font-style:normal;font-variant:normal;font-weight:normal;font-stretch:normal;font-size:14.66666698px;font-family:monospace;-inkscape-font-specification:monospace;fill:#33d17a;fill-opacity:1"
         id="flowRegion1432"><rect
           style="font-style:normal;font-variant:normal;font-weight:normal;font-stretch:normal;font-size:14.66666698px;font-family:monospace;-inkscape-font-specification:monospace;fill:#33d17a;fill-opacity:1"
           id="rect1430"
           width="384"
           height="74"
           x="225"
           y="369" /></flowRegion><flowPara
         id="flowPara1434"
         style="font-style:normal;font-variant:normal;font-weight:normal;font-stretch:normal;font-size:14.66666698px;font-family:monospace;-inkscape-font-specification:monospace;fill:#33d17a;fill-opacity:1">light green</flowPara></flowRoot>    <flowRoot
       transform="matrix(0.26458333,0,0,0.26458333,46.037501,-49.721955)"
       style="font-style:normal;font-variant:normal;font-weight:normal;font-stretch:normal;font-size:14.66666698px;line-height:1.25;font-family:monospace;-inkscape-font-specification:monospace;letter-spacing:0px;word-spacing:0px;fill:#f8e45c;fill-opacity:1;stroke:none"
       id="flowRoot1444"
       xml:space="preserve"><flowRegion
         id="flowRegion1440"
         style="font-style:normal;font-variant:normal;font-weight:normal;font-stretch:normal;font-size:14.66666698px;font-family:monospace;-inkscape-font-specification:monospace;fill:#f8e45c;fill-opacity:1"><rect
           y="369"
           x="225"
           height="74"
           width="384"
           id="rect1438"
           style="font-style:normal;font-variant:normal;font-weight:normal;font-stretch:normal;font-size:14.66666698px;font-family:monospace;-inkscape-font-specification:monospace;fill:#f8e45c;fill-opacity:1" /></flowRegion><flowPara
         style="font-style:normal;font-variant:normal;font-weight:normal;font-stretch:normal;font-size:14.66666698px;font-family:monospace;-inkscape-font-specification:monospace;fill:#f8e45c;fill-opacity:1"
         id="flowPara1442">light yellow</flowPara></flowRoot>    <flowRoot
       transform="matrix(0.26458333,0,0,0.26458333,46.037501,-33.846967)"
       style="font-style:normal;font-variant:normal;font-weight:normal;font-stretch:normal;font-size:14.66666698px;line-height:1.25;font-family:monospace;-inkscape-font-specification:monospace;letter-spacing:0px;word-spacing:0px;fill:#1c71d8;fill-opacity:1;stroke:none"
       id="flowRoot1452"
       xml:space="preserve"><flowRegion
         id="flowRegion1448"
         style="font-style:normal;font-variant:normal;font-weight:normal;font-stretch:normal;font-size:14.66666698px;font-family:monospace;-inkscape-font-specification:monospace;fill:#1c71d8;fill-opacity:1"><rect
           y="369"
           x="225"
           height="74"
           width="384"
           id="rect1446"
           style="font-style:normal;font-variant:normal;font-weight:normal;font-stretch:normal;font-size:14.66666698px;font-family:monospace;-inkscape-font-specification:monospace;fill:#1c71d8;fill-opacity:1" /></flowRegion><flowPara
         style="font-style:normal;font-variant:normal;font-weight:normal;font-stretch:normal;font-size:14.66666698px;font-family:monospace;-inkscape-font-specification:monospace;fill:#1c71d8;fill-opacity:1"
         id="flowPara1450">light blue</flowPara></flowRoot>    <flowRoot
       xml:space="preserve"
       id="flowRoot1460"
       style="font-style:normal;font-variant:normal;font-weight:normal;font-stretch:normal;font-size:14.66666698px;line-height:1.25;font-family:monospace;-inkscape-font-specification:monospace;letter-spacing:0px;word-spacing:0px;fill:#c061cb;fill-opacity:1;stroke:none"
       transform="matrix(0.26458333,0,0,0.26458333,46.037501,-17.971966)"><flowRegion
         style="font-style:normal;font-variant:normal;font-weight:normal;font-stretch:normal;font-size:14.66666698px;font-family:monospace;-inkscape-font-specification:monospace;fill:#c061cb;fill-opacity:1"
         id="flowRegion1456"><rect
           style="font-style:normal;font-variant:normal;font-weight:normal;font-stretch:normal;font-size:14.66666698px;font-family:monospace;-inkscape-font-specification:monospace;fill:#c061cb;fill-opacity:1"
           id="rect1454"
           width="384"
           height="74"
           x="225"
           y="369" /></flowRegion><flowPara
         id="flowPara1458"
         style="font-style:normal;font-variant:normal;font-weight:normal;font-stretch:normal;font-size:14.66666698px;font-family:monospace;-inkscape-font-specification:monospace;fill:#c061cb;fill-opacity:1">light magenta</flowPara></flowRoot>    <flowRoot
       transform="matrix(0.26458333,0,0,0.26458333,46.037501,-2.0969753)"
       style="font-style:normal;font-variant:normal;font-weight:normal;font-stretch:normal;font-size:14.66666698px;line-height:1.25;font-family:monospace;-inkscape-font-specification:monospace;letter-spacing:0px;word-spacing:0px;fill:#38daf3;fill-opacity:1;stroke:none"
       id="flowRoot1468"
       xml:space="preserve"><flowRegion
         id="flowRegion1464"
         style="font-style:normal;font-variant:normal;font-weight:normal;font-stretch:normal;font-size:14.66666698px;font-family:monospace;-inkscape-font-specification:monospace;fill:#38daf3;fill-opacity:1"><rect
           y="369"
           x="225"
           height="74"
           width="384"
           id="rect1462"
           style="font-style:normal;font-variant:normal;font-weight:normal;font-stretch:normal;font-size:14.66666698px;font-family:monospace;-inkscape-font-specification:monospace;fill:#38daf3;fill-opacity:1" /></flowRegion><flowPara
         style="font-style:normal;font-variant:normal;font-weight:normal;font-stretch:normal;font-size:14.66666698px;font-family:monospace;-inkscape-font-specification:monospace;fill:#38daf3;fill-opacity:1"
         id="flowPara1466">light cyan</flowPara></flowRoot>    <flowRoot
       xml:space="preserve"
       id="flowRoot1470"
       style="font-style:normal;font-weight:normal;font-size:40px;line-height:1.25;font-family:sans-serif;letter-spacing:0px;word-spacing:0px;fill:#3d3846;fill-opacity:1;stroke:none"
       transform="matrix(0.26458333,0,0,0.26458333,-17.639944,59.244359)"><flowRegion
         id="flowRegion1472"
         style="fill:#3d3846"><rect
           id="rect1474"
           width="495"
           height="142"
           x="128"
           y="-355"
           style="fill:#3d3846" /></flowRegion><flowPara
         id="flowPara1476"
         style="font-style:normal;font-variant:normal;font-weight:800;font-stretch:normal;font-size:21.33333397px;font-family:Cantarell;-inkscape-font-specification:'Cantarell Ultra-Bold';text-align:center;text-anchor:middle;fill:#3d3846">Terminal Master</flowPara></flowRoot>    <flowRoot
       transform="matrix(0.26458333,0,0,0.26458333,135.81842,59.244359)"
       style="font-style:normal;font-weight:normal;font-size:40px;line-height:1.25;font-family:sans-serif;letter-spacing:0px;word-spacing:0px;fill:#3d3846;fill-opacity:1;stroke:none"
       id="flowRoot1484"
       xml:space="preserve"><flowRegion
         id="flowRegion1480"
         style="fill:#3d3846"><rect
           y="-355"
           x="128"
           height="142"
           width="495"
           id="rect1478"
           style="fill:#3d3846" /></flowRegion><flowPara
         style="font-style:normal;font-variant:normal;font-weight:800;font-stretch:normal;font-size:21.33333397px;font-family:Cantarell;-inkscape-font-specification:'Cantarell Ultra-Bold';text-align:center;text-anchor:middle;fill:#3d3846"
         id="flowPara1482">Proposed</flowPara></flowRoot>  </g>
</svg>
