<?xml version="1.0" encoding="UTF-8" standalone="no"?>
<!-- Created with Inkscape (http://www.inkscape.org/) -->

<svg
   width="1300"
   height="800"
   viewBox="0 0 1300 800"
   id="svg2"
   version="1.1"
   inkscape:version="1.1.2 (0a00cf5339, 2022-02-04)"
   sodipodi:docname="symbolic-preview-export.svg"
   inkscape:export-filename="symbolic-preview-export.png"
   inkscape:export-xdpi="96"
   inkscape:export-ydpi="96"
   xmlns:inkscape="http://www.inkscape.org/namespaces/inkscape"
   xmlns:sodipodi="http://sodipodi.sourceforge.net/DTD/sodipodi-0.dtd"
   xmlns="http://www.w3.org/2000/svg"
   xmlns:svg="http://www.w3.org/2000/svg"
   xmlns:rdf="http://www.w3.org/1999/02/22-rdf-syntax-ns#"
   xmlns:cc="http://creativecommons.org/ns#"
   xmlns:dc="http://purl.org/dc/elements/1.1/">
  <defs
     id="defs4">
    <rect
       x="860"
       y="420"
       width="400"
       height="100"
       id="rect147087" />
    <rect
       x="860"
       y="420"
       width="380"
       height="80"
       id="rect141549" />
    <clipPath
       clipPathUnits="userSpaceOnUse"
       id="clipPath4599">
      <circle
         r="50.799999"
         cy="229.26665"
         cx="67.73333"
         id="circle4601"
         style="opacity:1;fill:#635b82;fill-opacity:1;stroke:none;stroke-width:0.529167;stroke-linecap:round;stroke-linejoin:miter;stroke-miterlimit:4;stroke-dasharray:none;stroke-dashoffset:0;stroke-opacity:1" />
    </clipPath>
    <clipPath
       clipPathUnits="userSpaceOnUse"
       id="clipPath4624">
      <path
         style="color:#000000;font-style:normal;font-variant:normal;font-weight:normal;font-stretch:normal;font-size:medium;line-height:normal;font-family:sans-serif;text-indent:0;text-align:start;text-decoration:none;text-decoration-line:none;text-decoration-style:solid;text-decoration-color:#000000;letter-spacing:normal;word-spacing:normal;text-transform:none;writing-mode:lr-tb;direction:ltr;baseline-shift:baseline;text-anchor:start;white-space:normal;shape-padding:0;clip-rule:nonzero;display:inline;overflow:visible;visibility:visible;opacity:1;isolation:auto;mix-blend-mode:normal;color-interpolation:sRGB;color-interpolation-filters:linearRGB;solid-color:#000000;solid-opacity:1;fill:#ededed;fill-opacity:1;fill-rule:nonzero;stroke:none;stroke-width:2.11667;stroke-linecap:round;stroke-linejoin:round;stroke-miterlimit:4;stroke-dasharray:none;stroke-dashoffset:0;stroke-opacity:1;color-rendering:auto;image-rendering:auto;shape-rendering:auto;text-rendering:auto;enable-background:accumulate"
         d="m 66.464844,121.31641 c -0.166029,-9.4e-4 -0.329949,0.0372 -0.478516,0.11132 0,0 -17.413222,8.75537 -21.734375,31.44141 -2.377685,12.48284 0.802049,33.95579 2.148438,44.54492 0.978798,7.6981 2.089843,13.01953 2.089843,13.01953 0.102489,0.49013 0.534422,0.84139 1.035157,0.8418 h 31.75 c 0.487305,-3.3e-4 0.911415,-0.33332 1.027343,-0.80664 0,0 1.265381,-5.16939 2.328125,-12.89063 1.398164,-10.15816 4.286935,-31.08304 1.919922,-44.69335 C 84.401063,140.52389 79.537234,132.64711 75.177734,127.87891 70.818235,123.1107 66.875,121.40234 66.875,121.40234 c -0.129627,-0.0557 -0.269079,-0.0849 -0.410156,-0.0859 z"
         id="path4626"
         inkscape:connector-curvature="0"
         sodipodi:nodetypes="ccssccccsssccc" />
    </clipPath>
    <clipPath
       clipPathUnits="userSpaceOnUse"
       id="clipPath4880">
      <circle
         r="46.991886"
         cy="96.880188"
         cx="-174.21211"
         id="circle4882"
         style="opacity:1;fill:#aaccf9;fill-opacity:1;stroke:none;stroke-width:2.11667;stroke-linecap:round;stroke-linejoin:round;stroke-miterlimit:4;stroke-dasharray:none;stroke-dashoffset:0;stroke-opacity:1"
         transform="rotate(-45)" />
    </clipPath>
    <rect
       x="860"
       y="420"
       width="380"
       height="100"
       id="rect149035" />
  </defs>
  <sodipodi:namedview
     id="base"
     pagecolor="#ffffff"
     bordercolor="#666666"
     borderopacity="1.0"
     inkscape:pageopacity="1"
     inkscape:pageshadow="2"
     inkscape:zoom="0.5"
     inkscape:cx="947"
     inkscape:cy="666"
     inkscape:document-units="px"
     inkscape:current-layer="layer1"
     showgrid="false"
     units="px"
     inkscape:window-width="1920"
     inkscape:window-height="1011"
     inkscape:window-x="0"
     inkscape:window-y="0"
     inkscape:window-maximized="1"
     inkscape:snap-bbox="true"
     inkscape:bbox-paths="true"
     inkscape:snap-bbox-midpoints="true"
     inkscape:snap-intersection-paths="true"
     inkscape:object-paths="true"
     inkscape:object-nodes="true"
     inkscape:snap-smooth-nodes="true"
     inkscape:snap-midpoints="true"
     inkscape:bbox-nodes="true"
     inkscape:snap-global="true"
     inkscape:pagecheckerboard="0">
    <inkscape:grid
       type="xygrid"
       id="grid4514"
       empspacing="5" />
  </sodipodi:namedview>
  <metadata
     id="metadata7">
    <rdf:RDF>
      <cc:Work
         rdf:about="">
        <dc:format>image/svg+xml</dc:format>
        <dc:type
           rdf:resource="http://purl.org/dc/dcmitype/StillImage" />
      </cc:Work>
    </rdf:RDF>
  </metadata>
  <g
     inkscape:label="Layer 1"
     inkscape:groupmode="layer"
     id="layer1"
     transform="translate(0,-161.53331)">
    <text
       xml:space="preserve"
       transform="translate(-10,401.53331)"
       id="text149033"
       style="font-style:normal;font-weight:normal;font-size:14.6667px;line-height:1.25;font-family:sans-serif;white-space:pre;shape-inside:url(#rect149035);fill:#000000;fill-opacity:1;stroke:none"><tspan
         x="860"
         y="433.17088"
         id="tspan164094"><tspan
           style="font-family:Cantarell;-inkscape-font-specification:Cantarell"
           id="tspan164092">Otherwise the menu button attached to the Export button </tspan></tspan><tspan
         x="860"
         y="451.69853"
         id="tspan164098"><tspan
           style="font-family:Cantarell;-inkscape-font-specification:Cantarell"
           id="tspan164096">will allow users to select or change the location of export</tspan></tspan></text>
    <text
       xml:space="preserve"
       transform="translate(-10,121.53331)"
       id="text147085"
       style="font-style:normal;font-weight:normal;font-size:14.6667px;line-height:1.25;font-family:sans-serif;white-space:pre;shape-inside:url(#rect147087);fill:#000000;fill-opacity:1;stroke:none"><tspan
         x="860"
         y="433.17088"
         id="tspan164102"><tspan
           style="font-family:Cantarell;-inkscape-font-specification:Cantarell"
           id="tspan164100">If the export button is pressed without a location set up a </tspan></tspan><tspan
         x="860"
         y="451.69853"
         id="tspan164106"><tspan
           style="font-family:Cantarell;-inkscape-font-specification:Cantarell"
           id="tspan164104">dialog prompts users to pick a location before exporting.</tspan></tspan></text>
    <path
       id="rect115527"
       style="display:inline;fill-opacity:0.152861;stroke:#fafafa;stroke-width:0"
       d="m 78,311.53331 h 684 c 9.972,0 18,8.028 18,18 v 514.0007 c 0,9.972 -8.028,18 -18,18 H 78 c -9.972002,0 -18,-8.028 -18,-18 v -514.0007 c 0,-9.972 8.027998,-18 18,-18 z"
       sodipodi:nodetypes="sssssssss" />
    <path
       id="rect115529"
       style="display:inline;fill:#fafafa;stroke:#fafafa;stroke-width:0"
       d="m 70,842.53331 c -2.31e-4,4.98599 4.01397,9 9,9 h 682 c 4.98599,0 9.21064,-4.01846 9,-9 v -473 H 70.02187 Z"
       sodipodi:nodetypes="ssssccs" />
    <path
       id="path115531"
       style="display:inline;fill:#ebebeb;fill-opacity:1;stroke:#ebebeb;stroke-width:0;stroke-miterlimit:4;stroke-dasharray:none;stroke-opacity:1"
       d="m 79.02187,321.52069 h 681.97851 c 4.9858,0 8.99962,4.1543 8.99962,9.00219 v 39.01043 H 70.02187 v -39.01043 c 0,-4.98728 4.0142,-9.00219 9,-9.00219 z"
       sodipodi:nodetypes="sssccss" />
    <circle
       style="display:inline;fill:#d8d8d8;fill-opacity:1;stroke:#3584e4;stroke-width:0;stroke-miterlimit:4;stroke-dasharray:none"
       id="circle218643"
       cx="747"
       cy="344.53333"
       r="10.999997" />
    <path
       inkscape:connector-curvature="0"
       d="m 743.00342,340.54725 h 1 c 0.0104,-1.2e-4 0.0208,-4.6e-4 0.0312,0 0.25495,0.0112 0.50987,0.12858 0.6875,0.3125 l 2.28125,2.28125 2.3125,-2.28125 c 0.26563,-0.2305 0.44667,-0.3055 0.6875,-0.3125 h 1 v 1 c 0,0.28647 -0.0343,0.55065 -0.25,0.75 l -2.28125,2.28125 2.25,2.25 c 0.18819,0.18817 0.28124,0.45345 0.28125,0.71875 v 1 h -1 c -0.2653,-1e-5 -0.53059,-0.0931 -0.71875,-0.28125 l -2.28125,-2.28125 -2.28125,2.28125 c -0.18816,0.18819 -0.45346,0.28125 -0.71875,0.28125 h -1 v -1 c 0,-0.26529 0.0931,-0.53058 0.28125,-0.71875 l 2.28125,-2.25 -2.28125,-2.28125 c -0.21074,-0.19463 -0.30316,-0.46925 -0.28125,-0.75 z"
       id="path218645"
       style="color:#bebebe;font-style:normal;font-variant:normal;font-weight:normal;font-stretch:normal;font-size:medium;line-height:normal;font-family:'Andale Mono';-inkscape-font-specification:'Andale Mono';text-indent:0;text-align:start;text-decoration:none;text-decoration-line:none;letter-spacing:normal;word-spacing:normal;text-transform:none;writing-mode:lr-tb;direction:ltr;text-anchor:start;display:inline;overflow:visible;visibility:visible;fill:#2e3436;fill-opacity:1;fill-rule:nonzero;stroke:none;stroke-width:1.78125;marker:none;enable-background:new"
       sodipodi:nodetypes="ccscccccscccscssccscsccccc" />
    <text
       xml:space="preserve"
       style="font-style:normal;font-variant:normal;font-weight:bold;font-stretch:normal;font-size:14.6667px;line-height:0%;font-family:Cantarell;-inkscape-font-specification:'Cantarell Bold';text-align:center;letter-spacing:0px;word-spacing:0px;text-anchor:middle;display:inline;fill:#2e3436;fill-opacity:1;stroke:none;stroke-width:0.999999"
       x="419.82028"
       y="343.62805"
       id="text9794"><tspan
         style="font-size:14.6667px;line-height:1.25;stroke-width:0.999999"
         sodipodi:role="line"
         id="tspan9792"
         x="419.82028"
         y="343.62805">Symbolic Preview</tspan></text>
    <rect
       style="color:#000000;display:inline;overflow:visible;visibility:visible;opacity:0.2;fill:#ebebeb;fill-opacity:1;fill-rule:nonzero;stroke:#ebebeb;stroke-width:0.999999;stroke-linecap:butt;stroke-linejoin:miter;stroke-miterlimit:4;stroke-dasharray:none;stroke-dashoffset:0;stroke-opacity:1;marker:none;enable-background:accumulate"
       id="rect146181"
       width="79"
       height="33.000118"
       x="77.5"
       y="328.74042"
       rx="7.9999995"
       ry="7.9999995"
       inkscape:export-filename="/home/aday/Dropbox/Public/settings/sound.png"
       inkscape:export-xdpi="90"
       inkscape:export-ydpi="90" />
    <text
       xml:space="preserve"
       style="font-style:normal;font-variant:normal;font-weight:normal;font-stretch:normal;font-size:14.6667px;line-height:0%;font-family:Cantarell;-inkscape-font-specification:Cantarell;letter-spacing:0px;word-spacing:0px;display:inline;fill:#2e3436;fill-opacity:1;stroke:none;stroke-width:0.999999"
       x="121.54044"
       y="349.66083"
       id="text146177"><tspan
         style="font-weight:bold;font-size:14.6667px;line-height:1.25;text-align:end;text-anchor:end;stroke-width:0.999999"
         sodipodi:role="line"
         id="tspan146175"
         x="121.54044"
         y="349.66083">Open</tspan></text>
    <path
       style="fill:#2e3436;fill-opacity:1;stroke:none;stroke-width:0.999999px;stroke-linecap:butt;stroke-linejoin:miter;stroke-opacity:1"
       d="m 136,342.53331 6,6 6,-6 z"
       id="path146179"
       sodipodi:nodetypes="cccc" />
    <path
       style="fill:none;stroke:#000000;stroke-width:1px;stroke-linecap:butt;stroke-linejoin:miter;stroke-opacity:0.152941"
       d="m 129.5,330.53331 v 27"
       id="path17973"
       sodipodi:nodetypes="cc" />
    <text
       xml:space="preserve"
       style="font-style:normal;font-variant:normal;font-weight:bold;font-stretch:normal;font-size:10.6667px;line-height:0%;font-family:Cantarell;-inkscape-font-specification:'Cantarell Bold';text-align:center;letter-spacing:0px;word-spacing:0px;text-anchor:middle;display:inline;opacity:0.55;fill:#2e3436;fill-opacity:1;stroke:none;stroke-width:0.999999"
       x="419.99493"
       y="357.62805"
       id="text26460"><tspan
         style="font-weight:normal;font-size:10.6667px;line-height:1.25;stroke-width:0.999999"
         sodipodi:role="line"
         id="tspan26458"
         x="419.99493"
         y="357.62805">symbolics</tspan></text>
    <rect
       style="display:inline;fill:#ebebeb;fill-opacity:1;stroke:#d2d2d2;stroke-width:0;stroke-opacity:1"
       id="rect4732"
       width="33.999992"
       height="33.999992"
       x="690"
       y="328.53333"
       rx="8.3186388"
       ry="8.3186388" />
    <path
       id="rect4810"
       style="display:inline;fill:#2e3436;fill-opacity:1;stroke:none;stroke-width:2;stroke-linecap:square;stroke-linejoin:round;stroke-dasharray:8, 8;enable-background:new"
       d="m 699.99958,339.534 v 2 h 14 v -2 z m 0,5 v 2 h 14 v -2 z m 0,5 v 2 h 14 v -2 z"
       sodipodi:nodetypes="ccccccccccccccc" />
    <path
       id="rect28227"
       style="display:inline;overflow:visible;opacity:0.2;fill:#ebebeb;stroke:#ebebeb;stroke-width:0.999999;marker:none;enable-background:accumulate"
       d="m 593.5,328.74042 h 79 c 4.432,0 8,3.568 8,8 v 17.00012 c 0,4.432 -3.568,8 -8,8 h -79 c -4.432,0 -8,-3.568 -8,-8 v -17.00012 c 0,-4.432 3.568,-8 8,-8 z"
       sodipodi:nodetypes="sssssssss" />
    <text
       xml:space="preserve"
       style="font-style:normal;font-variant:normal;font-weight:normal;font-stretch:normal;font-size:14.6667px;line-height:0%;font-family:Cantarell;-inkscape-font-specification:Cantarell;letter-spacing:0px;word-spacing:0px;display:inline;opacity:1;fill:#2e3436;fill-opacity:1;stroke:none;stroke-width:0.999999"
       x="645.54041"
       y="349.66083"
       id="text28231"><tspan
         style="font-weight:bold;font-size:14.6667px;line-height:1.25;text-align:end;text-anchor:end;stroke-width:0.999999"
         sodipodi:role="line"
         id="tspan28229"
         x="645.54041"
         y="349.66083">Export</tspan></text>
    <path
       style="fill:#2e3436;fill-opacity:1;stroke:none;stroke-width:0.999999px;stroke-linecap:butt;stroke-linejoin:miter;stroke-opacity:1"
       d="m 662,342.53331 6,6 6,-6 z"
       id="path28233"
       sodipodi:nodetypes="cccc" />
    <path
       style="fill:none;stroke:#000000;stroke-width:1px;stroke-linecap:butt;stroke-linejoin:miter;stroke-opacity:0.152941"
       d="m 655.5,330.53331 v 27"
       id="path28235"
       sodipodi:nodetypes="cc" />
    <path
       style="display:inline;fill:#ffffff;fill-opacity:1;stroke:#deddda;stroke-width:0.999999;stroke-linecap:square;stroke-linejoin:miter;stroke-miterlimit:4;stroke-dasharray:none;stroke-opacity:1"
       d="m 1183.5002,686.98546 h -136.8015 l -14.1986,-13.99997 -14.1986,13.99997 H 882.5 c -4.98599,0 -9,4.01401 -9,9 v 97.96901 c 0,4.98599 4.01401,9 9,9 h 301.0002 c 4.986,0 9,-4.01401 9,-9 v -97.96901 c 0,-4.98599 -4.014,-9 -9,-9 z"
       id="path4809"
       inkscape:connector-curvature="0"
       sodipodi:nodetypes="scccssssssss" />
    <path
       id="path28962"
       style="display:inline;overflow:visible;opacity:0.2;fill:#ebebeb;stroke:none;stroke-width:0.999999;marker:none;enable-background:accumulate"
       d="m 959,628.53331 h 77 c 4.432,0 8,3.67611 8,8.2424 v 17.51521 c 0,4.56629 -3.568,8.24239 -8,8.24239 h -77 c -4.432,0 -8,-3.6761 -8,-8.24239 v -17.51521 c 0,-4.56629 3.568,-8.2424 8,-8.2424 z"
       sodipodi:nodetypes="sssssssss" />
    <text
       xml:space="preserve"
       style="font-style:normal;font-variant:normal;font-weight:normal;font-stretch:normal;font-size:14.6667px;line-height:0%;font-family:Cantarell;-inkscape-font-specification:Cantarell;letter-spacing:0px;word-spacing:0px;display:inline;opacity:1;fill:#2e3436;fill-opacity:1;stroke:none;stroke-width:0.999999"
       x="1007.5404"
       y="650.66083"
       id="text28966"><tspan
         style="font-weight:bold;font-size:14.6667px;line-height:1.25;text-align:end;text-anchor:end;stroke-width:0.999999"
         sodipodi:role="line"
         id="tspan28964"
         x="1007.5404"
         y="650.66083">Export</tspan></text>
    <path
       style="fill:#2e3436;fill-opacity:1;stroke:none;stroke-width:0.999999px;stroke-linecap:butt;stroke-linejoin:miter;stroke-opacity:1"
       d="m 1026,642.53331 6,6 6,-6 z"
       id="path28968"
       sodipodi:nodetypes="cccc" />
    <rect
       style="opacity:0.2;fill:#2e3436;fill-opacity:1;stroke:none;stroke-width:2;stroke-linejoin:round;stroke-dashoffset:2;stroke-opacity:0.2"
       id="rect28994"
       width="24"
       height="34"
       x="1020"
       y="628.53333"
       rx="6"
       ry="6" />
    <path
       id="path50080"
       style="display:inline;overflow:visible;opacity:0.2;fill:#828588;fill-opacity:0.360784;stroke:none;stroke-width:0.999999;marker:none;enable-background:accumulate"
       d="m 1088,731.53331 v 34 h 85 c 4.432,0 8,-6.06117 8,-8.24219 V 739.7755 c 0,-4.56629 -3.568,-8.24219 -8,-8.24219 z"
       sodipodi:nodetypes="ccssssc" />
    <text
       xml:space="preserve"
       style="font-style:normal;font-variant:normal;font-weight:normal;font-stretch:normal;font-size:14.6667px;line-height:0%;font-family:Cantarell;-inkscape-font-specification:Cantarell;letter-spacing:0px;word-spacing:0px;display:inline;fill:#2e3436;fill-opacity:1;stroke:none;stroke-width:0.999999"
       x="1166.6974"
       y="753.30713"
       id="text50189"><tspan
         style="font-weight:bold;font-size:14.6667px;line-height:1.25;text-align:end;text-anchor:end;stroke-width:0.999999"
         sodipodi:role="line"
         id="tspan50187"
         x="1166.6974"
         y="753.30713">Browse...</tspan></text>
    <path
       style="opacity:0.2;fill:none;stroke:#303638;stroke-width:1px;stroke-linecap:butt;stroke-linejoin:miter;stroke-opacity:1"
       d="m 1087.5,731.29112 v 34"
       id="path69929"
       sodipodi:nodetypes="cc" />
    <text
       xml:space="preserve"
       style="font-style:normal;font-variant:normal;font-weight:normal;font-stretch:normal;font-size:14.6667px;line-height:0%;font-family:Cantarell;-inkscape-font-specification:Cantarell;text-align:start;letter-spacing:0px;word-spacing:0px;text-anchor:start;display:inline;fill:#2e3436;fill-opacity:1;stroke:none;stroke-width:0.999999"
       x="889.54041"
       y="717.66083"
       id="text79840"><tspan
         style="font-weight:bold;font-size:14.6667px;line-height:1.25;text-align:start;text-anchor:start;stroke-width:0.999999"
         sodipodi:role="line"
         id="tspan79838"
         x="889.54041"
         y="717.66083">Export Location</tspan></text>
    <text
       xml:space="preserve"
       style="font-style:normal;font-variant:normal;font-weight:normal;font-stretch:normal;font-size:12px;line-height:0%;font-family:Cantarell;-inkscape-font-specification:Cantarell;text-align:start;letter-spacing:0px;word-spacing:0px;text-anchor:start;display:inline;opacity:0.55;fill:#2e3436;fill-opacity:1;stroke:none;stroke-width:0.999999"
       x="889.54041"
       y="783.66083"
       id="text80880"><tspan
         style="font-weight:normal;font-size:12px;line-height:1.25;text-align:start;text-anchor:start;opacity:0.55;stroke-width:0.999999"
         sodipodi:role="line"
         id="tspan80878"
         x="889.54041"
         y="783.66083">The exported SVG will be stored in this location.</tspan></text>
    <path
       id="path46095"
       style="display:inline;overflow:visible;opacity:0.2;fill:#828588;fill-opacity:0.360784;stroke:none;stroke-width:2;stroke-miterlimit:4;stroke-dasharray:none;marker:none;enable-background:accumulate"
       d="m 894,731.53331 c -4.432,0 -8,3.6759 -8,8.24219 v 17.51562 c 0,4.56629 3.568,8.24219 8,8.24219 h 194 v -34 z"
       sodipodi:nodetypes="ssssccs" />
    <text
       xml:space="preserve"
       style="font-style:normal;font-variant:normal;font-weight:bold;font-stretch:normal;font-size:32px;line-height:0%;font-family:Cantarell;-inkscape-font-specification:'Cantarell Bold';text-align:center;letter-spacing:0px;word-spacing:0px;text-anchor:middle;display:inline;fill:#2e3436;fill-opacity:1;stroke:none;stroke-width:0.999999"
       x="72.570969"
       y="242.5329"
       id="text110919"><tspan
         style="font-style:normal;font-variant:normal;font-weight:800;font-stretch:normal;font-size:32px;line-height:1.25;font-family:Cantarell;-inkscape-font-specification:'Cantarell Ultra-Bold';text-align:start;text-anchor:start;stroke-width:0.999999"
         sodipodi:role="line"
         id="tspan110917"
         x="72.570969"
         y="242.5329">Symbolic Preview</tspan></text>
    <text
       xml:space="preserve"
       style="font-style:normal;font-variant:normal;font-weight:normal;font-stretch:normal;font-size:14.6667px;line-height:0%;font-family:Cantarell;-inkscape-font-specification:Cantarell;text-align:start;letter-spacing:0px;word-spacing:0px;text-anchor:start;display:inline;fill:#2e3436;fill-opacity:1;stroke:none;stroke-width:0.999999"
       x="893.54041"
       y="753.66083"
       id="text131286"><tspan
         style="font-weight:normal;font-size:14.6667px;line-height:1.25;text-align:start;text-anchor:start;stroke-width:0.999999"
         sodipodi:role="line"
         id="tspan131284"
         x="893.54041"
         y="753.66083">/home/user/Projects/Icons</tspan></text>
    <path
       id="rect115527-5"
       style="display:inline;fill-opacity:0.152861;stroke:#fafafa;stroke-width:0"
       d="m 868,322.53296 h 364 c 9.972,0 18,8.028 18,18 v 154.0007 c 0,9.972 -8.028,18 -18,18 H 868 c -9.972,0 -18,-8.028 -18,-18 v -154.0007 c 0,-9.972 8.028,-18 18,-18 z"
       sodipodi:nodetypes="sssssssss" />
    <path
       id="rect115529-6"
       style="display:inline;fill:#fafafa;stroke:#fafafa;stroke-width:0"
       d="M 868.99995,340.53336 H 1231 c 4.986,0 9,4.01401 9,9 V 493.5337 c 0,4.98599 -4.014,9 -9,9 H 868.99995 c -4.98602,0 -9,-4.01401 -9,-9 V 349.53336 c 0,-4.98599 4.01398,-9 9,-9 z"
       sodipodi:nodetypes="sssssssss" />
    <path
       id="path115531-2"
       style="display:inline;fill:#ebebeb;fill-opacity:1;stroke:#ebebeb;stroke-width:0;stroke-miterlimit:4;stroke-dasharray:none;stroke-opacity:1"
       d="m 869.06628,332.53373 h 361.97852 c 4.9858,0 8.9996,4.1543 8.9996,9.00219 v 39.01043 H 860.06629 v -39.01043 c 0,-4.98728 4.01419,-9.00219 8.99999,-9.00219 z"
       sodipodi:nodetypes="sssccss" />
    <text
       xml:space="preserve"
       style="font-style:normal;font-variant:normal;font-weight:bold;font-stretch:normal;font-size:14.6667px;line-height:0%;font-family:Cantarell;-inkscape-font-specification:'Cantarell Bold';text-align:center;letter-spacing:0px;word-spacing:0px;text-anchor:middle;display:inline;fill:#2e3436;fill-opacity:1;stroke:none;stroke-width:0.999999"
       x="1049.7695"
       y="360.62848"
       id="text9794-9"><tspan
         style="font-size:14.6667px;line-height:1.25;stroke-width:0.999999"
         sodipodi:role="line"
         id="tspan9792-1"
         x="1049.7695"
         y="360.62848">Export Icon</tspan></text>
    <rect
       style="color:#000000;display:inline;overflow:visible;visibility:visible;opacity:0.5;fill:#3584e4;fill-opacity:1;fill-rule:nonzero;stroke:#3584e4;stroke-width:0.999999;stroke-linecap:butt;stroke-linejoin:miter;stroke-miterlimit:4;stroke-dasharray:none;stroke-dashoffset:0;stroke-opacity:1;marker:none;enable-background:accumulate"
       id="rect75374"
       width="79"
       height="33.000118"
       x="1152.5012"
       y="340.03433"
       rx="7.9999995"
       ry="7.9999995"
       inkscape:export-filename="/home/aday/Dropbox/Public/settings/sound.png"
       inkscape:export-xdpi="90"
       inkscape:export-ydpi="90" />
    <text
       xml:space="preserve"
       style="font-style:normal;font-variant:normal;font-weight:bold;font-stretch:normal;font-size:14.6667px;line-height:0%;font-family:Cantarell;-inkscape-font-specification:'Cantarell Bold';text-align:center;letter-spacing:0px;word-spacing:0px;text-anchor:middle;display:inline;fill:#ffffff;fill-opacity:1;stroke:none;stroke-width:0.999999"
       x="1192.218"
       y="361.62848"
       id="text75414"><tspan
         style="font-size:14.6667px;line-height:1.25;fill:#ffffff;stroke-width:0.999999"
         sodipodi:role="line"
         id="tspan75412"
         x="1192.218"
         y="361.62848">Export</tspan></text>
    <rect
       style="color:#000000;display:inline;overflow:visible;visibility:visible;opacity:0.2;fill:#2e3436;fill-opacity:1;fill-rule:nonzero;stroke:#2e3436;stroke-width:0.999999;stroke-linecap:butt;stroke-linejoin:miter;stroke-miterlimit:4;stroke-dasharray:none;stroke-dashoffset:0;stroke-opacity:1;marker:none;enable-background:accumulate"
       id="rect75434"
       width="79"
       height="33.000118"
       x="868.50122"
       y="340.03433"
       rx="7.9999995"
       ry="7.9999995"
       inkscape:export-filename="/home/aday/Dropbox/Public/settings/sound.png"
       inkscape:export-xdpi="90"
       inkscape:export-ydpi="90" />
    <text
       xml:space="preserve"
       style="font-style:normal;font-variant:normal;font-weight:bold;font-stretch:normal;font-size:14.6667px;line-height:0%;font-family:Cantarell;-inkscape-font-specification:'Cantarell Bold';text-align:center;letter-spacing:0px;word-spacing:0px;text-anchor:middle;display:inline;fill:#34393b;fill-opacity:1;stroke:none;stroke-width:0.999999"
       x="908.21771"
       y="361.62848"
       id="text75474"><tspan
         style="font-size:14.6667px;line-height:1.25;fill:#34393b;fill-opacity:1;stroke-width:0.999999"
         sodipodi:role="line"
         id="tspan75472"
         x="908.21771"
         y="361.62848">Cancel</tspan></text>
    <path
       id="path131535"
       style="display:inline;overflow:visible;opacity:0.2;fill:#828588;fill-opacity:0.360784;stroke:none;stroke-width:0.999999;marker:none;enable-background:accumulate"
       d="m 1130,423.53331 v 34 h 89 c 4.432,0 8,-6.06117 8,-8.24219 V 431.7755 c 0,-4.56629 -3.568,-8.24219 -8,-8.24219 z"
       sodipodi:nodetypes="ccssssc" />
    <text
       xml:space="preserve"
       style="font-style:normal;font-variant:normal;font-weight:normal;font-stretch:normal;font-size:14.6667px;line-height:0%;font-family:Cantarell;-inkscape-font-specification:Cantarell;letter-spacing:0px;word-spacing:0px;display:inline;fill:#2e3436;fill-opacity:1;stroke:none;stroke-width:0.999999"
       x="1208.6974"
       y="445.30713"
       id="text131539"><tspan
         style="font-weight:bold;font-size:14.6667px;line-height:1.25;text-align:end;text-anchor:end;stroke-width:0.999999"
         sodipodi:role="line"
         id="tspan131537"
         x="1208.6974"
         y="445.30713">Browse...</tspan></text>
    <path
       style="opacity:0.2;fill:none;stroke:#303638;stroke-width:1px;stroke-linecap:butt;stroke-linejoin:miter;stroke-opacity:1"
       d="m 1129.5,423.29112 v 34"
       id="path131541"
       sodipodi:nodetypes="cc" />
    <text
       xml:space="preserve"
       style="font-style:normal;font-variant:normal;font-weight:normal;font-stretch:normal;font-size:14.6667px;line-height:0%;font-family:Cantarell;-inkscape-font-specification:Cantarell;text-align:start;letter-spacing:0px;word-spacing:0px;text-anchor:start;display:inline;fill:#2e3436;fill-opacity:1;stroke:none;stroke-width:0.999999"
       x="875.54041"
       y="409.66083"
       id="text131545"><tspan
         style="font-weight:bold;font-size:14.6667px;line-height:1.25;text-align:start;text-anchor:start;stroke-width:0.999999"
         sodipodi:role="line"
         id="tspan131543"
         x="875.54041"
         y="409.66083">Export Location</tspan></text>
    <text
       xml:space="preserve"
       style="font-style:normal;font-variant:normal;font-weight:normal;font-stretch:normal;font-size:12px;line-height:0%;font-family:Cantarell;-inkscape-font-specification:Cantarell;text-align:start;letter-spacing:0px;word-spacing:0px;text-anchor:start;display:inline;opacity:0.55;fill:#2e3436;fill-opacity:1;stroke:none;stroke-width:0.999999"
       x="875.54041"
       y="475.66083"
       id="text131549"><tspan
         style="font-weight:normal;font-size:12px;line-height:1.25;text-align:start;text-anchor:start;opacity:0.55;stroke-width:0.999999"
         sodipodi:role="line"
         id="tspan131547"
         x="875.54041"
         y="475.66083">The exported SVG will be stored in this location.</tspan></text>
    <path
       id="path131551"
       style="display:inline;overflow:visible;opacity:0.2;fill:#828588;fill-opacity:0.360784;stroke:none;stroke-width:2;stroke-miterlimit:4;stroke-dasharray:none;marker:none;enable-background:accumulate"
       d="m 880,423.53331 c -4.432,0 -8,3.6759 -8,8.24219 v 17.51562 c 0,4.56629 3.568,8.24219 8,8.24219 h 250 v -34 z"
       sodipodi:nodetypes="ssssccs" />
    <text
       xml:space="preserve"
       transform="translate(0,161.53331)"
       id="text141547"
       style="font-style:normal;font-weight:normal;font-size:40px;line-height:1.25;font-family:sans-serif;white-space:pre;shape-inside:url(#rect141549);fill:#000000;fill-opacity:1;stroke:none" />
    <path
       id="path162319"
       style="display:inline;overflow:visible;opacity:0.5;fill:none;fill-opacity:0.360784;stroke:#3584e4;stroke-width:2;stroke-miterlimit:4;stroke-dasharray:none;stroke-opacity:1;marker:none;enable-background:accumulate"
       d="m 880,423.53331 c -4.432,0 -8,3.6759 -8,8.24219 v 17.51562 c 0,4.56629 3.568,8.24219 8,8.24219 h 250 v -34 z"
       sodipodi:nodetypes="ssssccs" />
  </g>
</svg>
