<?xml version="1.0" encoding="UTF-8" standalone="no"?>
<!-- Created with Inkscape (http://www.inkscape.org/) -->

<svg
   width="1270"
   height="1080"
   viewBox="0 0 1270 1080.0001"
   version="1.1"
   id="svg8"
   sodipodi:docname="disk-image-open-dialog.svg"
   inkscape:version="1.3 (0e150ed6c4, 2023-07-21)"
   inkscape:export-filename="../disk-image-open-dialog.png"
   inkscape:export-xdpi="96"
   inkscape:export-ydpi="96"
   xml:space="preserve"
   xmlns:inkscape="http://www.inkscape.org/namespaces/inkscape"
   xmlns:sodipodi="http://sodipodi.sourceforge.net/DTD/sodipodi-0.dtd"
   xmlns="http://www.w3.org/2000/svg"
   xmlns:svg="http://www.w3.org/2000/svg"
   xmlns:rdf="http://www.w3.org/1999/02/22-rdf-syntax-ns#"
   xmlns:cc="http://creativecommons.org/ns#"
   xmlns:dc="http://purl.org/dc/elements/1.1/"><defs
     id="defs2"><rect
       x="219.48438"
       y="-3576.0078"
       width="398.95984"
       height="158.38007"
       id="rect20" /><rect
       x="219.48438"
       y="-3576.0078"
       width="398.95984"
       height="158.38007"
       id="rect132" /><rect
       x="219.48438"
       y="-3576.0078"
       width="398.95984"
       height="158.38007"
       id="rect39" /><rect
       x="219.48438"
       y="-3576.0078"
       width="398.95984"
       height="158.38007"
       id="rect133" /><rect
       x="219.48438"
       y="-3576.0078"
       width="398.95984"
       height="158.38007"
       id="rect153" /><rect
       x="219.48438"
       y="-3576.0078"
       width="398.95984"
       height="158.38007"
       id="rect169" /></defs><sodipodi:namedview
     id="base"
     pagecolor="#bbbbbb"
     bordercolor="#0c0c0c"
     borderopacity="1"
     inkscape:pageopacity="1"
     inkscape:pageshadow="2"
     inkscape:zoom="0.70710678"
     inkscape:cx="676.70119"
     inkscape:cy="513.35952"
     inkscape:document-units="px"
     inkscape:current-layer="layer1"
     showgrid="false"
     units="px"
     inkscape:pagecheckerboard="false"
     inkscape:window-width="1920"
     inkscape:window-height="1011"
     inkscape:window-x="0"
     inkscape:window-y="0"
     inkscape:window-maximized="1"
     inkscape:snap-page="true"
     inkscape:snap-text-baseline="true"
     inkscape:snap-center="true"
     inkscape:snap-object-midpoints="true"
     inkscape:object-paths="true"
     inkscape:snap-intersection-paths="true"
     inkscape:snap-bbox="true"
     inkscape:bbox-paths="true"
     inkscape:bbox-nodes="true"
     inkscape:snap-bbox-edge-midpoints="true"
     inkscape:snap-bbox-midpoints="true"
     inkscape:snap-smooth-nodes="true"
     inkscape:snap-midpoints="true"
     inkscape:snap-nodes="true"
     inkscape:snap-global="true"
     inkscape:snap-others="true"
     fit-margin-top="0"
     fit-margin-left="0"
     fit-margin-right="0"
     fit-margin-bottom="0"
     width="2000px"
     inkscape:showpageshadow="2"
     inkscape:deskcolor="#d1d1d1"
     inkscape:export-bgcolor="#b9b9b9ff"><inkscape:grid
       type="xygrid"
       id="grid146364"
       originx="99.999527"
       originy="130.00017"
       spacingy="1"
       spacingx="1"
       units="px"
       visible="false" /></sodipodi:namedview><metadata
     id="metadata5"><rdf:RDF><cc:Work
         rdf:about=""><dc:format>image/svg+xml</dc:format><dc:type
           rdf:resource="http://purl.org/dc/dcmitype/StillImage" /></cc:Work></rdf:RDF></metadata><g
     inkscape:label="Tavolo 1"
     inkscape:groupmode="layer"
     id="layer1"
     transform="translate(-4753.0757,-922.24982)"><flowRoot
       xml:space="preserve"
       id="flowRoot12300"
       style="color:#000000;font-style:normal;font-variant:normal;font-weight:bold;font-stretch:normal;font-size:14.6667px;line-height:110%;font-family:Cantarell;-inkscape-font-specification:'Cantarell Bold';font-variant-ligatures:normal;font-variant-caps:normal;font-variant-numeric:normal;font-feature-settings:normal;text-align:center;writing-mode:lr-tb;text-anchor:middle;clip-rule:nonzero;display:inline;overflow:visible;visibility:visible;opacity:1;color-interpolation:sRGB;color-interpolation-filters:linearRGB;fill:#2e3436;fill-opacity:1;fill-rule:nonzero;stroke:#a7a7a7;stroke-width:2;stroke-linecap:round;stroke-linejoin:round;stroke-miterlimit:4;stroke-dasharray:none;stroke-dashoffset:0;stroke-opacity:1;marker:none;color-rendering:auto;image-rendering:auto;shape-rendering:auto;text-rendering:auto;enable-background:accumulate"
       transform="translate(-12506.892,-4379.7484)"><flowRegion
         id="flowRegion12302"><rect
           id="rect12304"
           width="268"
           height="296"
           x="4166"
           y="7431.9995" /></flowRegion><flowPara
         id="flowPara12306" /></flowRoot><g
       inkscape:export-ydpi="96"
       inkscape:export-xdpi="96"
       id="g37175"
       transform="translate(-1010.8832,3438.6214)"
       style="fill:#2e3436;fill-opacity:1"><g
         style="display:inline;fill:#2e3436;fill-opacity:1"
         id="g37155"
         transform="translate(-441.0002,-519)"
         inkscape:label="status" /><g
         id="g37157"
         transform="translate(-441.0002,-519)"
         inkscape:label="devices"
         style="fill:#2e3436;fill-opacity:1" /><g
         id="g37159"
         transform="translate(-441.0002,-519)"
         inkscape:label="apps"
         style="fill:#2e3436;fill-opacity:1" /><g
         id="g37161"
         transform="translate(-441.0002,-519)"
         inkscape:label="places"
         style="fill:#2e3436;fill-opacity:1" /><g
         id="g37163"
         transform="translate(-441.0002,-519)"
         inkscape:label="mimetypes"
         style="fill:#2e3436;fill-opacity:1" /><g
         style="display:inline;fill:#2e3436;fill-opacity:1"
         id="g37165"
         transform="translate(-441.0002,-519)"
         inkscape:label="emblems" /><g
         style="display:inline;fill:#2e3436;fill-opacity:1"
         id="g37169"
         transform="translate(-441.0002,-519)"
         inkscape:label="emotes" /><g
         style="display:inline;fill:#2e3436;fill-opacity:1"
         id="g37171"
         transform="translate(-441.0002,-519)"
         inkscape:label="categories" /><g
         style="display:inline;fill:#2e3436;fill-opacity:1"
         id="g37173"
         transform="translate(-441.0002,-519)"
         inkscape:label="actions" /></g><text
       xml:space="preserve"
       style="font-style:normal;font-variant:normal;font-weight:normal;font-stretch:normal;font-size:12px;line-height:0%;font-family:Cantarell;-inkscape-font-specification:Cantarell;text-align:center;letter-spacing:0px;word-spacing:0px;text-anchor:middle;display:inline;fill:#7a7a79;fill-opacity:1;stroke:none;stroke-width:1"
       x="1973.0708"
       y="4032.2498"
       id="text21545" /><g
       id="g14183"
       transform="translate(-69.917664,399.99392)" /><text
       xml:space="preserve"
       style="font-style:normal;font-weight:normal;font-size:40px;line-height:1.25;font-family:sans-serif;letter-spacing:0px;word-spacing:0px;fill:#000000;fill-opacity:1;stroke:none;stroke-width:1"
       x="5683.002"
       y="2009.5724"
       id="text11897" /><text
       xml:space="preserve"
       style="font-style:normal;font-variant:normal;font-weight:800;font-stretch:normal;font-size:48px;line-height:0%;font-family:Cantarell;-inkscape-font-specification:'Cantarell Ultra-Bold';text-align:start;letter-spacing:0px;word-spacing:0px;text-anchor:start;display:inline;fill:#343a3c;fill-opacity:1;stroke:none;stroke-width:1"
       x="4853.1094"
       y="1050.2498"
       id="text23490"><tspan
         style="font-style:normal;font-variant:normal;font-weight:800;font-stretch:normal;font-size:48px;line-height:1.25;font-family:Cantarell;-inkscape-font-specification:'Cantarell Ultra-Bold';text-align:start;text-anchor:start;fill:#343a3c;fill-opacity:1;stroke-width:1"
         sodipodi:role="line"
         id="tspan23488"
         x="4853.1094"
         y="1050.2498">Disk Image Open Dialog</tspan></text><g
       style="stroke-width:0.264583"
       id="g4558-6"
       transform="matrix(3.7795273,0,0,-3.7795273,2672.6581,2754.2658)"
       inkscape:export-xdpi="96"
       inkscape:export-ydpi="96" /><g
       id="g172431"
       transform="matrix(1,0,0,-1,865.00017,2407.034)" /><text
       xml:space="preserve"
       style="font-style:normal;font-variant:normal;font-weight:bold;font-stretch:normal;font-size:16px;line-height:0%;font-family:Cantarell;-inkscape-font-specification:'Cantarell Bold';text-align:start;letter-spacing:0px;word-spacing:0px;text-anchor:start;display:inline;fill:#343a3c;fill-opacity:1;stroke:none;stroke-width:1"
       x="4853.1094"
       y="1100.2498"
       id="text51342"><tspan
         style="font-style:normal;font-variant:normal;font-weight:normal;font-stretch:normal;font-size:16px;line-height:1.25;font-family:Cantarell;-inkscape-font-specification:'Cantarell Bold';text-align:start;text-anchor:start;fill:#343a3c;fill-opacity:1;stroke-width:1"
         sodipodi:role="line"
         id="tspan51340"
         x="4853.1094"
         y="1100.2498">When opening a disk image from Files there are a number of possible options, some of which require a bit of explanation.</tspan></text><g
       id="g33131"
       transform="translate(380.08234,399.99392)" /><text
       xml:space="preserve"
       style="font-size:45.3333px;line-height:0.9;font-family:'Inter UI';-inkscape-font-specification:'Inter UI';text-align:center;letter-spacing:0.2px;word-spacing:0px;text-anchor:middle"
       x="6298.5898"
       y="1258.2498"
       id="text338112"><tspan
         sodipodi:role="line"
         id="tspan338110"
         x="6298.5898"
         y="1258.2498" /></text><rect
       inkscape:export-ydpi="90"
       inkscape:export-xdpi="90"
       style="display:inline;fill:#fafafa;fill-opacity:1;stroke:none;stroke-width:0;stroke-miterlimit:4;stroke-dasharray:none;stroke-opacity:1"
       id="rect2"
       width="480"
       height="555.00006"
       x="4853.0757"
       y="1237.2499"
       rx="12"
       ry="11.999999" /><text
       xml:space="preserve"
       transform="translate(4751.5791,4984.3597)"
       id="text18"
       style="font-style:normal;font-variant:normal;font-weight:normal;font-stretch:normal;font-size:24px;line-height:1.45;font-family:Cantarell;-inkscape-font-specification:Cantarell;white-space:pre;shape-inside:url(#rect20);display:inline;fill:#343a3c;fill-opacity:1;stroke:none"><tspan
         x="219.48438"
         y="-3552.0555"
         id="tspan9"><tspan
           style="font-weight:800;-inkscape-font-specification:'Cantarell Ultra-Bold'"
           id="tspan3">gnome-os-nightly.iso</tspan></tspan></text><g
       id="g171"
       transform="translate(-79.566406,-317.92981)"><rect
         inkscape:export-ydpi="90"
         inkscape:export-xdpi="90"
         style="display:inline;fill:#000000;fill-opacity:0.08;stroke:#000000;stroke-width:0;stroke-miterlimit:4;stroke-dasharray:none;stroke-opacity:1"
         id="rect3-9"
         width="402.00003"
         height="222.93927"
         x="4972.0757"
         y="1779.2499"
         rx="12"
         ry="12" /><rect
         inkscape:export-ydpi="90"
         inkscape:export-xdpi="90"
         style="display:inline;fill:#fcfdff;fill-opacity:1;stroke:#ececec;stroke-width:0;stroke-miterlimit:4;stroke-dasharray:none;stroke-opacity:1"
         id="rect4-3"
         width="400"
         height="218.92982"
         x="4973.064"
         y="1780.2594"
         rx="12"
         ry="11.999999" /><text
         xml:space="preserve"
         style="font-style:normal;font-variant:normal;font-weight:normal;font-stretch:normal;font-size:14.6667px;line-height:0%;font-family:Cantarell;-inkscape-font-specification:Cantarell;text-align:start;letter-spacing:0px;word-spacing:0px;text-anchor:start;display:inline;fill:#2e3436;fill-opacity:1;stroke:none;stroke-width:0.999999"
         x="5014.0659"
         y="1803.0262"
         id="text4-3"><tspan
           style="font-size:14.6667px;line-height:1.25;text-align:start;text-anchor:start;stroke-width:0.999999"
           sodipodi:role="line"
           id="tspan4-8"
           x="5014.0659"
           y="1803.0262">Open in Files</tspan></text><path
         style="display:inline;fill:none;stroke:#ebebeb;stroke-width:0.999999px;stroke-linecap:butt;stroke-linejoin:miter;stroke-opacity:1"
         d="m 5373.0596,1944.7596 h -400"
         id="path4-0"
         inkscape:connector-curvature="0" /><text
         xml:space="preserve"
         style="font-style:normal;font-variant:normal;font-weight:normal;font-stretch:normal;font-size:14.6667px;line-height:0%;font-family:Cantarell;-inkscape-font-specification:Cantarell;text-align:start;letter-spacing:0px;word-spacing:0px;text-anchor:start;display:inline;fill:#2e3436;fill-opacity:1;stroke:none;stroke-width:0.999999"
         x="5014.0659"
         y="1860.1498"
         id="text6-5"><tspan
           style="font-size:14.6667px;line-height:1.25;text-align:start;text-anchor:start;stroke-width:0.999999"
           sodipodi:role="line"
           id="tspan6-6"
           x="5014.0659"
           y="1860.1498">Edit Contents in Files</tspan></text><path
         style="display:inline;fill:none;stroke:#ebebeb;stroke-width:0.999999px;stroke-linecap:butt;stroke-linejoin:miter;stroke-opacity:1"
         d="m 5373.0596,1889.8572 h -400"
         id="path6-6"
         inkscape:connector-curvature="0" /><path
         style="display:inline;fill:none;stroke:#ebebeb;stroke-width:0.999999px;stroke-linecap:butt;stroke-linejoin:miter;stroke-opacity:1"
         d="m 5373.0596,1834.8069 h -400"
         id="path7-4"
         inkscape:connector-curvature="0" /><text
         xml:space="preserve"
         style="font-style:normal;font-variant:normal;font-weight:normal;font-stretch:normal;font-size:12px;line-height:0%;font-family:Cantarell;-inkscape-font-specification:Cantarell;text-align:start;letter-spacing:0px;word-spacing:0px;text-anchor:start;display:inline;fill:#323232;fill-opacity:0.53496;stroke:none;stroke-width:0.999999"
         x="5014.0659"
         y="1819.0262"
         id="text9-0"><tspan
           style="font-size:12px;line-height:1.25;text-align:start;text-anchor:start;fill:#323232;fill-opacity:0.53496;stroke-width:0.999999"
           sodipodi:role="line"
           id="tspan7-0"
           x="5014.0659"
           y="1819.0262">Mount the image read-only</tspan></text><text
         xml:space="preserve"
         style="font-style:normal;font-variant:normal;font-weight:normal;font-stretch:normal;font-size:12px;line-height:0%;font-family:Cantarell;-inkscape-font-specification:Cantarell;text-align:start;letter-spacing:0px;word-spacing:0px;text-anchor:start;display:inline;fill:#323232;fill-opacity:0.53496;stroke:none;stroke-width:0.999999"
         x="5014.0659"
         y="1876.1498"
         id="text111-4"><tspan
           style="font-size:12px;line-height:1.25;text-align:start;text-anchor:start;fill:#323232;fill-opacity:0.53496;stroke-width:0.999999"
           sodipodi:role="line"
           id="tspan111-6"
           x="5014.0659"
           y="1876.1498">Mount the image and allow editing</tspan></text><circle
         r="7.5000005"
         cy="1807.2528"
         cx="4994.6147"
         id="circle111-2"
         style="fill:#3584e4;fill-opacity:1;stroke:#2271d1;stroke-width:0.999999;stroke-linecap:butt;stroke-miterlimit:4;stroke-dasharray:none;stroke-dashoffset:0;stroke-opacity:1" /><circle
         style="fill:#ffffff;fill-opacity:1;stroke:none;stroke-width:0.999999;stroke-linecap:butt;stroke-miterlimit:4;stroke-dasharray:none;stroke-dashoffset:0;stroke-opacity:1"
         id="circle112-6"
         cx="4994.6147"
         cy="1807.2528"
         r="3.5" /><circle
         style="fill:#ffffff;fill-opacity:1;stroke:#d0d0d0;stroke-width:0.999999;stroke-linecap:butt;stroke-miterlimit:4;stroke-dasharray:none;stroke-dashoffset:0;stroke-opacity:1"
         id="circle113-7"
         cx="4994.6147"
         cy="1860.7836"
         r="7.5000005" /><path
         style="display:inline;fill:none;stroke:#ebebeb;stroke-width:0.999999px;stroke-linecap:butt;stroke-linejoin:miter;stroke-opacity:1"
         d="m 5373.0596,1944.7587 h -400"
         id="path113-5"
         inkscape:connector-curvature="0" /><g
         id="g132-6"
         transform="translate(80.5547,-341.06068)"><text
           xml:space="preserve"
           style="font-style:normal;font-variant:normal;font-weight:normal;font-stretch:normal;font-size:14.6667px;line-height:0%;font-family:Cantarell;-inkscape-font-specification:Cantarell;letter-spacing:0px;word-spacing:0px;display:inline;fill:#2e3436;fill-opacity:1;stroke:none;stroke-width:0.999999"
           x="4933.5112"
           y="2310.6299"
           id="text124-9"><tspan
             style="font-size:14.6667px;line-height:1.25;stroke-width:0.999999"
             sodipodi:role="line"
             id="tspan124-8"
             x="4933.5112"
             y="2310.6299">Inspect in Disks</tspan></text><text
           xml:space="preserve"
           style="font-style:normal;font-variant:normal;font-weight:normal;font-stretch:normal;font-size:14.6667px;line-height:0%;font-family:Cantarell;-inkscape-font-specification:Cantarell;text-align:start;letter-spacing:0px;word-spacing:0px;text-anchor:start;display:inline;fill:#2e3436;fill-opacity:1;stroke:none;stroke-width:0.999999"
           x="4933.5112"
           y="2256.2104"
           id="text125-7"><tspan
             style="font-size:14.6667px;line-height:1.25;text-align:start;text-anchor:start;stroke-width:0.999999"
             sodipodi:role="line"
             id="tspan125-2"
             x="4933.5112"
             y="2256.2104">Write to Drive</tspan></text><path
           style="display:inline;fill:none;stroke:#ebebeb;stroke-width:0.999999px;stroke-linecap:butt;stroke-linejoin:miter;stroke-opacity:1"
           d="m 5292.5049,2285.9179 h -400"
           id="path128-8"
           inkscape:connector-curvature="0" /><path
           style="display:inline;fill:none;stroke:#ebebeb;stroke-width:0.999999px;stroke-linecap:butt;stroke-linejoin:miter;stroke-opacity:1"
           d="m 5292.5049,2230.8676 h -400"
           id="path129-2"
           inkscape:connector-curvature="0" /><text
           xml:space="preserve"
           style="font-style:normal;font-variant:normal;font-weight:normal;font-stretch:normal;font-size:12px;line-height:0%;font-family:Cantarell;-inkscape-font-specification:Cantarell;letter-spacing:0px;word-spacing:0px;display:inline;fill:#323232;fill-opacity:0.53496;stroke:none;stroke-width:0.999999"
           x="4933.5112"
           y="2326.6299"
           id="text129-9"><tspan
             style="font-size:12px;line-height:1.25;fill:#323232;fill-opacity:0.53496;stroke-width:0.999999"
             sodipodi:role="line"
             id="tspan129-9"
             x="4933.5112"
             y="2326.6299">Attach image and open in Disks</tspan></text><text
           xml:space="preserve"
           style="font-style:normal;font-variant:normal;font-weight:normal;font-stretch:normal;font-size:12px;line-height:0%;font-family:Cantarell;-inkscape-font-specification:Cantarell;text-align:start;letter-spacing:0px;word-spacing:0px;text-anchor:start;display:inline;fill:#323232;fill-opacity:0.53496;stroke:none;stroke-width:0.999999"
           x="4933.5112"
           y="2272.2104"
           id="text130-6"><tspan
             style="font-size:12px;line-height:1.25;text-align:start;text-anchor:start;fill:#323232;fill-opacity:0.53496;stroke-width:0.999999"
             sodipodi:role="line"
             id="tspan130-0"
             x="4933.5112"
             y="2272.2104">Open in Disks to write the image to a drive</tspan></text><circle
           style="fill:#ffffff;fill-opacity:1;stroke:#d0d0d0;stroke-width:0.999999;stroke-linecap:butt;stroke-miterlimit:4;stroke-dasharray:none;stroke-dashoffset:0;stroke-opacity:1"
           id="circle130-2"
           cx="4914.0601"
           cy="2256.8442"
           r="7.5000005" /><circle
           style="fill:#ffffff;fill-opacity:1;stroke:#d0d0d0;stroke-width:0.999999;stroke-linecap:butt;stroke-miterlimit:4;stroke-dasharray:none;stroke-dashoffset:0;stroke-opacity:1"
           id="circle131-7"
           cx="4914.0601"
           cy="2313.3687"
           r="7.5000005" /><path
           style="display:inline;fill:none;stroke:#ebebeb;stroke-width:0.999999px;stroke-linecap:butt;stroke-linejoin:miter;stroke-opacity:1"
           d="M 5261.9346,2340.8194 H 4923.0753"
           id="path131-6"
           inkscape:connector-curvature="0" /></g></g><path
       id="path1-9"
       style="opacity:0.5;fill:#343a3c;fill-opacity:1;stroke-width:7.99998"
       d="m 5093.0796,1283.3588 c -30.7504,0 -56.0001,25.2496 -56.0001,56 0,30.7499 25.2497,56 56.0001,56 30.7499,0 55.9999,-25.2501 55.9999,-56 0,-30.7504 -25.25,-56 -55.9999,-56 z m 0,31.9999 c 13.4373,0 24,10.5625 24,24.0001 0,13.4373 -10.5627,24 -24,24 -13.4376,0 -24.0002,-10.5627 -24.0002,-24 0,-13.4376 10.5626,-24.0001 24.0002,-24.0001 z m 0,7.9999 c -8.7812,0 -16.0003,7.219 -16.0003,16.0002 0,8.7812 7.2191,16.0001 16.0003,16.0001 8.7812,0 16.0001,-7.2189 16.0001,-16.0001 0,-8.7812 -7.2189,-16.0002 -16.0001,-16.0002 z m 0,8.0003 c 4.4686,0 7.9999,3.531 7.9999,7.9999 0,4.4686 -3.5313,7.9999 -7.9999,7.9999 -4.4689,0 -7.9999,-3.5313 -7.9999,-7.9999 0,-4.4689 3.531,-7.9999 7.9999,-7.9999 z" /><g
       id="g114-3"
       transform="matrix(3.7795276,0,0,3.7795276,5782.6299,1896.727)"><rect
         style="fill:#e1e1e1;fill-opacity:0;stroke:#3584e4;stroke-width:0;stroke-dasharray:none;stroke-opacity:1"
         id="rect82-0"
         width="8.9958324"
         height="8.9958324"
         x="-129.52809"
         y="-172.89906" /><g
         id="g85-6"
         transform="translate(-528.83347,-406.75068)"><circle
           style="display:inline;fill:#d8d8d8;fill-opacity:1;stroke:#3584e4;stroke-width:0;stroke-miterlimit:4;stroke-dasharray:none"
           id="circle82-2"
           cx="403.73734"
           cy="238.35095"
           r="2.9104161" /><g
           style="display:inline;fill:#2e3436;fill-opacity:1"
           transform="matrix(0.26458334,0,0,0.26458334,385.74658,99.1838)"
           id="g84-6"><g
             transform="translate(19,-242)"
             id="g82-1"
             style="display:inline;fill:#2e3436;fill-opacity:1"><path
               inkscape:connector-curvature="0"
               d="m 45,764 h 1 c 0.01037,-1.2e-4 0.02079,-4.6e-4 0.03125,0 0.254951,0.0112 0.50987,0.12858 0.6875,0.3125 L 49,766.59375 51.3125,764.3125 C 51.578125,764.082 51.759172,764.007 52,764 h 1 v 1 c 0,0.28647 -0.03434,0.55065 -0.25,0.75 l -2.28125,2.28125 2.25,2.25 C 52.906938,770.46942 52.999992,770.7347 53,771 v 1 h -1 c -0.265301,-10e-6 -0.530586,-0.0931 -0.71875,-0.28125 L 49,769.4375 46.71875,771.71875 C 46.530586,771.90694 46.26529,772 46,772 h -1 v -1 c -3e-6,-0.26529 0.09306,-0.53058 0.28125,-0.71875 l 2.28125,-2.25 L 45.28125,765.75 C 45.070508,765.55537 44.97809,765.28075 45,765 Z"
               id="path82-8"
               style="color:#bebebe;font-style:normal;font-variant:normal;font-weight:normal;font-stretch:normal;font-size:medium;line-height:normal;font-family:'Andale Mono';-inkscape-font-specification:'Andale Mono';text-indent:0;text-align:start;text-decoration:none;text-decoration-line:none;letter-spacing:normal;word-spacing:normal;text-transform:none;writing-mode:lr-tb;direction:ltr;text-anchor:start;display:inline;overflow:visible;visibility:visible;fill:#2e3436;fill-opacity:1;fill-rule:nonzero;stroke:none;stroke-width:1.78125;marker:none;enable-background:new" /></g></g></g></g><g
       id="g115"
       transform="matrix(3.7795276,0,0,3.7795276,5770.074,2564.3587)"><rect
         style="fill:#3584e4;fill-opacity:1;stroke:none;stroke-width:0.264583;stroke-linecap:round"
         id="rect622"
         width="38.66666"
         height="11.641666"
         x="-198.45624"
         y="-225.95416"
         rx="5.8208332"
         ry="5.8208332" /><flowRoot
         transform="matrix(0.26458333,0,0,0.26458333,-316.82875,-463.24275)"
         style="font-style:normal;font-weight:normal;font-size:40px;line-height:1.25;font-family:sans-serif;text-align:center;letter-spacing:0px;word-spacing:0px;text-anchor:middle;fill:#000000;fill-opacity:1;stroke:none"
         id="flowRoot623"
         xml:space="preserve"><flowRegion
           id="flowRegion623"
           style="text-align:center;text-anchor:middle;stroke:none"><rect
             y="888"
             x="157"
             height="104"
             width="727"
             id="rect623"
             style="stroke:none;stroke-width:1;text-anchor:middle;text-align:center" /></flowRegion><flowPara
           style="font-style:normal;font-variant:normal;font-weight:bold;font-stretch:normal;font-size:14.6667px;font-family:Cantarell;-inkscape-font-specification:Cantarell;text-align:center;text-anchor:middle;fill:#ffffff;stroke:none"
           id="flowPara623">Open in Files</flowPara></flowRoot></g><rect
       inkscape:export-ydpi="90"
       inkscape:export-xdpi="90"
       style="display:inline;fill:#fafafa;fill-opacity:1;stroke:none;stroke-width:0;stroke-miterlimit:4;stroke-dasharray:none;stroke-opacity:1"
       id="rect115"
       width="480"
       height="513.40808"
       x="6243.0757"
       y="1237.2499"
       rx="12"
       ry="12" /><text
       xml:space="preserve"
       transform="translate(6141.5785,4984.3597)"
       id="text116"
       style="font-style:normal;font-variant:normal;font-weight:normal;font-stretch:normal;font-size:24px;line-height:1.45;font-family:Cantarell;-inkscape-font-specification:Cantarell;white-space:pre;shape-inside:url(#rect132);display:inline;fill:#343a3c;fill-opacity:1;stroke:none"><tspan
         x="219.48438"
         y="-3552.0555"
         id="tspan14"><tspan
           style="font-weight:800;-inkscape-font-specification:'Cantarell Ultra-Bold'"
           id="tspan12">gnome-os-nightly.iso</tspan></tspan></text><rect
       inkscape:export-ydpi="90"
       inkscape:export-xdpi="90"
       style="display:inline;fill:#000000;fill-opacity:0.08;stroke:#000000;stroke-width:0;stroke-miterlimit:4;stroke-dasharray:none;stroke-opacity:1"
       id="rect116"
       width="402.00003"
       height="168.99998"
       x="6281.52"
       y="1460.3104"
       rx="12"
       ry="12" /><rect
       inkscape:export-ydpi="90"
       inkscape:export-xdpi="90"
       style="display:inline;fill:#fcfdff;fill-opacity:1;stroke:#ececec;stroke-width:0;stroke-miterlimit:4;stroke-dasharray:none;stroke-opacity:1"
       id="rect117"
       width="400"
       height="164"
       x="6282.5088"
       y="1461.3199"
       rx="12"
       ry="12" /><text
       xml:space="preserve"
       style="font-style:normal;font-variant:normal;font-weight:normal;font-stretch:normal;font-size:14.6667px;line-height:0%;font-family:Cantarell;-inkscape-font-specification:Cantarell;text-align:start;letter-spacing:0px;word-spacing:0px;text-anchor:start;display:inline;fill:#2e3436;fill-opacity:1;stroke:none;stroke-width:0.999999"
       x="6323.5107"
       y="1484.0868"
       id="text117"><tspan
         style="font-size:14.6667px;line-height:1.25;text-align:start;text-anchor:start;stroke-width:0.999999"
         sodipodi:role="line"
         id="tspan117"
         x="6323.5107"
         y="1484.0868">Open Disk Image in Files</tspan></text><text
       xml:space="preserve"
       style="font-style:normal;font-variant:normal;font-weight:normal;font-stretch:normal;font-size:14.6667px;line-height:0%;font-family:Cantarell;-inkscape-font-specification:Cantarell;letter-spacing:0px;word-spacing:0px;display:inline;fill:#2e3436;fill-opacity:1;stroke:none;stroke-width:0.999999"
       x="6323.5107"
       y="1595.63"
       id="text118"><tspan
         style="font-size:14.6667px;line-height:1.25;stroke-width:0.999999"
         sodipodi:role="line"
         id="tspan118"
         x="6323.5107"
         y="1595.63">Write Disk Image to Drive</tspan></text><path
       style="display:inline;fill:none;stroke:#ebebeb;stroke-width:0.999999px;stroke-linecap:butt;stroke-linejoin:miter;stroke-opacity:1"
       d="M 6682.5042,1625.8203 H 6282.5043"
       id="path118"
       inkscape:connector-curvature="0" /><text
       xml:space="preserve"
       style="font-style:normal;font-variant:normal;font-weight:normal;font-stretch:normal;font-size:14.6667px;line-height:0%;font-family:Cantarell;-inkscape-font-specification:Cantarell;text-align:start;letter-spacing:0px;word-spacing:0px;text-anchor:start;display:inline;fill:#2e3436;fill-opacity:1;stroke:none;stroke-width:0.999999"
       x="6323.5107"
       y="1541.2106"
       id="text119"><tspan
         style="font-size:14.6667px;line-height:1.25;text-align:start;text-anchor:start;stroke-width:0.999999"
         sodipodi:role="line"
         id="tspan119"
         x="6323.5107"
         y="1541.2106">Edit Disk Image Contents in Files</tspan></text><path
       style="display:inline;fill:none;stroke:#ebebeb;stroke-width:0.999999px;stroke-linecap:butt;stroke-linejoin:miter;stroke-opacity:1"
       d="M 6682.5042,1570.918 H 6282.5043"
       id="path119"
       inkscape:connector-curvature="0" /><path
       style="display:inline;fill:none;stroke:#ebebeb;stroke-width:0.999999px;stroke-linecap:butt;stroke-linejoin:miter;stroke-opacity:1"
       d="M 6682.5042,1515.8676 H 6282.5043"
       id="path120"
       inkscape:connector-curvature="0" /><text
       xml:space="preserve"
       style="font-style:normal;font-variant:normal;font-weight:normal;font-stretch:normal;font-size:12px;line-height:0%;font-family:Cantarell;-inkscape-font-specification:Cantarell;text-align:start;letter-spacing:0px;word-spacing:0px;text-anchor:start;display:inline;fill:#323232;fill-opacity:0.53496;stroke:none;stroke-width:0.999999"
       x="6323.5107"
       y="1500.087"
       id="text120"><tspan
         style="font-size:12px;line-height:1.25;text-align:start;text-anchor:start;fill:#323232;fill-opacity:0.53496;stroke-width:0.999999"
         sodipodi:role="line"
         id="tspan120"
         x="6323.5107"
         y="1500.087">Mount the image read-only</tspan></text><text
       xml:space="preserve"
       style="font-style:normal;font-variant:normal;font-weight:normal;font-stretch:normal;font-size:12px;line-height:0%;font-family:Cantarell;-inkscape-font-specification:Cantarell;letter-spacing:0px;word-spacing:0px;display:inline;fill:#323232;fill-opacity:0.53496;stroke:none;stroke-width:0.999999"
       x="6323.5107"
       y="1611.63"
       id="text121"><tspan
         style="font-size:12px;line-height:1.25;fill:#323232;fill-opacity:0.53496;stroke-width:0.999999"
         sodipodi:role="line"
         id="tspan121"
         x="6323.5107"
         y="1611.63">Open in Disks to write the image to a drive</tspan></text><text
       xml:space="preserve"
       style="font-style:normal;font-variant:normal;font-weight:normal;font-stretch:normal;font-size:12px;line-height:0%;font-family:Cantarell;-inkscape-font-specification:Cantarell;text-align:start;letter-spacing:0px;word-spacing:0px;text-anchor:start;display:inline;fill:#323232;fill-opacity:0.53496;stroke:none;stroke-width:0.999999"
       x="6323.5107"
       y="1557.2103"
       id="text122"><tspan
         style="font-size:12px;line-height:1.25;text-align:start;text-anchor:start;fill:#323232;fill-opacity:0.53496;stroke-width:0.999999"
         sodipodi:role="line"
         id="tspan122"
         x="6323.5107"
         y="1557.2103">Mount the image and allow editing</tspan></text><circle
       r="7.5000005"
       cy="1488.3134"
       cx="6304.0596"
       id="circle122"
       style="fill:#ffffff;fill-opacity:1;stroke:#d0d0d0;stroke-width:0.999999;stroke-linecap:butt;stroke-miterlimit:4;stroke-dasharray:none;stroke-dashoffset:0;stroke-opacity:1" /><circle
       style="fill:#ffffff;fill-opacity:1;stroke:#d0d0d0;stroke-width:0.999999;stroke-linecap:butt;stroke-miterlimit:4;stroke-dasharray:none;stroke-dashoffset:0;stroke-opacity:1"
       id="circle124"
       cx="6304.0596"
       cy="1541.8439"
       r="7.5000005" /><circle
       style="fill:#ffffff;fill-opacity:1;stroke:#d0d0d0;stroke-width:0.999999;stroke-linecap:butt;stroke-miterlimit:4;stroke-dasharray:none;stroke-dashoffset:0;stroke-opacity:1"
       id="circle125"
       cx="6304.0596"
       cy="1598.3688"
       r="7.5000005" /><path
       style="display:inline;fill:none;stroke:#ebebeb;stroke-width:0.999999px;stroke-linecap:butt;stroke-linejoin:miter;stroke-opacity:1"
       d="M 6682.5042,1625.8195 H 6282.5043"
       id="path125"
       inkscape:connector-curvature="0" /><path
       id="path126"
       style="opacity:0.5;fill:#343a3c;fill-opacity:1;stroke-width:7.99998"
       d="m 6483.0789,1283.3588 c -30.7504,0 -56,25.2496 -56,56 0,30.7499 25.2496,56 56,56 30.75,0 56,-25.2501 56,-56 0,-30.7504 -25.25,-56 -56,-56 z m 0,31.9999 c 13.4373,0 24,10.5625 24,24.0001 0,13.4373 -10.5627,24 -24,24 -13.4376,0 -24.0001,-10.5627 -24.0001,-24 0,-13.4376 10.5625,-24.0001 24.0001,-24.0001 z m 0,7.9999 c -8.7812,0 -16.0002,7.219 -16.0002,16.0002 0,8.7812 7.219,16.0001 16.0002,16.0001 8.7812,0 16.0002,-7.2189 16.0002,-16.0001 0,-8.7812 -7.219,-16.0002 -16.0002,-16.0002 z m 0,8.0003 c 4.4687,0 7.9999,3.531 7.9999,7.9999 0,4.4686 -3.5312,7.9999 -7.9999,7.9999 -4.4689,0 -7.9999,-3.5313 -7.9999,-7.9999 0,-4.4689 3.531,-7.9999 7.9999,-7.9999 z" /><g
       id="g130"
       transform="matrix(3.7795276,0,0,3.7795276,7172.6299,1896.727)"><rect
         style="fill:#e1e1e1;fill-opacity:0;stroke:#3584e4;stroke-width:0;stroke-dasharray:none;stroke-opacity:1"
         id="rect126"
         width="8.9958324"
         height="8.9958324"
         x="-129.52809"
         y="-172.89906" /><g
         id="g129"
         transform="translate(-528.83347,-406.75068)"><circle
           style="display:inline;fill:#d8d8d8;fill-opacity:1;stroke:#3584e4;stroke-width:0;stroke-miterlimit:4;stroke-dasharray:none"
           id="circle126"
           cx="403.73734"
           cy="238.35095"
           r="2.9104161" /><g
           style="display:inline;fill:#2e3436;fill-opacity:1"
           transform="matrix(0.26458334,0,0,0.26458334,385.74658,99.1838)"
           id="g128"><g
             transform="translate(19,-242)"
             id="g127"
             style="display:inline;fill:#2e3436;fill-opacity:1"><path
               inkscape:connector-curvature="0"
               d="m 45,764 h 1 c 0.01037,-1.2e-4 0.02079,-4.6e-4 0.03125,0 0.254951,0.0112 0.50987,0.12858 0.6875,0.3125 L 49,766.59375 51.3125,764.3125 C 51.578125,764.082 51.759172,764.007 52,764 h 1 v 1 c 0,0.28647 -0.03434,0.55065 -0.25,0.75 l -2.28125,2.28125 2.25,2.25 C 52.906938,770.46942 52.999992,770.7347 53,771 v 1 h -1 c -0.265301,-10e-6 -0.530586,-0.0931 -0.71875,-0.28125 L 49,769.4375 46.71875,771.71875 C 46.530586,771.90694 46.26529,772 46,772 h -1 v -1 c -3e-6,-0.26529 0.09306,-0.53058 0.28125,-0.71875 l 2.28125,-2.25 L 45.28125,765.75 C 45.070508,765.55537 44.97809,765.28075 45,765 Z"
               id="path127"
               style="color:#bebebe;font-style:normal;font-variant:normal;font-weight:normal;font-stretch:normal;font-size:medium;line-height:normal;font-family:'Andale Mono';-inkscape-font-specification:'Andale Mono';text-indent:0;text-align:start;text-decoration:none;text-decoration-line:none;letter-spacing:normal;word-spacing:normal;text-transform:none;writing-mode:lr-tb;direction:ltr;text-anchor:start;display:inline;overflow:visible;visibility:visible;fill:#2e3436;fill-opacity:1;fill-rule:nonzero;stroke:none;stroke-width:1.78125;marker:none;enable-background:new" /></g></g></g></g><g
       id="g131"
       transform="matrix(3.7795276,0,0,3.7795276,7160.074,2514.3587)"><rect
         style="fill:#3584e4;fill-opacity:1;stroke:none;stroke-width:0.264583;stroke-linecap:round"
         id="rect130"
         width="49.791683"
         height="11.641666"
         x="-204.01875"
         y="-225.95416"
         rx="5.8208332"
         ry="5.8208332" /><flowRoot
         transform="matrix(0.26458333,0,0,0.26458333,-316.82875,-463.24275)"
         style="font-style:normal;font-weight:normal;font-size:40px;line-height:1.25;font-family:sans-serif;text-align:center;letter-spacing:0px;word-spacing:0px;text-anchor:middle;fill:#000000;fill-opacity:1;stroke:none"
         id="flowRoot131"
         xml:space="preserve"><flowRegion
           id="flowRegion131"
           style="text-align:center;text-anchor:middle;stroke:none"><rect
             y="888"
             x="157"
             height="104"
             width="727"
             id="rect131"
             style="stroke:none;stroke-width:1;text-anchor:middle;text-align:center" /></flowRegion><flowPara
           style="font-style:normal;font-variant:normal;font-weight:bold;font-stretch:normal;font-size:14.6667px;font-family:Cantarell;-inkscape-font-specification:Cantarell;text-align:center;text-anchor:middle;fill:#ffffff;stroke:none"
           id="flowPara131">Edit Disk Image</flowPara></flowRoot></g><g
       id="g133"
       transform="matrix(3.7795276,0,0,3.7795276,6803.074,2577.8893)"><circle
         r="1.9843751"
         cy="-274.1203"
         cx="-132.0309"
         id="circle132"
         style="fill:#3584e4;fill-opacity:1;stroke:#2271d1;stroke-width:0.264583;stroke-linecap:butt;stroke-miterlimit:4;stroke-dasharray:none;stroke-dashoffset:0;stroke-opacity:1" /><circle
         style="fill:#ffffff;fill-opacity:1;stroke:none;stroke-width:0.264583;stroke-linecap:butt;stroke-miterlimit:4;stroke-dasharray:none;stroke-dashoffset:0;stroke-opacity:1"
         id="circle133"
         cx="-132.0309"
         cy="-274.1203"
         r="0.92604166" /></g><text
       xml:space="preserve"
       style="font-style:normal;font-variant:normal;font-weight:bold;font-stretch:normal;font-size:24px;line-height:0%;font-family:Cantarell;-inkscape-font-specification:'Cantarell Bold';text-align:start;letter-spacing:0px;word-spacing:0px;text-anchor:start;display:inline;fill:#343a3c;fill-opacity:1;stroke:none;stroke-width:1"
       x="4853.1094"
       y="1200.2498"
       id="text5"><tspan
         style="font-style:normal;font-variant:normal;font-weight:bold;font-stretch:normal;font-size:24px;line-height:1.25;font-family:Cantarell;-inkscape-font-specification:'Cantarell Bold';text-align:start;text-anchor:start;fill:#343a3c;fill-opacity:1;stroke-width:1"
         sodipodi:role="line"
         id="tspan5"
         x="4853.1094"
         y="1200.2498">Not mounted yet</tspan></text><rect
       inkscape:export-ydpi="90"
       inkscape:export-xdpi="90"
       style="display:inline;fill:#fafafa;fill-opacity:1;stroke:none;stroke-width:0;stroke-miterlimit:4;stroke-dasharray:none;stroke-opacity:1"
       id="rect5"
       width="480"
       height="645"
       x="5433.0757"
       y="1237.2499"
       rx="12"
       ry="11.999999" /><text
       xml:space="preserve"
       transform="translate(5331.5791,4984.3597)"
       id="text7"
       style="font-style:normal;font-variant:normal;font-weight:normal;font-stretch:normal;font-size:24px;line-height:1.45;font-family:Cantarell;-inkscape-font-specification:Cantarell;white-space:pre;shape-inside:url(#rect39);display:inline;fill:#343a3c;fill-opacity:1;stroke:none"><tspan
         x="219.48438"
         y="-3552.0555"
         id="tspan16"><tspan
           style="font-weight:800;-inkscape-font-specification:'Cantarell Ultra-Bold'"
           id="tspan15">gnome-os-nightly.iso</tspan></tspan></text><rect
       inkscape:export-ydpi="90"
       inkscape:export-xdpi="90"
       style="display:inline;fill:#000000;fill-opacity:0.08;stroke:#000000;stroke-width:0;stroke-miterlimit:4;stroke-dasharray:none;stroke-opacity:1"
       id="rect7"
       width="402.00003"
       height="277.93936"
       x="5471.521"
       y="1500.3104"
       rx="12"
       ry="12" /><rect
       inkscape:export-ydpi="90"
       inkscape:export-xdpi="90"
       style="display:inline;fill:#fcfdff;fill-opacity:1;stroke:#ececec;stroke-width:0;stroke-miterlimit:4;stroke-dasharray:none;stroke-opacity:1"
       id="rect8"
       width="400"
       height="273.92984"
       x="5472.5093"
       y="1501.3201"
       rx="12"
       ry="11.999999" /><text
       xml:space="preserve"
       style="font-style:normal;font-variant:normal;font-weight:normal;font-stretch:normal;font-size:14.6667px;line-height:0%;font-family:Cantarell;-inkscape-font-specification:Cantarell;text-align:start;letter-spacing:0px;word-spacing:0px;text-anchor:start;display:inline;fill:#2e3436;fill-opacity:1;stroke:none;stroke-width:0.999999"
       x="5513.5112"
       y="1524.0869"
       id="text8"><tspan
         style="font-size:14.6667px;line-height:1.25;text-align:start;text-anchor:start;stroke-width:0.999999"
         sodipodi:role="line"
         id="tspan8"
         x="5513.5112"
         y="1524.0869">Open in Files</tspan></text><path
       style="display:inline;fill:none;stroke:#ebebeb;stroke-width:0.999999px;stroke-linecap:butt;stroke-linejoin:miter;stroke-opacity:1"
       d="m 5872.5049,1665.8203 h -400"
       id="path9"
       inkscape:connector-curvature="0" /><text
       xml:space="preserve"
       style="font-style:normal;font-variant:normal;font-weight:normal;font-stretch:normal;font-size:14.6667px;line-height:0%;font-family:Cantarell;-inkscape-font-specification:Cantarell;text-align:start;letter-spacing:0px;word-spacing:0px;text-anchor:start;display:inline;fill:#2e3436;fill-opacity:1;stroke:none;stroke-width:0.999999"
       x="5513.5112"
       y="1581.2104"
       id="text10"><tspan
         style="font-size:14.6667px;line-height:1.25;text-align:start;text-anchor:start;stroke-width:0.999999"
         sodipodi:role="line"
         id="tspan10"
         x="5513.5112"
         y="1581.2104">Unmount Disk Image</tspan></text><path
       style="display:inline;fill:none;stroke:#ebebeb;stroke-width:0.999999px;stroke-linecap:butt;stroke-linejoin:miter;stroke-opacity:1"
       d="m 5872.5049,1610.9179 h -400"
       id="path10"
       inkscape:connector-curvature="0" /><path
       style="display:inline;fill:none;stroke:#ebebeb;stroke-width:0.999999px;stroke-linecap:butt;stroke-linejoin:miter;stroke-opacity:1"
       d="m 5872.5049,1555.8676 h -400"
       id="path11"
       inkscape:connector-curvature="0" /><text
       xml:space="preserve"
       style="font-style:normal;font-variant:normal;font-weight:normal;font-stretch:normal;font-size:12px;line-height:0%;font-family:Cantarell;-inkscape-font-specification:Cantarell;text-align:start;letter-spacing:0px;word-spacing:0px;text-anchor:start;display:inline;fill:#323232;fill-opacity:0.53496;stroke:none;stroke-width:0.999999"
       x="5513.5112"
       y="1540.0869"
       id="text11"><tspan
         style="font-size:12px;line-height:1.25;text-align:start;text-anchor:start;fill:#323232;fill-opacity:0.53496;stroke-width:0.999999"
         sodipodi:role="line"
         id="tspan11"
         x="5513.5112"
         y="1540.0869">Open the mounted image</tspan></text><text
       xml:space="preserve"
       style="font-style:normal;font-variant:normal;font-weight:normal;font-stretch:normal;font-size:12px;line-height:0%;font-family:Cantarell;-inkscape-font-specification:Cantarell;text-align:start;letter-spacing:0px;word-spacing:0px;text-anchor:start;display:inline;fill:#323232;fill-opacity:0.53496;stroke:none;stroke-width:0.999999"
       x="5513.5112"
       y="1597.2104"
       id="text13"><tspan
         style="font-size:12px;line-height:1.25;text-align:start;text-anchor:start;fill:#323232;fill-opacity:0.53496;stroke-width:0.999999"
         sodipodi:role="line"
         id="tspan13"
         x="5513.5112"
         y="1597.2104">Unmount the mounted image</tspan></text><circle
       r="7.5000005"
       cy="1528.3135"
       cx="5494.0601"
       id="circle13"
       style="fill:#3584e4;fill-opacity:1;stroke:#2271d1;stroke-width:0.999999;stroke-linecap:butt;stroke-miterlimit:4;stroke-dasharray:none;stroke-dashoffset:0;stroke-opacity:1" /><circle
       style="fill:#ffffff;fill-opacity:1;stroke:none;stroke-width:0.999999;stroke-linecap:butt;stroke-miterlimit:4;stroke-dasharray:none;stroke-dashoffset:0;stroke-opacity:1"
       id="circle14"
       cx="5494.0601"
       cy="1528.3135"
       r="3.5" /><circle
       style="fill:#ffffff;fill-opacity:1;stroke:#d0d0d0;stroke-width:0.999999;stroke-linecap:butt;stroke-miterlimit:4;stroke-dasharray:none;stroke-dashoffset:0;stroke-opacity:1"
       id="circle15"
       cx="5494.0601"
       cy="1581.8442"
       r="7.5000005" /><path
       style="display:inline;fill:none;stroke:#ebebeb;stroke-width:0.999999px;stroke-linecap:butt;stroke-linejoin:miter;stroke-opacity:1"
       d="m 5872.5049,1665.8194 h -400"
       id="path16"
       inkscape:connector-curvature="0" /><path
       id="path17"
       style="opacity:0.5;fill:#343a3c;fill-opacity:1;stroke-width:7.99998"
       d="m 5673.0796,1283.3588 c -30.7504,0 -56.0001,25.2496 -56.0001,56 0,30.7499 25.2497,56 56.0001,56 30.7499,0 55.9999,-25.2501 55.9999,-56 0,-30.7504 -25.25,-56 -55.9999,-56 z m 0,31.9999 c 13.4373,0 24,10.5625 24,24.0001 0,13.4373 -10.5627,24 -24,24 -13.4376,0 -24.0002,-10.5627 -24.0002,-24 0,-13.4376 10.5626,-24.0001 24.0002,-24.0001 z m 0,7.9999 c -8.7812,0 -16.0003,7.219 -16.0003,16.0002 0,8.7812 7.2191,16.0001 16.0003,16.0001 8.7812,0 16.0001,-7.2189 16.0001,-16.0001 0,-8.7812 -7.2189,-16.0002 -16.0001,-16.0002 z m 0,8.0003 c 4.4686,0 7.9999,3.531 7.9999,7.9999 0,4.4686 -3.5313,7.9999 -7.9999,7.9999 -4.4689,0 -7.9999,-3.5313 -7.9999,-7.9999 0,-4.4689 3.531,-7.9999 7.9999,-7.9999 z" /><g
       id="g21"
       transform="matrix(3.7795276,0,0,3.7795276,6362.6299,1896.727)"><rect
         style="fill:#e1e1e1;fill-opacity:0;stroke:#3584e4;stroke-width:0;stroke-dasharray:none;stroke-opacity:1"
         id="rect17"
         width="8.9958324"
         height="8.9958324"
         x="-129.52809"
         y="-172.89906" /><g
         id="g20"
         transform="translate(-528.83347,-406.75068)"><circle
           style="display:inline;fill:#d8d8d8;fill-opacity:1;stroke:#3584e4;stroke-width:0;stroke-miterlimit:4;stroke-dasharray:none"
           id="circle17"
           cx="403.73734"
           cy="238.35095"
           r="2.9104161" /><g
           style="display:inline;fill:#2e3436;fill-opacity:1"
           transform="matrix(0.26458334,0,0,0.26458334,385.74658,99.1838)"
           id="g19"><g
             transform="translate(19,-242)"
             id="g18"
             style="display:inline;fill:#2e3436;fill-opacity:1"><path
               inkscape:connector-curvature="0"
               d="m 45,764 h 1 c 0.01037,-1.2e-4 0.02079,-4.6e-4 0.03125,0 0.254951,0.0112 0.50987,0.12858 0.6875,0.3125 L 49,766.59375 51.3125,764.3125 C 51.578125,764.082 51.759172,764.007 52,764 h 1 v 1 c 0,0.28647 -0.03434,0.55065 -0.25,0.75 l -2.28125,2.28125 2.25,2.25 C 52.906938,770.46942 52.999992,770.7347 53,771 v 1 h -1 c -0.265301,-10e-6 -0.530586,-0.0931 -0.71875,-0.28125 L 49,769.4375 46.71875,771.71875 C 46.530586,771.90694 46.26529,772 46,772 h -1 v -1 c -3e-6,-0.26529 0.09306,-0.53058 0.28125,-0.71875 l 2.28125,-2.25 L 45.28125,765.75 C 45.070508,765.55537 44.97809,765.28075 45,765 Z"
               id="path18"
               style="color:#bebebe;font-style:normal;font-variant:normal;font-weight:normal;font-stretch:normal;font-size:medium;line-height:normal;font-family:'Andale Mono';-inkscape-font-specification:'Andale Mono';text-indent:0;text-align:start;text-decoration:none;text-decoration-line:none;letter-spacing:normal;word-spacing:normal;text-transform:none;writing-mode:lr-tb;direction:ltr;text-anchor:start;display:inline;overflow:visible;visibility:visible;fill:#2e3436;fill-opacity:1;fill-rule:nonzero;stroke:none;stroke-width:1.78125;marker:none;enable-background:new" /></g></g></g></g><g
       id="g22"
       transform="matrix(3.7795276,0,0,3.7795276,6350.074,2658.3587)"><rect
         style="fill:#3584e4;fill-opacity:1;stroke:none;stroke-width:0.264583;stroke-linecap:round"
         id="rect21"
         width="38.66666"
         height="11.641666"
         x="-198.45624"
         y="-225.95416"
         rx="5.8208332"
         ry="5.8208332" /><flowRoot
         transform="matrix(0.26458333,0,0,0.26458333,-316.82875,-463.24275)"
         style="font-style:normal;font-weight:normal;font-size:40px;line-height:1.25;font-family:sans-serif;text-align:center;letter-spacing:0px;word-spacing:0px;text-anchor:middle;fill:#000000;fill-opacity:1;stroke:none"
         id="flowRoot22"
         xml:space="preserve"><flowRegion
           id="flowRegion22"
           style="text-align:center;text-anchor:middle;stroke:none"><rect
             y="888"
             x="157"
             height="104"
             width="727"
             id="rect22"
             style="stroke:none;stroke-width:1;text-anchor:middle;text-align:center" /></flowRegion><flowPara
           style="font-style:normal;font-variant:normal;font-weight:bold;font-stretch:normal;font-size:14.6667px;font-family:Cantarell;-inkscape-font-specification:Cantarell;text-align:center;text-anchor:middle;fill:#ffffff;stroke:none"
           id="flowPara22">Open in Files</flowPara></flowRoot></g><text
       xml:space="preserve"
       style="font-style:normal;font-variant:normal;font-weight:bold;font-stretch:normal;font-size:24px;line-height:0%;font-family:Cantarell;-inkscape-font-specification:'Cantarell Bold';text-align:start;letter-spacing:0px;word-spacing:0px;text-anchor:start;display:inline;fill:#343a3c;fill-opacity:1;stroke:none;stroke-width:1"
       x="5433.1094"
       y="1200.2498"
       id="text39"><tspan
         style="font-style:normal;font-variant:normal;font-weight:bold;font-stretch:normal;font-size:24px;line-height:1.25;font-family:Cantarell;-inkscape-font-specification:'Cantarell Bold';text-align:start;text-anchor:start;fill:#343a3c;fill-opacity:1;stroke-width:1"
         sodipodi:role="line"
         id="tspan39"
         x="5433.1094"
         y="1200.2498">Already mounted previously</tspan></text><text
       xml:space="preserve"
       style="font-style:normal;font-variant:normal;font-weight:normal;font-stretch:normal;font-size:14.6667px;line-height:0%;font-family:Cantarell;-inkscape-font-specification:Cantarell;text-align:center;letter-spacing:0px;word-spacing:0px;text-anchor:middle;display:inline;fill:#2e3436;fill-opacity:1;stroke:none;stroke-width:0.999999"
       x="5673.1123"
       y="1464.0869"
       id="text41"><tspan
         style="font-size:14.6667px;line-height:1.25;text-align:center;text-anchor:middle;opacity:1;stroke-width:0.999999"
         sodipodi:role="line"
         id="tspan41"
         x="5673.1123"
         y="1464.0869">Already mounted read-only</tspan></text><path
       d="m 4609.353,1424.0819 c -0.5781,0.01 -1.1679,0.2304 -1.6914,0.7539 l -9,9 c -0.375,0.375 -0.5859,0.8828 -0.5859,1.414 v 3 h 3 c 0.5312,0 1.0391,-0.2109 1.4141,-0.5859 l 9,-9 c 1.789,-1.7891 0.082,-4.3906 -1.8907,-4.5703 -0.082,-0.012 -0.164,-0.012 -0.2461,-0.012 z m -1.7773,3.6054 1.0625,1.0625 -7.0625,7.0625 -1.0625,-1.0625 z m 0,0"
       fill="#2e3436"
       id="path1" /><text
       xml:space="preserve"
       style="font-style:normal;font-variant:normal;font-weight:normal;font-stretch:normal;font-size:14.6667px;line-height:0%;font-family:Cantarell;-inkscape-font-specification:Cantarell;letter-spacing:0px;word-spacing:0px;display:inline;fill:#2e3436;fill-opacity:1;stroke:none;stroke-width:0.999999"
       x="5513.5112"
       y="1690.6299"
       id="text42"><tspan
         style="font-size:14.6667px;line-height:1.25;stroke-width:0.999999"
         sodipodi:role="line"
         id="tspan42"
         x="5513.5112"
         y="1690.6299">Write to Drive</tspan></text><text
       xml:space="preserve"
       style="font-style:normal;font-variant:normal;font-weight:normal;font-stretch:normal;font-size:14.6667px;line-height:0%;font-family:Cantarell;-inkscape-font-specification:Cantarell;text-align:start;letter-spacing:0px;word-spacing:0px;text-anchor:start;display:inline;fill:#2e3436;fill-opacity:1;stroke:none;stroke-width:0.999999"
       x="5513.5112"
       y="1636.2104"
       id="text43"><tspan
         style="font-size:14.6667px;line-height:1.25;text-align:start;text-anchor:start;stroke-width:0.999999"
         sodipodi:role="line"
         id="tspan43"
         x="5513.5112"
         y="1636.2104">Edit Contents in Files</tspan></text><path
       style="display:inline;fill:none;stroke:#ebebeb;stroke-width:0.999999px;stroke-linecap:butt;stroke-linejoin:miter;stroke-opacity:1"
       d="m 5872.5049,1665.9179 h -400"
       id="path43"
       inkscape:connector-curvature="0" /><path
       style="display:inline;fill:none;stroke:#ebebeb;stroke-width:0.999999px;stroke-linecap:butt;stroke-linejoin:miter;stroke-opacity:1"
       d="m 5872.5049,1610.8676 h -400"
       id="path44"
       inkscape:connector-curvature="0" /><text
       xml:space="preserve"
       style="font-style:normal;font-variant:normal;font-weight:normal;font-stretch:normal;font-size:12px;line-height:0%;font-family:Cantarell;-inkscape-font-specification:Cantarell;letter-spacing:0px;word-spacing:0px;display:inline;fill:#323232;fill-opacity:0.53496;stroke:none;stroke-width:0.999999"
       x="5513.5112"
       y="1706.6299"
       id="text44"><tspan
         style="font-size:12px;line-height:1.25;fill:#323232;fill-opacity:0.53496;stroke-width:0.999999"
         sodipodi:role="line"
         id="tspan44"
         x="5513.5112"
         y="1706.6299">Open in Disks to write the image to a drive</tspan></text><text
       xml:space="preserve"
       style="font-style:normal;font-variant:normal;font-weight:normal;font-stretch:normal;font-size:12px;line-height:0%;font-family:Cantarell;-inkscape-font-specification:Cantarell;text-align:start;letter-spacing:0px;word-spacing:0px;text-anchor:start;display:inline;fill:#323232;fill-opacity:0.53496;stroke:none;stroke-width:0.999999"
       x="5513.5112"
       y="1652.2104"
       id="text45"><tspan
         style="font-size:12px;line-height:1.25;text-align:start;text-anchor:start;fill:#323232;fill-opacity:0.53496;stroke-width:0.999999"
         sodipodi:role="line"
         id="tspan45"
         x="5513.5112"
         y="1652.2104">Mount the image and allow editing</tspan></text><circle
       style="fill:#ffffff;fill-opacity:1;stroke:#d0d0d0;stroke-width:0.999999;stroke-linecap:butt;stroke-miterlimit:4;stroke-dasharray:none;stroke-dashoffset:0;stroke-opacity:1"
       id="circle45"
       cx="5494.0601"
       cy="1637.8442"
       r="7.5000005" /><circle
       style="fill:#ffffff;fill-opacity:1;stroke:#d0d0d0;stroke-width:0.999999;stroke-linecap:butt;stroke-miterlimit:4;stroke-dasharray:none;stroke-dashoffset:0;stroke-opacity:1"
       id="circle46"
       cx="5494.0601"
       cy="1693.3687"
       r="7.5000005" /><path
       style="display:inline;fill:none;stroke:#ebebeb;stroke-width:0.999999px;stroke-linecap:butt;stroke-linejoin:miter;stroke-opacity:1"
       d="M 5841.9346,1720.8194 H 5503.0753"
       id="path46"
       inkscape:connector-curvature="0" /><rect
       inkscape:export-ydpi="90"
       inkscape:export-xdpi="90"
       style="display:inline;fill:#fafafa;fill-opacity:1;stroke:none;stroke-width:0;stroke-miterlimit:4;stroke-dasharray:none;stroke-opacity:1"
       id="rect1"
       width="480"
       height="585"
       x="6933.0757"
       y="1237.2499"
       rx="12"
       ry="12" /><text
       xml:space="preserve"
       transform="translate(6831.5791,4984.3597)"
       id="text2"
       style="font-style:normal;font-variant:normal;font-weight:normal;font-stretch:normal;font-size:24px;line-height:1.45;font-family:Cantarell;-inkscape-font-specification:Cantarell;white-space:pre;shape-inside:url(#rect133);display:inline;fill:#343a3c;fill-opacity:1;stroke:none"><tspan
         x="219.48438"
         y="-3552.0555"
         id="tspan18"><tspan
           style="font-weight:800;-inkscape-font-specification:'Cantarell Ultra-Bold'"
           id="tspan17">gnome-os-nightly.iso</tspan></tspan></text><rect
       inkscape:export-ydpi="90"
       inkscape:export-xdpi="90"
       style="display:inline;fill:#000000;fill-opacity:0.08;stroke:#000000;stroke-width:0;stroke-miterlimit:4;stroke-dasharray:none;stroke-opacity:1"
       id="rect3"
       width="402.00003"
       height="222.93927"
       x="6971.521"
       y="1500.3105"
       rx="12"
       ry="12" /><rect
       inkscape:export-ydpi="90"
       inkscape:export-xdpi="90"
       style="display:inline;fill:#fcfdff;fill-opacity:1;stroke:#ececec;stroke-width:0;stroke-miterlimit:4;stroke-dasharray:none;stroke-opacity:1"
       id="rect4"
       width="400"
       height="218.92982"
       x="6972.5093"
       y="1501.3201"
       rx="12"
       ry="11.999999" /><text
       xml:space="preserve"
       style="font-style:normal;font-variant:normal;font-weight:normal;font-stretch:normal;font-size:14.6667px;line-height:0%;font-family:Cantarell;-inkscape-font-specification:Cantarell;text-align:start;letter-spacing:0px;word-spacing:0px;text-anchor:start;display:inline;fill:#2e3436;fill-opacity:1;stroke:none;stroke-width:0.999999"
       x="7013.5112"
       y="1524.0869"
       id="text4"><tspan
         style="font-size:14.6667px;line-height:1.25;text-align:start;text-anchor:start;stroke-width:0.999999"
         sodipodi:role="line"
         id="tspan4"
         x="7013.5112"
         y="1524.0869">Open Disk Image in Files</tspan></text><path
       style="display:inline;fill:none;stroke:#ebebeb;stroke-width:0.999999px;stroke-linecap:butt;stroke-linejoin:miter;stroke-opacity:1"
       d="m 7372.5049,1665.8203 h -400"
       id="path4"
       inkscape:connector-curvature="0" /><text
       xml:space="preserve"
       style="font-style:normal;font-variant:normal;font-weight:normal;font-stretch:normal;font-size:14.6667px;line-height:0%;font-family:Cantarell;-inkscape-font-specification:Cantarell;text-align:start;letter-spacing:0px;word-spacing:0px;text-anchor:start;display:inline;fill:#2e3436;fill-opacity:1;stroke:none;stroke-width:0.999999"
       x="7013.5112"
       y="1581.2104"
       id="text6"><tspan
         style="font-size:14.6667px;line-height:1.25;text-align:start;text-anchor:start;stroke-width:0.999999"
         sodipodi:role="line"
         id="tspan6"
         x="7013.5112"
         y="1581.2104">Edit Disk Image Contents in Files</tspan></text><path
       style="display:inline;fill:none;stroke:#ebebeb;stroke-width:0.999999px;stroke-linecap:butt;stroke-linejoin:miter;stroke-opacity:1"
       d="m 7372.5049,1610.9179 h -400"
       id="path6"
       inkscape:connector-curvature="0" /><path
       style="display:inline;fill:none;stroke:#ebebeb;stroke-width:0.999999px;stroke-linecap:butt;stroke-linejoin:miter;stroke-opacity:1"
       d="m 7372.5049,1555.8676 h -400"
       id="path7"
       inkscape:connector-curvature="0" /><text
       xml:space="preserve"
       style="font-style:normal;font-variant:normal;font-weight:normal;font-stretch:normal;font-size:12px;line-height:0%;font-family:Cantarell;-inkscape-font-specification:Cantarell;text-align:start;letter-spacing:0px;word-spacing:0px;text-anchor:start;display:inline;fill:#323232;fill-opacity:0.53496;stroke:none;stroke-width:0.999999"
       x="7013.5112"
       y="1540.0869"
       id="text9"><tspan
         style="font-size:12px;line-height:1.25;text-align:start;text-anchor:start;fill:#323232;fill-opacity:0.53496;stroke-width:0.999999"
         sodipodi:role="line"
         id="tspan7"
         x="7013.5112"
         y="1540.0869">Attach the image read-only</tspan></text><text
       xml:space="preserve"
       style="font-style:normal;font-variant:normal;font-weight:normal;font-stretch:normal;font-size:12px;line-height:0%;font-family:Cantarell;-inkscape-font-specification:Cantarell;text-align:start;letter-spacing:0px;word-spacing:0px;text-anchor:start;display:inline;fill:#323232;fill-opacity:0.53496;stroke:none;stroke-width:0.999999"
       x="7013.5112"
       y="1597.2104"
       id="text111"><tspan
         style="font-size:12px;line-height:1.25;text-align:start;text-anchor:start;fill:#323232;fill-opacity:0.53496;stroke-width:0.999999"
         sodipodi:role="line"
         id="tspan111"
         x="7013.5112"
         y="1597.2104">Mount the image and allow editing</tspan></text><circle
       r="7.5000005"
       cy="1528.3135"
       cx="6994.0601"
       id="circle111"
       style="fill:#3584e4;fill-opacity:1;stroke:#2271d1;stroke-width:0.999999;stroke-linecap:butt;stroke-miterlimit:4;stroke-dasharray:none;stroke-dashoffset:0;stroke-opacity:1" /><circle
       style="fill:#ffffff;fill-opacity:1;stroke:none;stroke-width:0.999999;stroke-linecap:butt;stroke-miterlimit:4;stroke-dasharray:none;stroke-dashoffset:0;stroke-opacity:1"
       id="circle112"
       cx="6994.0601"
       cy="1528.3135"
       r="3.5" /><circle
       style="fill:#ffffff;fill-opacity:1;stroke:#d0d0d0;stroke-width:0.999999;stroke-linecap:butt;stroke-miterlimit:4;stroke-dasharray:none;stroke-dashoffset:0;stroke-opacity:1"
       id="circle113"
       cx="6994.0601"
       cy="1581.8442"
       r="7.5000005" /><path
       style="display:inline;fill:none;stroke:#ebebeb;stroke-width:0.999999px;stroke-linecap:butt;stroke-linejoin:miter;stroke-opacity:1"
       d="m 7372.5049,1665.8194 h -400"
       id="path113"
       inkscape:connector-curvature="0" /><path
       id="path114"
       style="opacity:0.5;fill:#343a3c;fill-opacity:1;stroke-width:7.99998"
       d="m 7173.0796,1283.3588 c -30.7504,0 -56.0001,25.2496 -56.0001,56 0,30.7499 25.2497,56 56.0001,56 30.7499,0 55.9999,-25.2501 55.9999,-56 0,-30.7504 -25.25,-56 -55.9999,-56 z m 0,31.9999 c 13.4373,0 24,10.5625 24,24.0001 0,13.4373 -10.5627,24 -24,24 -13.4376,0 -24.0002,-10.5627 -24.0002,-24 0,-13.4376 10.5626,-24.0001 24.0002,-24.0001 z m 0,7.9999 c -8.7812,0 -16.0003,7.219 -16.0003,16.0002 0,8.7812 7.2191,16.0001 16.0003,16.0001 8.7812,0 16.0001,-7.2189 16.0001,-16.0001 0,-8.7812 -7.2189,-16.0002 -16.0001,-16.0002 z m 0,8.0003 c 4.4686,0 7.9999,3.531 7.9999,7.9999 0,4.4686 -3.5313,7.9999 -7.9999,7.9999 -4.4689,0 -7.9999,-3.5313 -7.9999,-7.9999 0,-4.4689 3.531,-7.9999 7.9999,-7.9999 z" /><g
       id="g119"
       transform="matrix(3.7795276,0,0,3.7795276,7862.6299,1896.727)"><rect
         style="fill:#e1e1e1;fill-opacity:0;stroke:#3584e4;stroke-width:0;stroke-dasharray:none;stroke-opacity:1"
         id="rect114"
         width="8.9958324"
         height="8.9958324"
         x="-129.52809"
         y="-172.89906" /><g
         id="g118"
         transform="translate(-528.83347,-406.75068)"><circle
           style="display:inline;fill:#d8d8d8;fill-opacity:1;stroke:#3584e4;stroke-width:0;stroke-miterlimit:4;stroke-dasharray:none"
           id="circle114"
           cx="403.73734"
           cy="238.35095"
           r="2.9104161" /><g
           style="display:inline;fill:#2e3436;fill-opacity:1"
           transform="matrix(0.26458334,0,0,0.26458334,385.74658,99.1838)"
           id="g117"><g
             transform="translate(19,-242)"
             id="g116"
             style="display:inline;fill:#2e3436;fill-opacity:1"><path
               inkscape:connector-curvature="0"
               d="m 45,764 h 1 c 0.01037,-1.2e-4 0.02079,-4.6e-4 0.03125,0 0.254951,0.0112 0.50987,0.12858 0.6875,0.3125 L 49,766.59375 51.3125,764.3125 C 51.578125,764.082 51.759172,764.007 52,764 h 1 v 1 c 0,0.28647 -0.03434,0.55065 -0.25,0.75 l -2.28125,2.28125 2.25,2.25 C 52.906938,770.46942 52.999992,770.7347 53,771 v 1 h -1 c -0.265301,-10e-6 -0.530586,-0.0931 -0.71875,-0.28125 L 49,769.4375 46.71875,771.71875 C 46.530586,771.90694 46.26529,772 46,772 h -1 v -1 c -3e-6,-0.26529 0.09306,-0.53058 0.28125,-0.71875 l 2.28125,-2.25 L 45.28125,765.75 C 45.070508,765.55537 44.97809,765.28075 45,765 Z"
               id="path115"
               style="color:#bebebe;font-style:normal;font-variant:normal;font-weight:normal;font-stretch:normal;font-size:medium;line-height:normal;font-family:'Andale Mono';-inkscape-font-specification:'Andale Mono';text-indent:0;text-align:start;text-decoration:none;text-decoration-line:none;letter-spacing:normal;word-spacing:normal;text-transform:none;writing-mode:lr-tb;direction:ltr;text-anchor:start;display:inline;overflow:visible;visibility:visible;fill:#2e3436;fill-opacity:1;fill-rule:nonzero;stroke:none;stroke-width:1.78125;marker:none;enable-background:new" /></g></g></g></g><g
       id="g120"
       transform="matrix(3.7795276,0,0,3.7795276,7850.074,2604.3587)"><rect
         style="fill:#3584e4;fill-opacity:1;stroke:none;stroke-width:0.264583;stroke-linecap:round"
         id="rect119"
         width="38.66666"
         height="11.641666"
         x="-198.45624"
         y="-225.95416"
         rx="5.8208332"
         ry="5.8208332" /><flowRoot
         transform="matrix(0.26458333,0,0,0.26458333,-316.82875,-463.24275)"
         style="font-style:normal;font-weight:normal;font-size:40px;line-height:1.25;font-family:sans-serif;text-align:center;letter-spacing:0px;word-spacing:0px;text-anchor:middle;fill:#000000;fill-opacity:1;stroke:none"
         id="flowRoot120"
         xml:space="preserve"><flowRegion
           id="flowRegion120"
           style="text-align:center;text-anchor:middle;stroke:none"><rect
             y="888"
             x="157"
             height="104"
             width="727"
             id="rect120"
             style="stroke:none;stroke-width:1;text-anchor:middle;text-align:center" /></flowRegion><flowPara
           style="font-style:normal;font-variant:normal;font-weight:bold;font-stretch:normal;font-size:14.6667px;font-family:Cantarell;-inkscape-font-specification:Cantarell;text-align:center;text-anchor:middle;fill:#ffffff;stroke:none"
           id="flowPara120">Open in Files</flowPara></flowRoot></g><text
       xml:space="preserve"
       style="font-style:normal;font-variant:normal;font-weight:normal;font-stretch:normal;font-size:14.6667px;line-height:0%;font-family:Cantarell;-inkscape-font-specification:Cantarell;text-align:center;letter-spacing:0px;word-spacing:0px;text-anchor:middle;display:inline;fill:#2e3436;fill-opacity:1;stroke:none;stroke-width:0.999999"
       x="7173.1123"
       y="1464.0869"
       id="text123"><tspan
         style="font-size:14.6667px;line-height:1.25;text-align:center;text-anchor:middle;opacity:1;stroke-width:0.999999"
         sodipodi:role="line"
         id="tspan123"
         x="7173.1123"
         y="1464.0869">Already mounted read-only</tspan></text><g
       id="g132"
       transform="translate(2080,-620)"><text
         xml:space="preserve"
         style="font-style:normal;font-variant:normal;font-weight:normal;font-stretch:normal;font-size:14.6667px;line-height:0%;font-family:Cantarell;-inkscape-font-specification:Cantarell;letter-spacing:0px;word-spacing:0px;display:inline;fill:#2e3436;fill-opacity:1;stroke:none;stroke-width:0.999999"
         x="4933.5112"
         y="2310.6299"
         id="text124"><tspan
           style="font-size:14.6667px;line-height:1.25;stroke-width:0.999999"
           sodipodi:role="line"
           id="tspan124"
           x="4933.5112"
           y="2310.6299">Inspect in Disks</tspan></text><text
         xml:space="preserve"
         style="font-style:normal;font-variant:normal;font-weight:normal;font-stretch:normal;font-size:14.6667px;line-height:0%;font-family:Cantarell;-inkscape-font-specification:Cantarell;text-align:start;letter-spacing:0px;word-spacing:0px;text-anchor:start;display:inline;fill:#2e3436;fill-opacity:1;stroke:none;stroke-width:0.999999"
         x="4933.5112"
         y="2256.2104"
         id="text125"><tspan
           style="font-size:14.6667px;line-height:1.25;text-align:start;text-anchor:start;stroke-width:0.999999"
           sodipodi:role="line"
           id="tspan125"
           x="4933.5112"
           y="2256.2104">Write Disk Image to Drive</tspan></text><path
         style="display:inline;fill:none;stroke:#ebebeb;stroke-width:0.999999px;stroke-linecap:butt;stroke-linejoin:miter;stroke-opacity:1"
         d="m 5292.5049,2285.9179 h -400"
         id="path128"
         inkscape:connector-curvature="0" /><path
         style="display:inline;fill:none;stroke:#ebebeb;stroke-width:0.999999px;stroke-linecap:butt;stroke-linejoin:miter;stroke-opacity:1"
         d="m 5292.5049,2230.8676 h -400"
         id="path129"
         inkscape:connector-curvature="0" /><text
         xml:space="preserve"
         style="font-style:normal;font-variant:normal;font-weight:normal;font-stretch:normal;font-size:12px;line-height:0%;font-family:Cantarell;-inkscape-font-specification:Cantarell;letter-spacing:0px;word-spacing:0px;display:inline;fill:#323232;fill-opacity:0.53496;stroke:none;stroke-width:0.999999"
         x="4933.5112"
         y="2326.6299"
         id="text129"><tspan
           style="font-size:12px;line-height:1.25;fill:#323232;fill-opacity:0.53496;stroke-width:0.999999"
           sodipodi:role="line"
           id="tspan129"
           x="4933.5112"
           y="2326.6299">Mount image and open in Disks</tspan></text><text
         xml:space="preserve"
         style="font-style:normal;font-variant:normal;font-weight:normal;font-stretch:normal;font-size:12px;line-height:0%;font-family:Cantarell;-inkscape-font-specification:Cantarell;text-align:start;letter-spacing:0px;word-spacing:0px;text-anchor:start;display:inline;fill:#323232;fill-opacity:0.53496;stroke:none;stroke-width:0.999999"
         x="4933.5112"
         y="2272.2104"
         id="text130"><tspan
           style="font-size:12px;line-height:1.25;text-align:start;text-anchor:start;fill:#323232;fill-opacity:0.53496;stroke-width:0.999999"
           sodipodi:role="line"
           id="tspan130"
           x="4933.5112"
           y="2272.2104">Open in Disks to write the image to a drive</tspan></text><circle
         style="fill:#ffffff;fill-opacity:1;stroke:#d0d0d0;stroke-width:0.999999;stroke-linecap:butt;stroke-miterlimit:4;stroke-dasharray:none;stroke-dashoffset:0;stroke-opacity:1"
         id="circle130"
         cx="4914.0601"
         cy="2256.8442"
         r="7.5000005" /><circle
         style="fill:#ffffff;fill-opacity:1;stroke:#d0d0d0;stroke-width:0.999999;stroke-linecap:butt;stroke-miterlimit:4;stroke-dasharray:none;stroke-dashoffset:0;stroke-opacity:1"
         id="circle131"
         cx="4914.0601"
         cy="2313.3687"
         r="7.5000005" /><path
         style="display:inline;fill:none;stroke:#ebebeb;stroke-width:0.999999px;stroke-linecap:butt;stroke-linejoin:miter;stroke-opacity:1"
         d="M 5261.9346,2340.8194 H 4923.0753"
         id="path131"
         inkscape:connector-curvature="0" /></g><rect
       inkscape:export-ydpi="90"
       inkscape:export-xdpi="90"
       style="display:inline;fill:#fafafa;fill-opacity:1;stroke:none;stroke-width:0;stroke-miterlimit:4;stroke-dasharray:none;stroke-opacity:1"
       id="rect134"
       width="480"
       height="585"
       x="7483.0757"
       y="1237.2499"
       rx="12"
       ry="12" /><text
       xml:space="preserve"
       transform="translate(7381.5791,4984.3597)"
       id="text135"
       style="font-style:normal;font-variant:normal;font-weight:normal;font-stretch:normal;font-size:24px;line-height:1.45;font-family:Cantarell;-inkscape-font-specification:Cantarell;white-space:pre;shape-inside:url(#rect153);display:inline;fill:#343a3c;fill-opacity:1;stroke:none"><tspan
         x="219.48438"
         y="-3552.0555"
         id="tspan20"><tspan
           style="font-weight:800;-inkscape-font-specification:'Cantarell Ultra-Bold'"
           id="tspan19">gnome-os-nightly.iso</tspan></tspan></text><path
       id="path142"
       style="opacity:0.5;fill:#343a3c;fill-opacity:1;stroke-width:7.99998"
       d="m 7723.0796,1283.3588 c -30.7504,0 -56.0001,25.2496 -56.0001,56 0,30.7499 25.2497,56 56.0001,56 30.7499,0 55.9999,-25.2501 55.9999,-56 0,-30.7504 -25.25,-56 -55.9999,-56 z m 0,31.9999 c 13.4373,0 24,10.5625 24,24.0001 0,13.4373 -10.5627,24 -24,24 -13.4376,0 -24.0002,-10.5627 -24.0002,-24 0,-13.4376 10.5626,-24.0001 24.0002,-24.0001 z m 0,7.9999 c -8.7812,0 -16.0003,7.219 -16.0003,16.0002 0,8.7812 7.2191,16.0001 16.0003,16.0001 8.7812,0 16.0001,-7.2189 16.0001,-16.0001 0,-8.7812 -7.2189,-16.0002 -16.0001,-16.0002 z m 0,8.0003 c 4.4686,0 7.9999,3.531 7.9999,7.9999 0,4.4686 -3.5313,7.9999 -7.9999,7.9999 -4.4689,0 -7.9999,-3.5313 -7.9999,-7.9999 0,-4.4689 3.531,-7.9999 7.9999,-7.9999 z" /><rect
       style="fill:#e1e1e1;fill-opacity:0;stroke:#3584e4;stroke-width:0;stroke-dasharray:none;stroke-opacity:1"
       id="rect142"
       width="33.999996"
       height="33.999996"
       x="7923.0747"
       y="1243.2502" /><circle
       style="display:inline;fill:#d8d8d8;fill-opacity:1;stroke:#3584e4;stroke-width:0;stroke-miterlimit:4;stroke-dasharray:none"
       id="circle142"
       cx="7939.8257"
       cy="1260.2556"
       r="10.999998" /><g
       style="display:inline;fill:#2e3436;fill-opacity:1"
       transform="translate(7871.829,734.26949)"
       id="g144"><g
         transform="translate(19,-242)"
         id="g143"
         style="display:inline;fill:#2e3436;fill-opacity:1"><path
           inkscape:connector-curvature="0"
           d="m 45,764 h 1 c 0.01037,-1.2e-4 0.02079,-4.6e-4 0.03125,0 0.254951,0.0112 0.50987,0.12858 0.6875,0.3125 L 49,766.59375 51.3125,764.3125 C 51.578125,764.082 51.759172,764.007 52,764 h 1 v 1 c 0,0.28647 -0.03434,0.55065 -0.25,0.75 l -2.28125,2.28125 2.25,2.25 C 52.906938,770.46942 52.999992,770.7347 53,771 v 1 h -1 c -0.265301,-10e-6 -0.530586,-0.0931 -0.71875,-0.28125 L 49,769.4375 46.71875,771.71875 C 46.530586,771.90694 46.26529,772 46,772 h -1 v -1 c -3e-6,-0.26529 0.09306,-0.53058 0.28125,-0.71875 l 2.28125,-2.25 L 45.28125,765.75 C 45.070508,765.55537 44.97809,765.28075 45,765 Z"
           id="path143"
           style="color:#bebebe;font-style:normal;font-variant:normal;font-weight:normal;font-stretch:normal;font-size:medium;line-height:normal;font-family:'Andale Mono';-inkscape-font-specification:'Andale Mono';text-indent:0;text-align:start;text-decoration:none;text-decoration-line:none;letter-spacing:normal;word-spacing:normal;text-transform:none;writing-mode:lr-tb;direction:ltr;text-anchor:start;display:inline;overflow:visible;visibility:visible;fill:#2e3436;fill-opacity:1;fill-rule:nonzero;stroke:none;stroke-width:1.78125;marker:none;enable-background:new" /></g></g><rect
       style="fill:#3584e4;fill-opacity:1;stroke:none;stroke-width:1.10782;stroke-linecap:round"
       id="rect154"
       width="299.99899"
       height="54"
       x="7573.0762"
       y="1500.3105"
       rx="12.000001"
       ry="12" /><text
       xml:space="preserve"
       style="font-style:normal;font-variant:normal;font-weight:normal;font-stretch:normal;font-size:14.6667px;line-height:0%;font-family:Cantarell;-inkscape-font-specification:Cantarell;text-align:center;letter-spacing:0px;word-spacing:0px;text-anchor:middle;display:inline;fill:#2e3436;fill-opacity:1;stroke:none;stroke-width:0.999999"
       x="7723.1123"
       y="1464.0869"
       id="text147"><tspan
         style="font-size:14.6667px;line-height:1.25;text-align:center;text-anchor:middle;opacity:1;stroke-width:0.999999"
         sodipodi:role="line"
         id="tspan147"
         x="7723.1123"
         y="1464.0869">Already mounted read-only</tspan></text><text
       xml:space="preserve"
       style="font-style:normal;font-variant:normal;font-weight:normal;font-stretch:normal;font-size:14.6667px;line-height:0%;font-family:Cantarell;-inkscape-font-specification:Cantarell;text-align:center;letter-spacing:0px;word-spacing:0px;text-anchor:middle;display:inline;fill:#ffffff;fill-opacity:1;stroke:none;stroke-width:0.999999"
       x="7722.9951"
       y="1524.0869"
       id="text136"><tspan
         style="font-weight:bold;font-size:14.6667px;line-height:1.25;text-align:center;text-anchor:middle;fill:#ffffff;stroke-width:0.999999"
         sodipodi:role="line"
         id="tspan136"
         x="7722.9951"
         y="1524.0869">Open in Files</tspan></text><rect
       style="fill:#deddda;fill-opacity:1;stroke:none;stroke-width:1.10782;stroke-linecap:round"
       id="rect155"
       width="299.99899"
       height="54"
       x="7573.0762"
       y="1566.2499"
       rx="12.000001"
       ry="12" /><text
       xml:space="preserve"
       style="font-style:normal;font-variant:normal;font-weight:normal;font-stretch:normal;font-size:14.6667px;line-height:0%;font-family:Cantarell;-inkscape-font-specification:Cantarell;text-align:center;letter-spacing:0px;word-spacing:0px;text-anchor:middle;display:inline;fill:#2e3436;fill-opacity:1;stroke:none;stroke-width:0.999999"
       x="7722.7163"
       y="1591.1498"
       id="text137"><tspan
         style="font-weight:bold;font-size:14.6667px;line-height:1.25;text-align:center;text-anchor:middle;stroke-width:0.999999"
         sodipodi:role="line"
         id="tspan137"
         x="7722.7163"
         y="1591.1498">Edit Contents in Files</tspan></text><text
       xml:space="preserve"
       style="font-style:normal;font-variant:normal;font-weight:normal;font-stretch:normal;font-size:12px;line-height:0%;font-family:Cantarell;-inkscape-font-specification:Cantarell;text-align:center;letter-spacing:0px;word-spacing:0px;text-anchor:middle;display:inline;fill:#ffffff;fill-opacity:0.53496;stroke:none;stroke-width:0.999999"
       x="7723.1055"
       y="1540.0869"
       id="text138"><tspan
         style="font-size:12px;line-height:1.25;text-align:center;text-anchor:middle;fill:#ffffff;fill-opacity:0.53496;stroke-width:0.999999"
         sodipodi:role="line"
         id="tspan138"
         x="7723.1055"
         y="1540.0869">Attach the image read-only</tspan></text><text
       xml:space="preserve"
       style="font-style:normal;font-variant:normal;font-weight:normal;font-stretch:normal;font-size:12px;line-height:0%;font-family:Cantarell;-inkscape-font-specification:Cantarell;text-align:center;letter-spacing:0px;word-spacing:0px;text-anchor:middle;display:inline;fill:#323232;fill-opacity:0.53496;stroke:none;stroke-width:0.999999"
       x="7723.0215"
       y="1607.1498"
       id="text139"><tspan
         style="font-size:12px;line-height:1.25;text-align:center;text-anchor:middle;fill:#323232;fill-opacity:0.53496;stroke-width:0.999999"
         sodipodi:role="line"
         id="tspan139"
         x="7723.0215"
         y="1607.1498">Mount the image and allow editing</tspan></text><rect
       style="fill:#deddda;fill-opacity:1;stroke:none;stroke-width:1.10782;stroke-linecap:round"
       id="rect157"
       width="299.99899"
       height="54"
       x="7573.0762"
       y="1698.2499"
       rx="12.000001"
       ry="12" /><text
       xml:space="preserve"
       style="font-style:normal;font-variant:normal;font-weight:bold;font-stretch:normal;font-size:14.6667px;line-height:0%;font-family:Cantarell;-inkscape-font-specification:'Cantarell Bold';text-align:center;letter-spacing:0px;word-spacing:0px;text-anchor:middle;display:inline;fill:#2e3436;fill-opacity:1;stroke:none;stroke-width:0.999999"
       x="7722.7163"
       y="1721.5692"
       id="text148"><tspan
         style="font-style:normal;font-variant:normal;font-weight:bold;font-stretch:normal;font-size:14.6667px;line-height:1.25;font-family:Cantarell;-inkscape-font-specification:'Cantarell Bold';text-align:center;text-anchor:middle;stroke-width:0.999999"
         sodipodi:role="line"
         id="tspan148"
         x="7722.7163"
         y="1721.5692">Inspect in Disks</tspan></text><text
       xml:space="preserve"
       style="font-style:normal;font-variant:normal;font-weight:normal;font-stretch:normal;font-size:12px;line-height:0%;font-family:Cantarell;-inkscape-font-specification:Cantarell;text-align:center;letter-spacing:0px;word-spacing:0px;text-anchor:middle;display:inline;fill:#323232;fill-opacity:0.53496;stroke:none;stroke-width:0.999999"
       x="7722.7817"
       y="1737.5692"
       id="text150"><tspan
         style="font-size:12px;line-height:1.25;text-align:center;text-anchor:middle;fill:#323232;fill-opacity:0.53496;stroke-width:0.999999"
         sodipodi:role="line"
         id="tspan150"
         x="7722.7817"
         y="1737.5692">Mount image and open in Disks</tspan></text><rect
       style="fill:#deddda;fill-opacity:1;stroke:none;stroke-width:1.10782;stroke-linecap:round"
       id="rect156"
       width="299.99899"
       height="54"
       x="7573.0762"
       y="1632.2499"
       rx="12.000001"
       ry="12" /><text
       xml:space="preserve"
       style="font-style:normal;font-variant:normal;font-weight:bold;font-stretch:normal;font-size:14.6667px;line-height:0%;font-family:Cantarell;-inkscape-font-specification:'Cantarell Bold';text-align:center;letter-spacing:0px;word-spacing:0px;text-anchor:middle;display:inline;fill:#2e3436;fill-opacity:1;stroke:none;stroke-width:0.999999"
       x="7723.3691"
       y="1657.1498"
       id="text149"><tspan
         style="font-style:normal;font-variant:normal;font-weight:bold;font-stretch:normal;font-size:14.6667px;line-height:1.25;font-family:Cantarell;-inkscape-font-specification:'Cantarell Bold';text-align:center;text-anchor:middle;stroke-width:0.999999"
         sodipodi:role="line"
         id="tspan149"
         x="7723.3691"
         y="1657.1498">Write to Drive</tspan></text><text
       xml:space="preserve"
       style="font-style:normal;font-variant:normal;font-weight:normal;font-stretch:normal;font-size:12px;line-height:0%;font-family:Cantarell;-inkscape-font-specification:Cantarell;text-align:center;letter-spacing:0px;word-spacing:0px;text-anchor:middle;display:inline;fill:#323232;fill-opacity:0.53496;stroke:none;stroke-width:0.999999"
       x="7723.0635"
       y="1673.1498"
       id="text151"><tspan
         style="font-size:12px;line-height:1.25;text-align:center;text-anchor:middle;fill:#323232;fill-opacity:0.53496;stroke-width:0.999999"
         sodipodi:role="line"
         id="tspan151"
         x="7723.0635"
         y="1673.1498">Open in Disks to write the image to a drive</tspan></text><g
       id="g170"
       transform="translate(850)"><rect
         inkscape:export-ydpi="90"
         inkscape:export-xdpi="90"
         style="display:inline;fill:#fafafa;fill-opacity:1;stroke:none;stroke-width:0;stroke-miterlimit:4;stroke-dasharray:none;stroke-opacity:1"
         id="rect158"
         width="480"
         height="585"
         x="7243.0757"
         y="1237.2499"
         rx="12"
         ry="12" /><text
         xml:space="preserve"
         transform="translate(7141.5791,4984.3597)"
         id="text159"
         style="font-style:normal;font-variant:normal;font-weight:normal;font-stretch:normal;font-size:24px;line-height:1.45;font-family:Cantarell;-inkscape-font-specification:Cantarell;white-space:pre;shape-inside:url(#rect169);display:inline;fill:#343a3c;fill-opacity:1;stroke:none"><tspan
           x="219.48438"
           y="-3552.0555"
           id="tspan22"><tspan
             style="font-weight:800;-inkscape-font-specification:'Cantarell Ultra-Bold'"
             id="tspan21">gnome-os-nightly.iso</tspan></tspan></text><path
         id="path159"
         style="opacity:0.5;fill:#343a3c;fill-opacity:1;stroke-width:7.99998"
         d="m 7483.0796,1283.3588 c -30.7504,0 -56.0001,25.2496 -56.0001,56 0,30.7499 25.2497,56 56.0001,56 30.7499,0 55.9999,-25.2501 55.9999,-56 0,-30.7504 -25.25,-56 -55.9999,-56 z m 0,31.9999 c 13.4373,0 24,10.5625 24,24.0001 0,13.4373 -10.5627,24 -24,24 -13.4376,0 -24.0002,-10.5627 -24.0002,-24 0,-13.4376 10.5626,-24.0001 24.0002,-24.0001 z m 0,7.9999 c -8.7812,0 -16.0003,7.219 -16.0003,16.0002 0,8.7812 7.2191,16.0001 16.0003,16.0001 8.7812,0 16.0001,-7.2189 16.0001,-16.0001 0,-8.7812 -7.2189,-16.0002 -16.0001,-16.0002 z m 0,8.0003 c 4.4686,0 7.9999,3.531 7.9999,7.9999 0,4.4686 -3.5313,7.9999 -7.9999,7.9999 -4.4689,0 -7.9999,-3.5313 -7.9999,-7.9999 0,-4.4689 3.531,-7.9999 7.9999,-7.9999 z" /><rect
         style="fill:#e1e1e1;fill-opacity:0;stroke:#3584e4;stroke-width:0;stroke-dasharray:none;stroke-opacity:1"
         id="rect159"
         width="33.999996"
         height="33.999996"
         x="7683.0747"
         y="1243.2502" /><circle
         style="display:inline;fill:#d8d8d8;fill-opacity:1;stroke:#3584e4;stroke-width:0;stroke-miterlimit:4;stroke-dasharray:none"
         id="circle159"
         cx="7699.8257"
         cy="1260.2556"
         r="10.999998" /><g
         style="display:inline;fill:#2e3436;fill-opacity:1"
         transform="translate(7631.829,734.26949)"
         id="g161"><g
           transform="translate(19,-242)"
           id="g160"
           style="display:inline;fill:#2e3436;fill-opacity:1"><path
             inkscape:connector-curvature="0"
             d="m 45,764 h 1 c 0.01037,-1.2e-4 0.02079,-4.6e-4 0.03125,0 0.254951,0.0112 0.50987,0.12858 0.6875,0.3125 L 49,766.59375 51.3125,764.3125 C 51.578125,764.082 51.759172,764.007 52,764 h 1 v 1 c 0,0.28647 -0.03434,0.55065 -0.25,0.75 l -2.28125,2.28125 2.25,2.25 C 52.906938,770.46942 52.999992,770.7347 53,771 v 1 h -1 c -0.265301,-10e-6 -0.530586,-0.0931 -0.71875,-0.28125 L 49,769.4375 46.71875,771.71875 C 46.530586,771.90694 46.26529,772 46,772 h -1 v -1 c -3e-6,-0.26529 0.09306,-0.53058 0.28125,-0.71875 l 2.28125,-2.25 L 45.28125,765.75 C 45.070508,765.55537 44.97809,765.28075 45,765 Z"
             id="path160"
             style="color:#bebebe;font-style:normal;font-variant:normal;font-weight:normal;font-stretch:normal;font-size:medium;line-height:normal;font-family:'Andale Mono';-inkscape-font-specification:'Andale Mono';text-indent:0;text-align:start;text-decoration:none;text-decoration-line:none;letter-spacing:normal;word-spacing:normal;text-transform:none;writing-mode:lr-tb;direction:ltr;text-anchor:start;display:inline;overflow:visible;visibility:visible;fill:#2e3436;fill-opacity:1;fill-rule:nonzero;stroke:none;stroke-width:1.78125;marker:none;enable-background:new" /></g></g><rect
         style="fill:#deddda;fill-opacity:1;stroke:none;stroke-width:1.10782;stroke-linecap:round"
         id="rect161"
         width="299.99899"
         height="54"
         x="7333.0762"
         y="1500.3105"
         rx="12.000001"
         ry="12" /><text
         xml:space="preserve"
         style="font-style:normal;font-variant:normal;font-weight:normal;font-stretch:normal;font-size:14.6667px;line-height:0%;font-family:Cantarell;-inkscape-font-specification:Cantarell;text-align:center;letter-spacing:0px;word-spacing:0px;text-anchor:middle;display:inline;fill:#2e3436;fill-opacity:1;stroke:none;stroke-width:0.999999"
         x="7483.1123"
         y="1464.0869"
         id="text161"><tspan
           style="font-size:14.6667px;line-height:1.25;text-align:center;text-anchor:middle;opacity:1;stroke-width:0.999999"
           sodipodi:role="line"
           id="tspan161"
           x="7483.1123"
           y="1464.0869">Already mounted read-only</tspan></text><text
         xml:space="preserve"
         style="font-style:normal;font-variant:normal;font-weight:normal;font-stretch:normal;font-size:14.6667px;line-height:0%;font-family:Cantarell;-inkscape-font-specification:Cantarell;text-align:center;letter-spacing:0px;word-spacing:0px;text-anchor:middle;display:inline;fill:#2e3436;fill-opacity:1;stroke:none;stroke-width:0.999999"
         x="7482.9951"
         y="1524.0869"
         id="text162"><tspan
           style="font-weight:bold;font-size:14.6667px;line-height:1.25;text-align:center;text-anchor:middle;stroke-width:0.999999"
           sodipodi:role="line"
           id="tspan162"
           x="7482.9951"
           y="1524.0869">Open Disk Image in Files</tspan></text><rect
         style="fill:#deddda;fill-opacity:1;stroke:none;stroke-width:1.10782;stroke-linecap:round"
         id="rect162"
         width="299.99899"
         height="54"
         x="7333.0762"
         y="1566.2499"
         rx="12.000001"
         ry="12" /><text
         xml:space="preserve"
         style="font-style:normal;font-variant:normal;font-weight:normal;font-stretch:normal;font-size:14.6667px;line-height:0%;font-family:Cantarell;-inkscape-font-specification:Cantarell;text-align:center;letter-spacing:0px;word-spacing:0px;text-anchor:middle;display:inline;fill:#2e3436;fill-opacity:1;stroke:none;stroke-width:0.999999"
         x="7482.7163"
         y="1591.1498"
         id="text163"><tspan
           style="font-weight:bold;font-size:14.6667px;line-height:1.25;text-align:center;text-anchor:middle;stroke-width:0.999999"
           sodipodi:role="line"
           id="tspan163"
           x="7482.7163"
           y="1591.1498">Edit Disk Image Contents in Files</tspan></text><text
         xml:space="preserve"
         style="font-style:normal;font-variant:normal;font-weight:normal;font-stretch:normal;font-size:12px;line-height:0%;font-family:Cantarell;-inkscape-font-specification:Cantarell;text-align:center;letter-spacing:0px;word-spacing:0px;text-anchor:middle;display:inline;fill:#323232;fill-opacity:0.53496;stroke:none;stroke-width:0.999999"
         x="7483.1055"
         y="1540.0869"
         id="text164"><tspan
           style="font-size:12px;line-height:1.25;text-align:center;text-anchor:middle;fill:#323232;fill-opacity:0.53496;stroke-width:0.999999"
           sodipodi:role="line"
           id="tspan164"
           x="7483.1055"
           y="1540.0869">Attach the image read-only</tspan></text><text
         xml:space="preserve"
         style="font-style:normal;font-variant:normal;font-weight:normal;font-stretch:normal;font-size:12px;line-height:0%;font-family:Cantarell;-inkscape-font-specification:Cantarell;text-align:center;letter-spacing:0px;word-spacing:0px;text-anchor:middle;display:inline;fill:#323232;fill-opacity:0.53496;stroke:none;stroke-width:0.999999"
         x="7483.0215"
         y="1607.1498"
         id="text165"><tspan
           style="font-size:12px;line-height:1.25;text-align:center;text-anchor:middle;fill:#323232;fill-opacity:0.53496;stroke-width:0.999999"
           sodipodi:role="line"
           id="tspan165"
           x="7483.0215"
           y="1607.1498">Mount the image and allow editing</tspan></text><g
         id="g167"
         transform="translate(610,-9.060669)"><rect
           style="fill:#deddda;fill-opacity:1;stroke:none;stroke-width:1.10782;stroke-linecap:round"
           id="rect165"
           width="299.99899"
           height="54"
           x="6723.0762"
           y="1707.3105"
           rx="12.000001"
           ry="12" /><text
           xml:space="preserve"
           style="font-style:normal;font-variant:normal;font-weight:bold;font-stretch:normal;font-size:14.6667px;line-height:0%;font-family:Cantarell;-inkscape-font-specification:'Cantarell Bold';text-align:center;letter-spacing:0px;word-spacing:0px;text-anchor:middle;display:inline;fill:#2e3436;fill-opacity:1;stroke:none;stroke-width:0.999999"
           x="6872.7163"
           y="1730.6299"
           id="text166"><tspan
             style="font-style:normal;font-variant:normal;font-weight:bold;font-stretch:normal;font-size:14.6667px;line-height:1.25;font-family:Cantarell;-inkscape-font-specification:'Cantarell Bold';text-align:center;text-anchor:middle;stroke-width:0.999999"
             sodipodi:role="line"
             id="tspan166"
             x="6872.7163"
             y="1730.6299">Inspect in Disks</tspan></text><text
           xml:space="preserve"
           style="font-style:normal;font-variant:normal;font-weight:normal;font-stretch:normal;font-size:12px;line-height:0%;font-family:Cantarell;-inkscape-font-specification:Cantarell;text-align:center;letter-spacing:0px;word-spacing:0px;text-anchor:middle;display:inline;fill:#323232;fill-opacity:0.53496;stroke:none;stroke-width:0.999999"
           x="6872.7817"
           y="1746.6299"
           id="text167"><tspan
             style="font-size:12px;line-height:1.25;text-align:center;text-anchor:middle;fill:#323232;fill-opacity:0.53496;stroke-width:0.999999"
             sodipodi:role="line"
             id="tspan167"
             x="6872.7817"
             y="1746.6299">Mount image and open in Disks</tspan></text></g><g
         id="g169"
         transform="translate(610,-7)"><rect
           style="fill:#deddda;fill-opacity:1;stroke:none;stroke-width:1.10782;stroke-linecap:round"
           id="rect167"
           width="299.99899"
           height="54"
           x="6723.0762"
           y="1639.2499"
           rx="12.000001"
           ry="12" /><text
           xml:space="preserve"
           style="font-style:normal;font-variant:normal;font-weight:bold;font-stretch:normal;font-size:14.6667px;line-height:0%;font-family:Cantarell;-inkscape-font-specification:'Cantarell Bold';text-align:center;letter-spacing:0px;word-spacing:0px;text-anchor:middle;display:inline;fill:#2e3436;fill-opacity:1;stroke:none;stroke-width:0.999999"
           x="6873.3691"
           y="1664.1498"
           id="text168"><tspan
             style="font-style:normal;font-variant:normal;font-weight:bold;font-stretch:normal;font-size:14.6667px;line-height:1.25;font-family:Cantarell;-inkscape-font-specification:'Cantarell Bold';text-align:center;text-anchor:middle;stroke-width:0.999999"
             sodipodi:role="line"
             id="tspan168"
             x="6873.3691"
             y="1664.1498">Write Disk Image to Drive</tspan></text><text
           xml:space="preserve"
           style="font-style:normal;font-variant:normal;font-weight:normal;font-stretch:normal;font-size:12px;line-height:0%;font-family:Cantarell;-inkscape-font-specification:Cantarell;text-align:center;letter-spacing:0px;word-spacing:0px;text-anchor:middle;display:inline;fill:#323232;fill-opacity:0.53496;stroke:none;stroke-width:0.999999"
           x="6873.0635"
           y="1680.1498"
           id="text169"><tspan
             style="font-size:12px;line-height:1.25;text-align:center;text-anchor:middle;fill:#323232;fill-opacity:0.53496;stroke-width:0.999999"
             sodipodi:role="line"
             id="tspan169"
             x="6873.0635"
             y="1680.1498">Open in Disks to write the image to a drive</tspan></text></g></g><g
       id="g178"
       transform="translate(0,-5)"><path
         style="display:inline;fill:none;stroke:#ebebeb;stroke-width:0.999999px;stroke-linecap:butt;stroke-linejoin:miter;stroke-opacity:1"
         d="m 5872.5049,1725.8203 h -400"
         id="path172"
         inkscape:connector-curvature="0" /><path
         style="display:inline;fill:none;stroke:#ebebeb;stroke-width:0.999999px;stroke-linecap:butt;stroke-linejoin:miter;stroke-opacity:1"
         d="m 5872.5049,1670.9179 h -400"
         id="path173"
         inkscape:connector-curvature="0" /><path
         style="display:inline;fill:none;stroke:#ebebeb;stroke-width:0.999999px;stroke-linecap:butt;stroke-linejoin:miter;stroke-opacity:1"
         d="m 5872.5049,1725.8194 h -400"
         id="path174"
         inkscape:connector-curvature="0" /><text
         xml:space="preserve"
         style="font-style:normal;font-variant:normal;font-weight:normal;font-stretch:normal;font-size:14.6667px;line-height:0%;font-family:Cantarell;-inkscape-font-specification:Cantarell;letter-spacing:0px;word-spacing:0px;display:inline;fill:#2e3436;fill-opacity:1;stroke:none;stroke-width:0.999999"
         x="5513.5112"
         y="1750.6299"
         id="text174"><tspan
           style="font-size:14.6667px;line-height:1.25;stroke-width:0.999999"
           sodipodi:role="line"
           id="tspan174"
           x="5513.5112"
           y="1750.6299">Inspect in Disks</tspan></text><path
         style="display:inline;fill:none;stroke:#ebebeb;stroke-width:0.999999px;stroke-linecap:butt;stroke-linejoin:miter;stroke-opacity:1"
         d="m 5872.5049,1725.9179 h -400"
         id="path175"
         inkscape:connector-curvature="0" /><path
         style="display:inline;fill:none;stroke:#ebebeb;stroke-width:0.999999px;stroke-linecap:butt;stroke-linejoin:miter;stroke-opacity:1"
         d="m 5872.5049,1670.8676 h -400"
         id="path176"
         inkscape:connector-curvature="0" /><text
         xml:space="preserve"
         style="font-style:normal;font-variant:normal;font-weight:normal;font-stretch:normal;font-size:12px;line-height:0%;font-family:Cantarell;-inkscape-font-specification:Cantarell;letter-spacing:0px;word-spacing:0px;display:inline;fill:#323232;fill-opacity:0.53496;stroke:none;stroke-width:0.999999"
         x="5513.5112"
         y="1766.6299"
         id="text176"><tspan
           style="font-size:12px;line-height:1.25;fill:#323232;fill-opacity:0.53496;stroke-width:0.999999"
           sodipodi:role="line"
           id="tspan176"
           x="5513.5112"
           y="1766.6299">Attach image and open in Disks</tspan></text><circle
         style="fill:#ffffff;fill-opacity:1;stroke:#d0d0d0;stroke-width:0.999999;stroke-linecap:butt;stroke-miterlimit:4;stroke-dasharray:none;stroke-dashoffset:0;stroke-opacity:1"
         id="circle178"
         cx="5494.0601"
         cy="1753.3687"
         r="7.5000005" /><path
         style="display:inline;fill:none;stroke:#ebebeb;stroke-width:0.999999px;stroke-linecap:butt;stroke-linejoin:miter;stroke-opacity:1"
         d="M 5841.9346,1780.8194 H 5503.0753"
         id="path178"
         inkscape:connector-curvature="0" /></g></g></svg>
