<?xml version="1.0" encoding="UTF-8" standalone="no"?>
<svg
   sodipodi:docname="conversions.svg"
   inkscape:version="1.1-rc (52f87abb86, 2021-05-02)"
   version="1.1"
   id="svg6328"
   viewBox="0 0 670 890"
   height="890"
   width="670"
   inkscape:export-filename="/home/tobias/Design/app-mockups/text-editor/preferences.png"
   inkscape:export-xdpi="96"
   inkscape:export-ydpi="96"
   xmlns:inkscape="http://www.inkscape.org/namespaces/inkscape"
   xmlns:sodipodi="http://sodipodi.sourceforge.net/DTD/sodipodi-0.dtd"
   xmlns="http://www.w3.org/2000/svg"
   xmlns:svg="http://www.w3.org/2000/svg"
   xmlns:rdf="http://www.w3.org/1999/02/22-rdf-syntax-ns#"
   xmlns:cc="http://creativecommons.org/ns#"
   xmlns:dc="http://purl.org/dc/elements/1.1/">
  <defs
     id="defs6330">
    <inkscape:path-effect
       effect="fillet_chamfer"
       id="path-effect19447"
       is_visible="true"
       lpeversion="1"
       satellites_param="F,0,0,1,0,12,0,1 @ F,0,0,1,0,12,0,1 @ F,0,0,1,0,0,0,1 @ F,0,0,1,0,0,0,1"
       unit="px"
       method="auto"
       mode="F"
       radius="12"
       chamfer_steps="1"
       flexible="false"
       use_knot_distance="true"
       apply_no_radius="true"
       apply_with_radius="true"
       only_selected="false"
       hide_knots="false" />
    <inkscape:path-effect
       effect="fillet_chamfer"
       id="path-effect19441"
       is_visible="true"
       lpeversion="1"
       satellites_param="F,0,0,1,0,0,0,1 @ F,0,0,1,0,0,0,1 @ F,0,0,1,0,12,0,1 @ F,0,0,1,0,12,0,1"
       unit="px"
       method="auto"
       mode="F"
       radius="12"
       chamfer_steps="1"
       flexible="false"
       use_knot_distance="true"
       apply_no_radius="true"
       apply_with_radius="true"
       only_selected="false"
       hide_knots="false" />
    <rect
       x="131.94356"
       y="502.43375"
       width="111.41093"
       height="45.264717"
       id="rect6876" />
    <inkscape:path-effect
       effect="fillet_chamfer"
       id="path-effect11859"
       is_visible="true"
       lpeversion="1"
       satellites_param="F,0,0,1,0,0,0,1 @ F,0,0,1,0,0,0,1 @ F,0,0,1,0,12,0,1 @ F,0,0,1,0,12,0,1"
       unit="px"
       method="auto"
       mode="F"
       radius="12"
       chamfer_steps="1"
       flexible="false"
       use_knot_distance="true"
       apply_no_radius="true"
       apply_with_radius="true"
       only_selected="false"
       hide_knots="false" />
    <inkscape:path-effect
       effect="fillet_chamfer"
       id="path-effect11855"
       is_visible="true"
       lpeversion="1"
       satellites_param="F,0,0,1,0,12,0,1 @ F,0,0,1,0,12,0,1 @ F,0,0,1,0,0,0,1 @ F,0,0,1,0,0,0,1"
       unit="px"
       method="auto"
       mode="F"
       radius="12"
       chamfer_steps="1"
       flexible="false"
       use_knot_distance="true"
       apply_no_radius="true"
       apply_with_radius="true"
       only_selected="false"
       hide_knots="false" />
    <inkscape:path-effect
       effect="fillet_chamfer"
       id="path-effect11757"
       is_visible="true"
       lpeversion="1"
       satellites_param="F,0,0,1,0,0,0,1 @ F,0,0,1,0,0,0,1 @ F,0,0,1,0,12,0,1 @ F,0,0,1,0,12,0,1"
       unit="px"
       method="auto"
       mode="F"
       radius="12"
       chamfer_steps="1"
       flexible="false"
       use_knot_distance="true"
       apply_no_radius="true"
       apply_with_radius="true"
       only_selected="false"
       hide_knots="false" />
    <inkscape:path-effect
       effect="fillet_chamfer"
       id="path-effect11719"
       is_visible="true"
       lpeversion="1"
       satellites_param="F,0,0,1,0,12,0,1 @ F,0,0,1,0,12,0,1 @ F,0,0,1,0,0,0,1 @ F,0,0,1,0,0,0,1"
       unit="px"
       method="auto"
       mode="F"
       radius="12"
       chamfer_steps="1"
       flexible="false"
       use_knot_distance="true"
       apply_no_radius="true"
       apply_with_radius="true"
       only_selected="false"
       hide_knots="false" />
    <inkscape:path-effect
       effect="fillet_chamfer"
       id="path-effect4147"
       is_visible="true"
       lpeversion="1"
       satellites_param="F,0,0,1,0,0,0,1 @ F,0,0,1,0,0,0,1 @ F,0,0,1,0,12,0,1 @ F,0,0,1,0,12,0,1"
       unit="px"
       method="auto"
       mode="F"
       radius="12"
       chamfer_steps="1"
       flexible="false"
       use_knot_distance="true"
       apply_no_radius="true"
       apply_with_radius="true"
       only_selected="false"
       hide_knots="false" />
    <inkscape:path-effect
       effect="fillet_chamfer"
       id="path-effect7939"
       is_visible="true"
       lpeversion="1"
       satellites_param="F,0,0,1,0,12,0,1 @ F,0,0,1,0,12,0,1 @ F,0,0,1,0,0,0,1 @ F,0,0,1,0,0,0,1"
       unit="px"
       method="auto"
       mode="F"
       radius="12"
       chamfer_steps="1"
       flexible="false"
       use_knot_distance="true"
       apply_no_radius="true"
       apply_with_radius="true"
       only_selected="false"
       hide_knots="false" />
    <linearGradient
       id="linearGradient7212"
       inkscape:swatch="solid">
      <stop
         style="stop-color:#000000;stop-opacity:1;"
         offset="0"
         id="stop7214" />
    </linearGradient>
  </defs>
  <sodipodi:namedview
     inkscape:document-rotation="0"
     inkscape:snap-bbox-midpoints="true"
     inkscape:snap-bbox-edge-midpoints="true"
     inkscape:snap-object-midpoints="true"
     inkscape:snap-center="true"
     inkscape:snap-text-baseline="true"
     inkscape:snap-nodes="true"
     inkscape:bbox-nodes="true"
     inkscape:bbox-paths="true"
     inkscape:snap-bbox="true"
     inkscape:showpageshadow="false"
     units="px"
     inkscape:window-maximized="1"
     inkscape:window-y="0"
     inkscape:window-x="0"
     inkscape:window-height="1011"
     inkscape:window-width="1920"
     showgrid="false"
     inkscape:current-layer="layer1"
     inkscape:document-units="px"
     inkscape:cy="479.65909"
     inkscape:cx="427.34333"
     inkscape:zoom="0.85060413"
     inkscape:pageshadow="2"
     inkscape:pageopacity="1"
     borderopacity="1.0"
     bordercolor="#666666"
     pagecolor="#ffffff"
     id="base"
     inkscape:object-paths="true"
     inkscape:snap-intersection-paths="true"
     inkscape:snap-smooth-nodes="true"
     objecttolerance="10.0"
     gridtolerance="10.0"
     guidetolerance="10.0"
     inkscape:pagecheckerboard="0"
     width="770px"
     inkscape:snap-global="true"
     height="2240px">
    <inkscape:grid
       id="grid6971"
       type="xygrid"
       originx="-6040"
       originy="-360.00011" />
  </sodipodi:namedview>
  <metadata
     id="metadata6333">
    <rdf:RDF>
      <cc:Work
         rdf:about="">
        <dc:format>image/svg+xml</dc:format>
        <dc:type
           rdf:resource="http://purl.org/dc/dcmitype/StillImage" />
      </cc:Work>
    </rdf:RDF>
  </metadata>
  <g
     transform="translate(-6040,3407.6377)"
     id="layer1"
     inkscape:groupmode="layer"
     inkscape:label="Layer 1">
    <g
       id="g6636"
       transform="matrix(0.71672768,0,0,1,1928.1174,12.499899)"
       style="stroke-width:1.1812" />
    <g
       id="g2665"
       transform="translate(10,9)" />
    <g
       inkscape:label="status"
       transform="translate(3081.9911,-3681.6384)"
       id="g8161"
       style="display:inline;fill:#f2f2f2;fill-opacity:1;stroke:#c1bab5;stroke-opacity:1" />
    <g
       style="fill:#f2f2f2;fill-opacity:1;stroke:#c1bab5;stroke-opacity:1"
       inkscape:label="devices"
       transform="translate(3081.9911,-3681.6384)"
       id="g8163" />
    <g
       style="fill:#f2f2f2;fill-opacity:1;stroke:#c1bab5;stroke-opacity:1"
       inkscape:label="apps"
       transform="translate(3081.9911,-3681.6384)"
       id="g8165" />
    <g
       style="fill:#f2f2f2;fill-opacity:1;stroke:#c1bab5;stroke-opacity:1"
       inkscape:label="places"
       transform="translate(3081.9911,-3681.6384)"
       id="g8173" />
    <g
       style="fill:#f2f2f2;fill-opacity:1;stroke:#c1bab5;stroke-opacity:1"
       inkscape:label="mimetypes"
       transform="translate(3081.9911,-3681.6384)"
       id="g8175" />
    <g
       inkscape:label="emblems"
       transform="translate(3081.9911,-3681.6384)"
       id="g8177"
       style="display:inline;fill:#f2f2f2;fill-opacity:1;stroke:#c1bab5;stroke-opacity:1" />
    <g
       inkscape:label="categories"
       transform="translate(3081.9911,-3681.6384)"
       id="g8179"
       style="display:inline;fill:#f2f2f2;fill-opacity:1;stroke:#c1bab5;stroke-opacity:1" />
    <title
       id="title9167">Gnome Symbolic Icon Theme</title>
    <g
       id="g3855-8"
       transform="matrix(0.03365125,0,0,0.03365125,8265.8637,-2778.953)"
       style="fill:#ffffff;fill-opacity:1;stroke-width:21.3461" />
    <text
       xml:space="preserve"
       style="font-style:normal;font-variant:normal;font-weight:300;font-stretch:normal;font-size:53.3333px;line-height:1.25;font-family:Cantarell;-inkscape-font-specification:'Cantarell Light';text-align:start;letter-spacing:0px;word-spacing:0px;text-anchor:start"
       x="6120"
       y="-3297.6377"
       id="text3503"><tspan
         sodipodi:role="line"
         id="tspan3501"
         x="6120"
         y="-3297.6377">Conversions</tspan></text>
    <title
       id="title9167-3">Gnome Symbolic Icon Theme</title>
    <g
       style="display:inline;fill:#2e3436"
       transform="translate(7776.9909,-3015.6696)"
       id="g8091-3">
      <g
         inkscape:label="status"
         transform="translate(-140.0002,-645.96875)"
         id="g8075-2"
         style="display:inline;fill:#2e3436" />
      <g
         style="fill:#2e3436"
         inkscape:label="devices"
         transform="translate(-140.0002,-645.96875)"
         id="g8077-0" />
      <g
         style="fill:#2e3436"
         inkscape:label="apps"
         transform="translate(-140.0002,-645.96875)"
         id="g8079-6" />
      <g
         style="fill:#2e3436"
         inkscape:label="actions"
         transform="translate(-140.0002,-645.96875)"
         id="g8081-1" />
      <g
         style="fill:#2e3436"
         inkscape:label="places"
         transform="translate(-140.0002,-645.96875)"
         id="g8083-5" />
      <g
         style="fill:#2e3436"
         inkscape:label="mimetypes"
         transform="translate(-140.0002,-645.96875)"
         id="g8085-5" />
      <g
         inkscape:label="emblems"
         transform="translate(-140.0002,-645.96875)"
         id="g8087-4"
         style="display:inline;fill:#2e3436" />
      <g
         inkscape:label="categories"
         transform="translate(-140.0002,-645.96875)"
         id="g8089-7"
         style="display:inline;fill:#2e3436" />
    </g>
    <g
       inkscape:groupmode="layer"
       id="layer10-5"
       inkscape:label="ui"
       transform="translate(7640.9998,-3976.6377)" />
    <g
       inkscape:groupmode="layer"
       id="layer1-1-9"
       inkscape:label="status"
       transform="translate(7640.9998,-3912.6377)" />
    <g
       inkscape:groupmode="layer"
       id="layer11-3"
       inkscape:label="legacy"
       transform="translate(7640.9998,-3976.6377)" />
    <g
       inkscape:groupmode="layer"
       id="layer7-7"
       inkscape:label="places"
       transform="translate(7640.9998,-3912.6377)" />
    <g
       inkscape:groupmode="layer"
       id="layer6-4"
       inkscape:label="mimetypes"
       transform="translate(7640.9998,-3912.6377)" />
    <g
       inkscape:groupmode="layer"
       id="layer5-5"
       inkscape:label="emotes"
       transform="translate(7640.9998,-3912.6377)" />
    <g
       inkscape:groupmode="layer"
       id="layer9-2"
       inkscape:label="emblems"
       transform="translate(7640.9998,-3912.6377)" />
    <g
       inkscape:groupmode="layer"
       id="layer2-5"
       inkscape:label="devices"
       transform="translate(7640.9998,-3912.6377)" />
    <g
       inkscape:groupmode="layer"
       id="layer8-4"
       inkscape:label="categories"
       transform="translate(7640.9998,-3912.6377)" />
    <g
       inkscape:groupmode="layer"
       id="layer3-7"
       inkscape:label="apps"
       transform="translate(7640.9998,-3912.6377)" />
    <g
       inkscape:groupmode="layer"
       id="layer4-4"
       inkscape:label="actions"
       transform="translate(7640.9998,-3912.6377)" />
    <filter
       id="a"
       height="1"
       width="1"
       x="0"
       y="0">
      <feColorMatrix
         in="SourceGraphic"
         type="matrix"
         values="0 0 0 0 1 0 0 0 0 1 0 0 0 0 1 0 0 0 1 0"
         id="feColorMatrix24446" />
    </filter>
    <mask
       id="b">
      <g
         filter="url(#a)"
         id="g24451">
        <path
           d="M 0,0 H 16 V 16 H 0 Z"
           fill-opacity="0.3"
           id="path24449" />
      </g>
    </mask>
    <clipPath
       id="c">
      <path
         d="M 0,0 H 1024 V 800 H 0 Z"
         id="path24454" />
    </clipPath>
    <mask
       id="d">
      <g
         filter="url(#a)"
         id="g24459">
        <path
           d="M 0,0 H 16 V 16 H 0 Z"
           fill-opacity="0.05"
           id="path24457" />
      </g>
    </mask>
    <clipPath
       id="e">
      <path
         d="M 0,0 H 1024 V 800 H 0 Z"
         id="path24462" />
    </clipPath>
    <mask
       id="f">
      <g
         filter="url(#a)"
         id="g24467">
        <path
           d="M 0,0 H 16 V 16 H 0 Z"
           fill-opacity="0.05"
           id="path24465" />
      </g>
    </mask>
    <clipPath
       id="g">
      <path
         d="M 0,0 H 1024 V 800 H 0 Z"
         id="path24470" />
    </clipPath>
    <mask
       id="h">
      <g
         filter="url(#a)"
         id="g24475">
        <path
           d="M 0,0 H 16 V 16 H 0 Z"
           fill-opacity="0.05"
           id="path24473" />
      </g>
    </mask>
    <clipPath
       id="i">
      <path
         d="M 0,0 H 1024 V 800 H 0 Z"
         id="path24478" />
    </clipPath>
    <mask
       id="j">
      <g
         filter="url(#a)"
         id="g24483">
        <path
           d="M 0,0 H 16 V 16 H 0 Z"
           fill-opacity="0.05"
           id="path24481" />
      </g>
    </mask>
    <clipPath
       id="k">
      <path
         d="M 0,0 H 1024 V 800 H 0 Z"
         id="path24486" />
    </clipPath>
    <mask
       id="l">
      <g
         filter="url(#a)"
         id="g24491">
        <path
           d="M 0,0 H 16 V 16 H 0 Z"
           fill-opacity="0.05"
           id="path24489" />
      </g>
    </mask>
    <clipPath
       id="m">
      <path
         d="M 0,0 H 1024 V 800 H 0 Z"
         id="path24494" />
    </clipPath>
    <mask
       id="n">
      <g
         filter="url(#a)"
         id="g24499">
        <path
           d="M 0,0 H 16 V 16 H 0 Z"
           fill-opacity="0.05"
           id="path24497" />
      </g>
    </mask>
    <clipPath
       id="o">
      <path
         d="M 0,0 H 1024 V 800 H 0 Z"
         id="path24502" />
    </clipPath>
    <mask
       id="p">
      <g
         filter="url(#a)"
         id="g24507">
        <path
           d="M 0,0 H 16 V 16 H 0 Z"
           fill-opacity="0.3"
           id="path24505" />
      </g>
    </mask>
    <clipPath
       id="q">
      <path
         d="M 0,0 H 1024 V 800 H 0 Z"
         id="path24510" />
    </clipPath>
    <mask
       id="r">
      <g
         filter="url(#a)"
         id="g24515">
        <path
           d="M 0,0 H 16 V 16 H 0 Z"
           fill-opacity="0.5"
           id="path24513" />
      </g>
    </mask>
    <clipPath
       id="s">
      <path
         d="M 0,0 H 1024 V 800 H 0 Z"
         id="path24518" />
    </clipPath>
    <mask
       id="t">
      <g
         filter="url(#a)"
         id="g24523">
        <path
           d="M 0,0 H 16 V 16 H 0 Z"
           fill-opacity="0.4"
           id="path24521" />
      </g>
    </mask>
    <clipPath
       id="u">
      <path
         d="M 0,0 H 1024 V 800 H 0 Z"
         id="path24526" />
    </clipPath>
    <mask
       id="v">
      <g
         filter="url(#a)"
         id="g24531">
        <path
           d="M 0,0 H 16 V 16 H 0 Z"
           fill-opacity="0.4"
           id="path24529" />
      </g>
    </mask>
    <clipPath
       id="w">
      <path
         d="M 0,0 H 1024 V 800 H 0 Z"
         id="path24534" />
    </clipPath>
    <mask
       id="x">
      <g
         filter="url(#a)"
         id="g24539">
        <path
           d="M 0,0 H 16 V 16 H 0 Z"
           fill-opacity="0.5"
           id="path24537" />
      </g>
    </mask>
    <clipPath
       id="y">
      <path
         d="M 0,0 H 1024 V 800 H 0 Z"
         id="path24542" />
    </clipPath>
    <mask
       id="z">
      <g
         filter="url(#a)"
         id="g24547">
        <path
           d="M 0,0 H 16 V 16 H 0 Z"
           fill-opacity="0.5"
           id="path24545" />
      </g>
    </mask>
    <clipPath
       id="A">
      <path
         d="M 0,0 H 1024 V 800 H 0 Z"
         id="path24550" />
    </clipPath>
    <g
       clip-path="url(#c)"
       mask="url(#b)"
       transform="translate(8996.2233,-2844.198)"
       id="g24559">
      <path
         d="m 562.46094,212.05859 h 10.44922 c -1.1836,0.49219 -1.29688,2.46094 0,3 h -10.44922 z m 0,0"
         fill="#2e3436"
         id="path24557" />
    </g>
    <g
       clip-path="url(#e)"
       mask="url(#d)"
       transform="translate(8996.2233,-2844.198)"
       id="g24563">
      <path
         d="m 16,632 h 1 v 1 h -1 z m 0,0"
         fill="#2e3436"
         fill-rule="evenodd"
         id="path24561" />
    </g>
    <g
       clip-path="url(#g)"
       mask="url(#f)"
       transform="translate(8996.2233,-2844.198)"
       id="g24567">
      <path
         d="m 17,631 h 1 v 1 h -1 z m 0,0"
         fill="#2e3436"
         fill-rule="evenodd"
         id="path24565" />
    </g>
    <g
       clip-path="url(#i)"
       mask="url(#h)"
       transform="translate(8996.2233,-2844.198)"
       id="g24571">
      <path
         d="m 18,634 h 1 v 1 h -1 z m 0,0"
         fill="#2e3436"
         fill-rule="evenodd"
         id="path24569" />
    </g>
    <g
       clip-path="url(#k)"
       mask="url(#j)"
       transform="translate(8996.2233,-2844.198)"
       id="g24575">
      <path
         d="m 16,634 h 1 v 1 h -1 z m 0,0"
         fill="#2e3436"
         fill-rule="evenodd"
         id="path24573" />
    </g>
    <g
       clip-path="url(#m)"
       mask="url(#l)"
       transform="translate(8996.2233,-2844.198)"
       id="g24579">
      <path
         d="m 17,635 h 1 v 1 h -1 z m 0,0"
         fill="#2e3436"
         fill-rule="evenodd"
         id="path24577" />
    </g>
    <g
       clip-path="url(#o)"
       mask="url(#n)"
       transform="translate(8996.2233,-2844.198)"
       id="g24583">
      <path
         d="m 19,635 h 1 v 1 h -1 z m 0,0"
         fill="#2e3436"
         fill-rule="evenodd"
         id="path24581" />
    </g>
    <g
       clip-path="url(#q)"
       mask="url(#p)"
       transform="translate(8996.2233,-2844.198)"
       id="g24587">
      <path
         d="m 136,660 v 7 h 7 v -7 z m 0,0"
         fill="#2e3436"
         id="path24585" />
    </g>
    <g
       clip-path="url(#s)"
       mask="url(#r)"
       transform="translate(8996.2233,-2844.198)"
       id="g24591">
      <path
         d="m 199,642 h 3 v 12 h -3 z m 0,0"
         fill="#2e3436"
         id="path24589" />
    </g>
    <g
       clip-path="url(#u)"
       mask="url(#t)"
       transform="translate(8996.2233,-2844.198)"
       id="g24595">
      <path
         d="m 209.5,144.16016 c 0.27734,0 0.5,0.22265 0.5,0.5 v 1 c 0,0.27734 -0.22266,0.5 -0.5,0.5 -0.27734,0 -0.5,-0.22266 -0.5,-0.5 v -1 c 0,-0.27735 0.22266,-0.5 0.5,-0.5 z m 0,0"
         fill="#2e3436"
         id="path24593" />
    </g>
    <g
       clip-path="url(#w)"
       mask="url(#v)"
       transform="translate(8996.2233,-2844.198)"
       id="g24599">
      <path
         d="m 206.5,144.16016 c 0.27734,0 0.5,0.22265 0.5,0.5 v 1 c 0,0.27734 -0.22266,0.5 -0.5,0.5 -0.27734,0 -0.5,-0.22266 -0.5,-0.5 v -1 c 0,-0.27735 0.22266,-0.5 0.5,-0.5 z m 0,0"
         fill="#2e3436"
         id="path24597" />
    </g>
    <g
       clip-path="url(#y)"
       mask="url(#x)"
       transform="translate(8996.2233,-2844.198)"
       id="g24603">
      <path
         d="m 229.5,143.16016 c -0.54688,0 -1,0.45703 -1,1 0,0.54687 0.45312,1 1,1 0.54687,0 1,-0.45313 1,-1 0,-0.54297 -0.45313,-1 -1,-1 z m 0,0"
         fill="#2e3436"
         id="path24601" />
    </g>
    <g
       clip-path="url(#A)"
       mask="url(#z)"
       transform="translate(8996.2233,-2844.198)"
       id="g24607">
      <path
         d="m 226.45312,143.16016 c -0.51953,0 -0.95312,0.43359 -0.95312,0.95312 v 0.0937 c 0,0.51953 0.43359,0.95313 0.95312,0.95313 h 0.0937 c 0.51954,0 0.95313,-0.4336 0.95313,-0.95313 v -0.0937 c 0,-0.51953 -0.43359,-0.95312 -0.95313,-0.95312 z m 0,0"
         fill="#2e3436"
         id="path24605" />
    </g>
    <text
       xml:space="preserve"
       style="font-style:normal;font-variant:normal;font-weight:800;font-stretch:normal;font-size:14px;line-height:1.25;font-family:Cantarell;-inkscape-font-specification:'Cantarell Ultra-Bold';text-align:start;letter-spacing:0px;word-spacing:0px;text-anchor:start"
       x="6120"
       y="-3242.6377"
       id="text34259"><tspan
         sodipodi:role="line"
         x="6120"
         y="-3242.6377"
         style="font-weight:normal"
         id="tspan35020">A new top-level view focused on conversions, allowing us to simplify other views.</tspan></text>
    <g
       inkscape:groupmode="layer"
       id="g2093"
       inkscape:label="ui"
       transform="translate(6931.2345,-2676.7849)" />
    <g
       inkscape:groupmode="layer"
       id="g2095"
       inkscape:label="status"
       transform="translate(6931.2345,-2612.7849)" />
    <g
       inkscape:groupmode="layer"
       id="g2097"
       inkscape:label="legacy"
       transform="translate(6931.2345,-2676.7849)" />
    <g
       inkscape:groupmode="layer"
       id="g2099"
       inkscape:label="places"
       transform="translate(6931.2345,-2612.7849)" />
    <g
       inkscape:groupmode="layer"
       id="g2101"
       inkscape:label="mimetypes"
       transform="translate(6931.2345,-2612.7849)" />
    <g
       inkscape:groupmode="layer"
       id="g2103"
       inkscape:label="emotes"
       transform="translate(6931.2345,-2612.7849)" />
    <g
       inkscape:groupmode="layer"
       id="g2105"
       inkscape:label="emblems"
       transform="translate(6931.2345,-2612.7849)" />
    <g
       inkscape:groupmode="layer"
       id="g2107"
       inkscape:label="devices"
       transform="translate(6931.2345,-2612.7849)" />
    <g
       inkscape:groupmode="layer"
       id="g2109"
       inkscape:label="categories"
       transform="translate(6931.2345,-2612.7849)" />
    <g
       inkscape:groupmode="layer"
       id="g2111"
       inkscape:label="apps"
       transform="translate(6931.2345,-2612.7849)" />
    <g
       inkscape:groupmode="layer"
       id="g2113"
       inkscape:label="actions"
       transform="translate(6931.2345,-2612.7849)" />
    <g
       id="g29351"
       transform="rotate(90,4677.2036,3176.7347)" />
    <filter
       id="a-9"
       height="1"
       width="1"
       x="0"
       y="0">
      <feColorMatrix
         in="SourceGraphic"
         type="matrix"
         values="0 0 0 0 1 0 0 0 0 1 0 0 0 0 1 0 0 0 1 0"
         id="feColorMatrix63215" />
    </filter>
    <mask
       id="b-3">
      <g
         filter="url(#a)"
         id="g63220"
         style="filter:url(#a-9)">
        <path
           d="M 0,0 H 16 V 16 H 0 Z"
           fill-opacity="0.3"
           id="path63218" />
      </g>
    </mask>
    <clipPath
       id="c-1">
      <path
         d="M 0,0 H 1024 V 800 H 0 Z"
         id="path63223" />
    </clipPath>
    <mask
       id="d-9">
      <g
         filter="url(#a)"
         id="g63228"
         style="filter:url(#a-9)">
        <path
           d="M 0,0 H 16 V 16 H 0 Z"
           fill-opacity="0.05"
           id="path63226" />
      </g>
    </mask>
    <clipPath
       id="e-4">
      <path
         d="M 0,0 H 1024 V 800 H 0 Z"
         id="path63231" />
    </clipPath>
    <mask
       id="f-7">
      <g
         filter="url(#a)"
         id="g63236"
         style="filter:url(#a-9)">
        <path
           d="M 0,0 H 16 V 16 H 0 Z"
           fill-opacity="0.05"
           id="path63234" />
      </g>
    </mask>
    <clipPath
       id="g-8">
      <path
         d="M 0,0 H 1024 V 800 H 0 Z"
         id="path63239" />
    </clipPath>
    <mask
       id="h-4">
      <g
         filter="url(#a)"
         id="g63244"
         style="filter:url(#a-9)">
        <path
           d="M 0,0 H 16 V 16 H 0 Z"
           fill-opacity="0.05"
           id="path63242" />
      </g>
    </mask>
    <clipPath
       id="i-5">
      <path
         d="M 0,0 H 1024 V 800 H 0 Z"
         id="path63247" />
    </clipPath>
    <mask
       id="j-0">
      <g
         filter="url(#a)"
         id="g63252"
         style="filter:url(#a-9)">
        <path
           d="M 0,0 H 16 V 16 H 0 Z"
           fill-opacity="0.05"
           id="path63250" />
      </g>
    </mask>
    <clipPath
       id="k-3">
      <path
         d="M 0,0 H 1024 V 800 H 0 Z"
         id="path63255" />
    </clipPath>
    <mask
       id="l-6">
      <g
         filter="url(#a)"
         id="g63260"
         style="filter:url(#a-9)">
        <path
           d="M 0,0 H 16 V 16 H 0 Z"
           fill-opacity="0.05"
           id="path63258" />
      </g>
    </mask>
    <clipPath
       id="m-1">
      <path
         d="M 0,0 H 1024 V 800 H 0 Z"
         id="path63263" />
    </clipPath>
    <mask
       id="n-0">
      <g
         filter="url(#a)"
         id="g63268"
         style="filter:url(#a-9)">
        <path
           d="M 0,0 H 16 V 16 H 0 Z"
           fill-opacity="0.05"
           id="path63266" />
      </g>
    </mask>
    <clipPath
       id="o-6">
      <path
         d="M 0,0 H 1024 V 800 H 0 Z"
         id="path63271" />
    </clipPath>
    <mask
       id="p-3">
      <g
         filter="url(#a)"
         id="g63276"
         style="filter:url(#a-9)">
        <path
           d="M 0,0 H 16 V 16 H 0 Z"
           fill-opacity="0.3"
           id="path63274" />
      </g>
    </mask>
    <clipPath
       id="q-2">
      <path
         d="M 0,0 H 1024 V 800 H 0 Z"
         id="path63279" />
    </clipPath>
    <mask
       id="r-0">
      <g
         filter="url(#a)"
         id="g63284"
         style="filter:url(#a-9)">
        <path
           d="M 0,0 H 16 V 16 H 0 Z"
           fill-opacity="0.5"
           id="path63282" />
      </g>
    </mask>
    <clipPath
       id="s-6">
      <path
         d="M 0,0 H 1024 V 800 H 0 Z"
         id="path63287" />
    </clipPath>
    <mask
       id="t-1">
      <g
         filter="url(#a)"
         id="g63292"
         style="filter:url(#a-9)">
        <path
           d="M 0,0 H 16 V 16 H 0 Z"
           fill-opacity="0.4"
           id="path63290" />
      </g>
    </mask>
    <clipPath
       id="u-5">
      <path
         d="M 0,0 H 1024 V 800 H 0 Z"
         id="path63295" />
    </clipPath>
    <mask
       id="v-5">
      <g
         filter="url(#a)"
         id="g63300"
         style="filter:url(#a-9)">
        <path
           d="M 0,0 H 16 V 16 H 0 Z"
           fill-opacity="0.4"
           id="path63298" />
      </g>
    </mask>
    <clipPath
       id="w-4">
      <path
         d="M 0,0 H 1024 V 800 H 0 Z"
         id="path63303" />
    </clipPath>
    <mask
       id="x-7">
      <g
         filter="url(#a)"
         id="g63308"
         style="filter:url(#a-9)">
        <path
           d="M 0,0 H 16 V 16 H 0 Z"
           fill-opacity="0.5"
           id="path63306" />
      </g>
    </mask>
    <clipPath
       id="y-6">
      <path
         d="M 0,0 H 1024 V 800 H 0 Z"
         id="path63311" />
    </clipPath>
    <mask
       id="z-5">
      <g
         filter="url(#a)"
         id="g63316"
         style="filter:url(#a-9)">
        <path
           d="M 0,0 H 16 V 16 H 0 Z"
           fill-opacity="0.5"
           id="path63314" />
      </g>
    </mask>
    <clipPath
       id="A-6">
      <path
         d="M 0,0 H 1024 V 800 H 0 Z"
         id="path63319" />
    </clipPath>
    <g
       clip-path="url(#c-1)"
       mask="url(#b-3)"
       transform="translate(6836.0145,-1590.8467)"
       id="g63324">
      <path
         d="m 562.46094,212.05859 h 10.44922 c -1.1836,0.49219 -1.29688,2.46094 0,3 h -10.44922 z m 0,0"
         fill="#2e3436"
         id="path63322" />
    </g>
    <g
       clip-path="url(#e-4)"
       mask="url(#d-9)"
       transform="translate(6836.0145,-1590.8467)"
       id="g63328">
      <path
         d="m 16,632 h 1 v 1 h -1 z m 0,0"
         fill="#2e3436"
         fill-rule="evenodd"
         id="path63326" />
    </g>
    <g
       clip-path="url(#g-8)"
       mask="url(#f-7)"
       transform="translate(6836.0145,-1590.8467)"
       id="g63332">
      <path
         d="m 17,631 h 1 v 1 h -1 z m 0,0"
         fill="#2e3436"
         fill-rule="evenodd"
         id="path63330" />
    </g>
    <g
       clip-path="url(#i-5)"
       mask="url(#h-4)"
       transform="translate(6836.0145,-1590.8467)"
       id="g63336">
      <path
         d="m 18,634 h 1 v 1 h -1 z m 0,0"
         fill="#2e3436"
         fill-rule="evenodd"
         id="path63334" />
    </g>
    <g
       clip-path="url(#k-3)"
       mask="url(#j-0)"
       transform="translate(6836.0145,-1590.8467)"
       id="g63340">
      <path
         d="m 16,634 h 1 v 1 h -1 z m 0,0"
         fill="#2e3436"
         fill-rule="evenodd"
         id="path63338" />
    </g>
    <g
       clip-path="url(#m-1)"
       mask="url(#l-6)"
       transform="translate(6836.0145,-1590.8467)"
       id="g63344">
      <path
         d="m 17,635 h 1 v 1 h -1 z m 0,0"
         fill="#2e3436"
         fill-rule="evenodd"
         id="path63342" />
    </g>
    <g
       clip-path="url(#o-6)"
       mask="url(#n-0)"
       transform="translate(6836.0145,-1590.8467)"
       id="g63348">
      <path
         d="m 19,635 h 1 v 1 h -1 z m 0,0"
         fill="#2e3436"
         fill-rule="evenodd"
         id="path63346" />
    </g>
    <g
       clip-path="url(#q-2)"
       mask="url(#p-3)"
       transform="translate(6836.0145,-1590.8467)"
       id="g63352">
      <path
         d="m 136,660 v 7 h 7 v -7 z m 0,0"
         fill="#2e3436"
         id="path63350" />
    </g>
    <g
       clip-path="url(#s-6)"
       mask="url(#r-0)"
       transform="translate(6836.0145,-1590.8467)"
       id="g63356">
      <path
         d="m 199,642 h 3 v 12 h -3 z m 0,0"
         fill="#2e3436"
         id="path63354" />
    </g>
    <g
       clip-path="url(#u-5)"
       mask="url(#t-1)"
       transform="translate(6836.0145,-1590.8467)"
       id="g63372">
      <path
         d="m 209.5,144.16016 c 0.27734,0 0.5,0.22265 0.5,0.5 v 1 c 0,0.27734 -0.22266,0.5 -0.5,0.5 -0.27734,0 -0.5,-0.22266 -0.5,-0.5 v -1 c 0,-0.27735 0.22266,-0.5 0.5,-0.5 z m 0,0"
         fill="#2e3436"
         id="path63370" />
    </g>
    <g
       clip-path="url(#w-4)"
       mask="url(#v-5)"
       transform="translate(6836.0145,-1590.8467)"
       id="g63376">
      <path
         d="m 206.5,144.16016 c 0.27734,0 0.5,0.22265 0.5,0.5 v 1 c 0,0.27734 -0.22266,0.5 -0.5,0.5 -0.27734,0 -0.5,-0.22266 -0.5,-0.5 v -1 c 0,-0.27735 0.22266,-0.5 0.5,-0.5 z m 0,0"
         fill="#2e3436"
         id="path63374" />
    </g>
    <g
       clip-path="url(#y-6)"
       mask="url(#x-7)"
       transform="translate(6836.0145,-1590.8467)"
       id="g63380">
      <path
         d="m 229.5,143.16016 c -0.54688,0 -1,0.45703 -1,1 0,0.54687 0.45312,1 1,1 0.54687,0 1,-0.45313 1,-1 0,-0.54297 -0.45313,-1 -1,-1 z m 0,0"
         fill="#2e3436"
         id="path63378" />
    </g>
    <g
       clip-path="url(#A-6)"
       mask="url(#z-5)"
       transform="translate(6836.0145,-1590.8467)"
       id="g63384">
      <path
         d="m 226.45312,143.16016 c -0.51953,0 -0.95312,0.43359 -0.95312,0.95312 v 0.0937 c 0,0.51953 0.43359,0.95313 0.95312,0.95313 h 0.0937 c 0.51954,0 0.95313,-0.4336 0.95313,-0.95313 v -0.0937 c 0,-0.51953 -0.43359,-0.95312 -0.95313,-0.95312 z m 0,0"
         fill="#2e3436"
         id="path63382" />
    </g>
    <filter
       id="a-4"
       height="1"
       width="1"
       x="0"
       y="0">
      <feColorMatrix
         in="SourceGraphic"
         type="matrix"
         values="0 0 0 0 1 0 0 0 0 1 0 0 0 0 1 0 0 0 1 0"
         id="feColorMatrix136155" />
    </filter>
    <mask
       id="b-4">
      <g
         filter="url(#a)"
         id="g136160"
         style="filter:url(#a-4)">
        <path
           d="M 0,0 H 16 V 16 H 0 Z"
           fill-opacity="0.3"
           id="path136158" />
      </g>
    </mask>
    <clipPath
       id="c-3">
      <path
         d="M 0,0 H 1024 V 800 H 0 Z"
         id="path136163" />
    </clipPath>
    <mask
       id="d-0">
      <g
         filter="url(#a)"
         id="g136168"
         style="filter:url(#a-4)">
        <path
           d="M 0,0 H 16 V 16 H 0 Z"
           fill-opacity="0.05"
           id="path136166" />
      </g>
    </mask>
    <clipPath
       id="e-7">
      <path
         d="M 0,0 H 1024 V 800 H 0 Z"
         id="path136171" />
    </clipPath>
    <mask
       id="f-8">
      <g
         filter="url(#a)"
         id="g136176"
         style="filter:url(#a-4)">
        <path
           d="M 0,0 H 16 V 16 H 0 Z"
           fill-opacity="0.05"
           id="path136174" />
      </g>
    </mask>
    <clipPath
       id="g-6">
      <path
         d="M 0,0 H 1024 V 800 H 0 Z"
         id="path136179" />
    </clipPath>
    <mask
       id="h-8">
      <g
         filter="url(#a)"
         id="g136184"
         style="filter:url(#a-4)">
        <path
           d="M 0,0 H 16 V 16 H 0 Z"
           fill-opacity="0.05"
           id="path136182" />
      </g>
    </mask>
    <clipPath
       id="i-8">
      <path
         d="M 0,0 H 1024 V 800 H 0 Z"
         id="path136187" />
    </clipPath>
    <mask
       id="j-4">
      <g
         filter="url(#a)"
         id="g136192"
         style="filter:url(#a-4)">
        <path
           d="M 0,0 H 16 V 16 H 0 Z"
           fill-opacity="0.05"
           id="path136190" />
      </g>
    </mask>
    <clipPath
       id="k-31">
      <path
         d="M 0,0 H 1024 V 800 H 0 Z"
         id="path136195" />
    </clipPath>
    <mask
       id="l-4">
      <g
         filter="url(#a)"
         id="g136200"
         style="filter:url(#a-4)">
        <path
           d="M 0,0 H 16 V 16 H 0 Z"
           fill-opacity="0.05"
           id="path136198" />
      </g>
    </mask>
    <clipPath
       id="m-9">
      <path
         d="M 0,0 H 1024 V 800 H 0 Z"
         id="path136203" />
    </clipPath>
    <mask
       id="n-2">
      <g
         filter="url(#a)"
         id="g136208"
         style="filter:url(#a-4)">
        <path
           d="M 0,0 H 16 V 16 H 0 Z"
           fill-opacity="0.05"
           id="path136206" />
      </g>
    </mask>
    <clipPath
       id="o-0">
      <path
         d="M 0,0 H 1024 V 800 H 0 Z"
         id="path136211" />
    </clipPath>
    <mask
       id="p-6">
      <g
         filter="url(#a)"
         id="g136216"
         style="filter:url(#a-4)">
        <path
           d="M 0,0 H 16 V 16 H 0 Z"
           fill-opacity="0.3"
           id="path136214" />
      </g>
    </mask>
    <clipPath
       id="q-8">
      <path
         d="M 0,0 H 1024 V 800 H 0 Z"
         id="path136219" />
    </clipPath>
    <mask
       id="r-9">
      <g
         filter="url(#a)"
         id="g136224"
         style="filter:url(#a-4)">
        <path
           d="M 0,0 H 16 V 16 H 0 Z"
           fill-opacity="0.5"
           id="path136222" />
      </g>
    </mask>
    <clipPath
       id="s-2">
      <path
         d="M 0,0 H 1024 V 800 H 0 Z"
         id="path136227" />
    </clipPath>
    <mask
       id="t-6">
      <g
         filter="url(#a)"
         id="g136232"
         style="filter:url(#a-4)">
        <path
           d="M 0,0 H 16 V 16 H 0 Z"
           fill-opacity="0.4"
           id="path136230" />
      </g>
    </mask>
    <clipPath
       id="u-6">
      <path
         d="M 0,0 H 1024 V 800 H 0 Z"
         id="path136235" />
    </clipPath>
    <mask
       id="v-4">
      <g
         filter="url(#a)"
         id="g136240"
         style="filter:url(#a-4)">
        <path
           d="M 0,0 H 16 V 16 H 0 Z"
           fill-opacity="0.4"
           id="path136238" />
      </g>
    </mask>
    <clipPath
       id="w-9">
      <path
         d="M 0,0 H 1024 V 800 H 0 Z"
         id="path136243" />
    </clipPath>
    <mask
       id="x-5">
      <g
         filter="url(#a)"
         id="g136248"
         style="filter:url(#a-4)">
        <path
           d="M 0,0 H 16 V 16 H 0 Z"
           fill-opacity="0.5"
           id="path136246" />
      </g>
    </mask>
    <clipPath
       id="y-0">
      <path
         d="M 0,0 H 1024 V 800 H 0 Z"
         id="path136251" />
    </clipPath>
    <mask
       id="z-4">
      <g
         filter="url(#a)"
         id="g136256"
         style="filter:url(#a-4)">
        <path
           d="M 0,0 H 16 V 16 H 0 Z"
           fill-opacity="0.5"
           id="path136254" />
      </g>
    </mask>
    <clipPath
       id="A-8">
      <path
         d="M 0,0 H 1024 V 800 H 0 Z"
         id="path136259" />
    </clipPath>
    <g
       clip-path="url(#c-3)"
       mask="url(#b-4)"
       transform="translate(6267.2946,-2446.2136)"
       id="g136268">
      <path
         d="m 562.46094,212.05859 h 10.44922 c -1.1836,0.49219 -1.29688,2.46094 0,3 h -10.44922 z m 0,0"
         fill="#2e3436"
         id="path136266" />
    </g>
    <g
       clip-path="url(#e-7)"
       mask="url(#d-0)"
       transform="translate(6267.2946,-2446.2136)"
       id="g136272">
      <path
         d="m 16,632 h 1 v 1 h -1 z m 0,0"
         fill="#2e3436"
         fill-rule="evenodd"
         id="path136270" />
    </g>
    <g
       clip-path="url(#g-6)"
       mask="url(#f-8)"
       transform="translate(6267.2946,-2446.2136)"
       id="g136276">
      <path
         d="m 17,631 h 1 v 1 h -1 z m 0,0"
         fill="#2e3436"
         fill-rule="evenodd"
         id="path136274" />
    </g>
    <g
       clip-path="url(#i-8)"
       mask="url(#h-8)"
       transform="translate(6267.2946,-2446.2136)"
       id="g136280">
      <path
         d="m 18,634 h 1 v 1 h -1 z m 0,0"
         fill="#2e3436"
         fill-rule="evenodd"
         id="path136278" />
    </g>
    <g
       clip-path="url(#k-31)"
       mask="url(#j-4)"
       transform="translate(6267.2946,-2446.2136)"
       id="g136284">
      <path
         d="m 16,634 h 1 v 1 h -1 z m 0,0"
         fill="#2e3436"
         fill-rule="evenodd"
         id="path136282" />
    </g>
    <g
       clip-path="url(#m-9)"
       mask="url(#l-4)"
       transform="translate(6267.2946,-2446.2136)"
       id="g136288">
      <path
         d="m 17,635 h 1 v 1 h -1 z m 0,0"
         fill="#2e3436"
         fill-rule="evenodd"
         id="path136286" />
    </g>
    <g
       clip-path="url(#o-0)"
       mask="url(#n-2)"
       transform="translate(6267.2946,-2446.2136)"
       id="g136292">
      <path
         d="m 19,635 h 1 v 1 h -1 z m 0,0"
         fill="#2e3436"
         fill-rule="evenodd"
         id="path136290" />
    </g>
    <g
       clip-path="url(#q-8)"
       mask="url(#p-6)"
       transform="translate(6267.2946,-2446.2136)"
       id="g136296">
      <path
         d="m 136,660 v 7 h 7 v -7 z m 0,0"
         fill="#2e3436"
         id="path136294" />
    </g>
    <g
       clip-path="url(#s-2)"
       mask="url(#r-9)"
       transform="translate(6267.2946,-2446.2136)"
       id="g136300">
      <path
         d="m 199,642 h 3 v 12 h -3 z m 0,0"
         fill="#2e3436"
         id="path136298" />
    </g>
    <g
       clip-path="url(#u-6)"
       mask="url(#t-6)"
       transform="translate(6267.2946,-2446.2136)"
       id="g136304">
      <path
         d="m 209.5,144.16016 c 0.27734,0 0.5,0.22265 0.5,0.5 v 1 c 0,0.27734 -0.22266,0.5 -0.5,0.5 -0.27734,0 -0.5,-0.22266 -0.5,-0.5 v -1 c 0,-0.27735 0.22266,-0.5 0.5,-0.5 z m 0,0"
         fill="#2e3436"
         id="path136302" />
    </g>
    <g
       clip-path="url(#w-9)"
       mask="url(#v-4)"
       transform="translate(6267.2946,-2446.2136)"
       id="g136308">
      <path
         d="m 206.5,144.16016 c 0.27734,0 0.5,0.22265 0.5,0.5 v 1 c 0,0.27734 -0.22266,0.5 -0.5,0.5 -0.27734,0 -0.5,-0.22266 -0.5,-0.5 v -1 c 0,-0.27735 0.22266,-0.5 0.5,-0.5 z m 0,0"
         fill="#2e3436"
         id="path136306" />
    </g>
    <g
       clip-path="url(#y-0)"
       mask="url(#x-5)"
       transform="translate(6267.2946,-2446.2136)"
       id="g136312">
      <path
         d="m 229.5,143.16016 c -0.54688,0 -1,0.45703 -1,1 0,0.54687 0.45312,1 1,1 0.54687,0 1,-0.45313 1,-1 0,-0.54297 -0.45313,-1 -1,-1 z m 0,0"
         fill="#2e3436"
         id="path136310" />
    </g>
    <g
       clip-path="url(#A-8)"
       mask="url(#z-4)"
       transform="translate(6267.2946,-2446.2136)"
       id="g136316">
      <path
         d="m 226.45312,143.16016 c -0.51953,0 -0.95312,0.43359 -0.95312,0.95312 v 0.0937 c 0,0.51953 0.43359,0.95313 0.95312,0.95313 h 0.0937 c 0.51954,0 0.95313,-0.4336 0.95313,-0.95313 v -0.0937 c 0,-0.51953 -0.43359,-0.95312 -0.95313,-0.95312 z m 0,0"
         fill="#2e3436"
         id="path136314" />
    </g>
    <g
       id="g11351"
       transform="matrix(0.71672768,0,0,1,1928.1174,12.499899)"
       style="stroke-width:1.1812" />
    <text
       xml:space="preserve"
       transform="translate(6050,-3397.6377)"
       id="text6874"
       style="font-weight:bold;font-size:26.6667px;line-height:1.25;font-family:'Public Sans';-inkscape-font-specification:'Public Sans Bold';text-align:center;letter-spacing:0px;word-spacing:0px;white-space:pre;shape-inside:url(#rect6876)" />
    <text
       xml:space="preserve"
       style="font-weight:bold;font-size:26.6667px;line-height:1.25;font-family:'Public Sans';-inkscape-font-specification:'Public Sans Bold';text-align:center;letter-spacing:0px;word-spacing:0px;text-anchor:middle"
       x="6383.2441"
       y="-3000.0908"
       id="text10090"><tspan
         sodipodi:role="line"
         id="tspan10088"
         x="6383.2441"
         y="-3000.0908"></tspan></text>
    <title
       id="title8473">Gnome Symbolic Icons</title>
    <g
       inkscape:groupmode="layer"
       id="layer10"
       inkscape:label="ui"
       transform="translate(6429.9998,-3948.1376)" />
    <g
       inkscape:groupmode="layer"
       id="layer1-3"
       inkscape:label="status"
       transform="translate(5815.8605,-3678.2779)" />
    <g
       inkscape:groupmode="layer"
       id="layer11"
       inkscape:label="legacy"
       transform="translate(5815.8605,-3742.2779)" />
    <g
       inkscape:groupmode="layer"
       id="layer7"
       inkscape:label="places"
       transform="translate(5815.8605,-3678.2779)" />
    <g
       inkscape:groupmode="layer"
       id="layer6"
       inkscape:label="mimetypes"
       transform="translate(5815.8605,-3678.2779)" />
    <g
       inkscape:groupmode="layer"
       id="layer5"
       inkscape:label="emotes"
       transform="translate(5815.8605,-3678.2779)" />
    <g
       inkscape:groupmode="layer"
       id="layer9"
       inkscape:label="emblems"
       transform="translate(5815.8605,-3678.2779)" />
    <g
       inkscape:groupmode="layer"
       id="layer2"
       inkscape:label="devices"
       transform="translate(5815.8605,-3678.2779)" />
    <g
       inkscape:groupmode="layer"
       id="layer8"
       inkscape:label="categories"
       transform="translate(5815.8605,-3678.2779)" />
    <g
       inkscape:groupmode="layer"
       id="layer3"
       inkscape:label="apps"
       transform="translate(5815.8605,-3678.2779)" />
    <g
       inkscape:groupmode="layer"
       id="layer4"
       inkscape:label="actions"
       transform="translate(5815.8605,-3678.2779)" />
    <g
       id="g57235"
       transform="translate(10,10)">
      <path
         id="path4145"
         style="display:inline;fill:#f8f7f7;fill-opacity:1;stroke:#d1cbc8;stroke-width:0.999996;stroke-linecap:square;stroke-miterlimit:4;stroke-dasharray:none;stroke-dashoffset:0;stroke-opacity:1"
         d="m 6108.5,-3154.1379 h 346.9999 v 547 a 12,12 135 0 1 -12,12 H 6120.5 a 12,12 45 0 1 -12,-12 z"
         inkscape:path-effect="#path-effect4147"
         inkscape:original-d="m 6108.5,-3154.1379 h 346.9999 v 559 H 6108.5 Z"
         sodipodi:nodetypes="ccccc" />
      <path
         id="path7937"
         style="display:inline;fill:#f8f7f7;fill-opacity:1;stroke:#d1cbc8;stroke-width:1;stroke-linecap:square;stroke-miterlimit:4;stroke-dasharray:none;stroke-dashoffset:0;stroke-opacity:1"
         d="m 6120.5,-3201.1378 h 322.9999 a 12,12 45 0 1 12,12 v 35 H 6108.5 v -35 a 12,12 135 0 1 12,-12 z"
         inkscape:path-effect="#path-effect7939"
         inkscape:original-d="m 6108.5,-3201.1378 h 346.9999 v 47 H 6108.5 Z"
         sodipodi:nodetypes="ccccc" />
      <g
         id="g8621"
         transform="translate(-250,-50)">
        <circle
           style="opacity:0.4;fill:#80746c;fill-opacity:0.516207;stroke:none;stroke-width:6;stroke-linecap:square;stroke-linejoin:round;stroke-dashoffset:26.4;stroke-opacity:0"
           id="path8441"
           cx="6680"
           cy="-3127.6377"
           r="11.000105" />
        <g
           style="display:inline;fill:#888a85"
           transform="translate(6612.0016,-3653.6415)"
           id="g7947">
          <g
             transform="translate(19,-242)"
             id="g7945"
             style="display:inline;fill:#888a85">
            <path
               inkscape:connector-curvature="0"
               d="m 45,764 h 1 c 0.01037,-1.2e-4 0.02079,-4.6e-4 0.03125,0 0.254951,0.0112 0.50987,0.12858 0.6875,0.3125 L 49,766.59375 51.3125,764.3125 C 51.578125,764.082 51.759172,764.007 52,764 h 1 v 1 c 0,0.28647 -0.03434,0.55065 -0.25,0.75 l -2.28125,2.28125 2.25,2.25 C 52.906938,770.46942 52.999992,770.7347 53,771 v 1 h -1 c -0.265301,-10e-6 -0.530586,-0.0931 -0.71875,-0.28125 L 49,769.4375 46.71875,771.71875 C 46.530586,771.90694 46.26529,772 46,772 h -1 v -1 c -3e-6,-0.26529 0.09306,-0.53058 0.28125,-0.71875 l 2.28125,-2.25 L 45.28125,765.75 C 45.070508,765.55537 44.97809,765.28075 45,765 Z"
               id="path7943"
               style="color:#bebebe;font-style:normal;font-variant:normal;font-weight:normal;font-stretch:normal;font-size:medium;line-height:normal;font-family:'Andale Mono';-inkscape-font-specification:'Andale Mono';text-indent:0;text-align:start;text-decoration:none;text-decoration-line:none;letter-spacing:normal;word-spacing:normal;text-transform:none;writing-mode:lr-tb;direction:ltr;text-anchor:start;display:inline;overflow:visible;visibility:visible;fill:#2e3436;fill-opacity:1;fill-rule:nonzero;stroke:none;stroke-width:1.78125;marker:none;enable-background:new" />
          </g>
        </g>
      </g>
      <text
         xml:space="preserve"
         style="font-style:normal;font-variant:normal;font-weight:normal;font-stretch:normal;font-size:14px;line-height:125%;font-family:Cantarell;-inkscape-font-specification:Cantarell;text-align:center;letter-spacing:0px;word-spacing:0px;text-anchor:middle;display:inline;fill:#2e3436;fill-opacity:1;stroke:none"
         x="-156.82497"
         y="775.28601"
         id="text8141"
         transform="translate(6429.9998,-3948.1376)"><tspan
           sodipodi:role="line"
           id="tspan8139"
           x="-156.82497"
           y="775.28601"
           style="font-style:normal;font-variant:normal;font-weight:bold;font-stretch:normal;font-family:Cantarell;-inkscape-font-specification:Cantarell;fill:#2e3436;fill-opacity:1">Conversion</tspan></text>
      <text
         xml:space="preserve"
         style="font-style:normal;font-variant:normal;font-weight:normal;font-stretch:normal;font-size:14px;line-height:125%;font-family:Cantarell;-inkscape-font-specification:Cantarell;text-align:start;letter-spacing:0px;word-spacing:0px;text-anchor:start;display:inline;fill:#2e3436;fill-opacity:1;stroke:none"
         x="-289.99976"
         y="955.49988"
         id="text27067"
         transform="translate(6429.9998,-3948.1376)"><tspan
           sodipodi:role="line"
           id="tspan27065"
           x="-289.99976"
           y="955.49988"
           style="font-style:normal;font-variant:normal;font-weight:bold;font-stretch:normal;font-family:Cantarell;-inkscape-font-specification:Cantarell;text-align:start;text-anchor:start;fill:#2e3436;fill-opacity:1">Kilometers per hour</tspan></text>
      <text
         xml:space="preserve"
         style="font-style:normal;font-variant:normal;font-weight:normal;font-stretch:normal;font-size:45.3333px;line-height:125%;font-family:Cantarell;-inkscape-font-specification:Cantarell;text-align:start;letter-spacing:0px;word-spacing:0px;text-anchor:start;display:inline;fill:#2e3436;fill-opacity:1;stroke:none"
         x="-289.99976"
         y="929.49988"
         id="text29737"
         transform="translate(6429.9998,-3948.1376)"><tspan
           sodipodi:role="line"
           id="tspan29735"
           x="-289.99976"
           y="929.49988"
           style="font-style:normal;font-variant:normal;font-weight:bold;font-stretch:normal;font-size:45.3333px;font-family:Cantarell;-inkscape-font-specification:Cantarell;text-align:start;text-anchor:start;fill:#2e3436;fill-opacity:1">395.3</tspan></text>
      <path
         inkscape:connector-curvature="0"
         d="m -103.55186,767.49979 -5.99414,5.99999 -6.00586,-5.99999 z"
         id="path20599"
         sodipodi:nodetypes="cccc"
         style="fill:#2e3436;fill-opacity:1;stroke:none"
         transform="translate(6429.9998,-3948.1376)" />
      <path
         inkscape:connector-curvature="0"
         d="m -141.9998,948.4998 -5.99414,6 -6.00586,-6 z"
         id="path27069"
         sodipodi:nodetypes="cccc"
         style="fill:#2e3436;fill-opacity:1;stroke:none"
         transform="translate(6429.9998,-3948.1376)" />
      <text
         xml:space="preserve"
         style="font-style:normal;font-variant:normal;font-weight:normal;font-stretch:normal;font-size:14px;line-height:125%;font-family:Cantarell;-inkscape-font-specification:Cantarell;text-align:start;letter-spacing:0px;word-spacing:0px;text-anchor:start;display:inline;fill:#2e3436;fill-opacity:1;stroke:none"
         x="-289.99976"
         y="835.49988"
         id="text39504"
         transform="translate(6429.9998,-3948.1376)"><tspan
           sodipodi:role="line"
           id="tspan39502"
           x="-289.99976"
           y="835.49988"
           style="font-style:normal;font-variant:normal;font-weight:bold;font-stretch:normal;font-family:Cantarell;-inkscape-font-specification:Cantarell;text-align:start;text-anchor:start;fill:#2e3436;fill-opacity:1">Speed</tspan></text>
      <path
         inkscape:connector-curvature="0"
         d="m -230.9998,828.4998 -5.99414,6 -6.00586,-6 z"
         id="path39506"
         sodipodi:nodetypes="cccc"
         style="fill:#2e3436;fill-opacity:1;stroke:none"
         transform="translate(6429.9998,-3948.1376)" />
      <text
         xml:space="preserve"
         style="font-style:normal;font-variant:normal;font-weight:normal;font-stretch:normal;font-size:14px;line-height:125%;font-family:Cantarell;-inkscape-font-specification:Cantarell;text-align:start;letter-spacing:0px;word-spacing:0px;text-anchor:start;display:inline;fill:#2e3436;fill-opacity:1;stroke:none"
         x="-289.99976"
         y="1055.4999"
         id="text43882"
         transform="translate(6429.9998,-3948.1376)"><tspan
           sodipodi:role="line"
           id="tspan43880"
           x="-289.99976"
           y="1055.4999"
           style="font-style:normal;font-variant:normal;font-weight:bold;font-stretch:normal;font-family:Cantarell;-inkscape-font-specification:Cantarell;text-align:start;text-anchor:start;fill:#2e3436;fill-opacity:1">Knots</tspan></text>
      <text
         xml:space="preserve"
         style="font-style:normal;font-variant:normal;font-weight:normal;font-stretch:normal;font-size:45.3333px;line-height:125%;font-family:Cantarell;-inkscape-font-specification:Cantarell;text-align:start;letter-spacing:0px;word-spacing:0px;text-anchor:start;display:inline;fill:#2e3436;fill-opacity:1;stroke:none"
         x="-289.99976"
         y="1029.4999"
         id="text43886"
         transform="translate(6429.9998,-3948.1376)"><tspan
           sodipodi:role="line"
           id="tspan43884"
           x="-289.99976"
           y="1029.4999"
           style="font-style:normal;font-variant:normal;font-weight:bold;font-stretch:normal;font-size:45.3333px;font-family:Cantarell;-inkscape-font-specification:Cantarell;text-align:start;text-anchor:start;fill:#2e3436;fill-opacity:1">213.4449</tspan></text>
      <path
         inkscape:connector-curvature="0"
         d="m -233.9998,1048.4998 -5.99414,6 -6.00586,-6 z"
         id="path43888"
         sodipodi:nodetypes="cccc"
         style="fill:#2e3436;fill-opacity:1;stroke:none"
         transform="translate(6429.9998,-3948.1376)" />
      <rect
         style="display:inline;opacity:0.4;fill:#80746c;fill-opacity:0.517647;stroke:none;stroke-width:0.999996;stroke-linecap:square;stroke-miterlimit:4;stroke-dasharray:none;stroke-dashoffset:0;stroke-opacity:1"
         id="rect49154"
         width="103.99999"
         height="48.000095"
         x="6120.9995"
         y="-2811.6377"
         rx="8"
         ry="8" />
      <rect
         style="display:inline;opacity:0.4;fill:#80746c;fill-opacity:0.517647;stroke:none;stroke-width:0.999996;stroke-linecap:square;stroke-miterlimit:4;stroke-dasharray:none;stroke-dashoffset:0;stroke-opacity:1"
         id="rect50746"
         width="103.99999"
         height="48.000095"
         x="6338.9995"
         y="-2811.6377"
         rx="8"
         ry="8" />
      <rect
         style="display:inline;opacity:0.4;fill:#80746c;fill-opacity:0.517647;stroke:none;stroke-width:0.999996;stroke-linecap:square;stroke-miterlimit:4;stroke-dasharray:none;stroke-dashoffset:0;stroke-opacity:1"
         id="rect50748"
         width="104"
         height="48.000095"
         x="6230"
         y="-2811.6377"
         rx="8"
         ry="8" />
      <rect
         style="display:inline;opacity:0.4;fill:#80746c;fill-opacity:0.517647;stroke:none;stroke-width:0.999996;stroke-linecap:square;stroke-miterlimit:4;stroke-dasharray:none;stroke-dashoffset:0;stroke-opacity:1"
         id="rect50859"
         width="103.99999"
         height="48.000095"
         x="6120.9995"
         y="-2759.6377"
         rx="8"
         ry="8" />
      <rect
         style="display:inline;opacity:0.4;fill:#80746c;fill-opacity:0.517647;stroke:none;stroke-width:0.999996;stroke-linecap:square;stroke-miterlimit:4;stroke-dasharray:none;stroke-dashoffset:0;stroke-opacity:1"
         id="rect50861"
         width="103.99999"
         height="48.000095"
         x="6338.9995"
         y="-2759.6377"
         rx="8"
         ry="8" />
      <rect
         style="display:inline;opacity:0.4;fill:#80746c;fill-opacity:0.517647;stroke:none;stroke-width:0.999996;stroke-linecap:square;stroke-miterlimit:4;stroke-dasharray:none;stroke-dashoffset:0;stroke-opacity:1"
         id="rect50863"
         width="104"
         height="48.000095"
         x="6230"
         y="-2759.6377"
         rx="8"
         ry="8" />
      <rect
         style="display:inline;opacity:0.4;fill:#80746c;fill-opacity:0.517647;stroke:none;stroke-width:0.999996;stroke-linecap:square;stroke-miterlimit:4;stroke-dasharray:none;stroke-dashoffset:0;stroke-opacity:1"
         id="rect50865"
         width="103.99999"
         height="48.000095"
         x="6120.9995"
         y="-2707.6377"
         rx="8"
         ry="8" />
      <rect
         style="display:inline;opacity:0.4;fill:#80746c;fill-opacity:0.517647;stroke:none;stroke-width:0.999996;stroke-linecap:square;stroke-miterlimit:4;stroke-dasharray:none;stroke-dashoffset:0;stroke-opacity:1"
         id="rect50867"
         width="103.99999"
         height="48.000095"
         x="6338.9995"
         y="-2707.6377"
         rx="8"
         ry="8" />
      <rect
         style="display:inline;opacity:0.4;fill:#80746c;fill-opacity:0.517647;stroke:none;stroke-width:0.999996;stroke-linecap:square;stroke-miterlimit:4;stroke-dasharray:none;stroke-dashoffset:0;stroke-opacity:1"
         id="rect50869"
         width="104"
         height="48.000095"
         x="6230"
         y="-2707.6377"
         rx="8"
         ry="8" />
      <rect
         style="display:inline;opacity:0.4;fill:#80746c;fill-opacity:0.517647;stroke:none;stroke-width:0.999996;stroke-linecap:square;stroke-miterlimit:4;stroke-dasharray:none;stroke-dashoffset:0;stroke-opacity:1"
         id="rect50871"
         width="103.99999"
         height="48.000095"
         x="6120.9995"
         y="-2655.6377"
         rx="8"
         ry="8" />
      <rect
         style="display:inline;opacity:0.4;fill:#80746c;fill-opacity:0.517647;stroke:none;stroke-width:0.999996;stroke-linecap:square;stroke-miterlimit:4;stroke-dasharray:none;stroke-dashoffset:0;stroke-opacity:1"
         id="rect50873"
         width="103.99999"
         height="48.000095"
         x="6338.9995"
         y="-2655.6377"
         rx="8"
         ry="8" />
      <rect
         style="display:inline;opacity:0.4;fill:#80746c;fill-opacity:0.517647;stroke:none;stroke-width:0.999996;stroke-linecap:square;stroke-miterlimit:4;stroke-dasharray:none;stroke-dashoffset:0;stroke-opacity:1"
         id="rect50875"
         width="104"
         height="48.000095"
         x="6230"
         y="-2655.6377"
         rx="8"
         ry="8" />
      <g
         id="g11811-6"
         transform="translate(5555.9999,-1269.1733)">
        <rect
           inkscape:export-ydpi="90"
           inkscape:export-xdpi="90"
           inkscape:export-filename="/home/lapo.fedora/SparkleShare/gnome-mockups/content selection/content-selection.png"
           ry="6"
           rx="5.9999995"
           y="-1924.9645"
           x="815.50006"
           height="33.000122"
           width="34.999989"
           id="rect11799-2"
           style="color:#000000;display:inline;overflow:visible;visibility:visible;fill:#000000;fill-opacity:0;fill-rule:nonzero;stroke:#000000;stroke-width:1;stroke-linecap:butt;stroke-linejoin:miter;stroke-miterlimit:4;stroke-dasharray:none;stroke-dashoffset:0;stroke-opacity:0;marker:none;enable-background:accumulate" />
        <g
           id="g11809-9"
           transform="translate(45.999994,-1507.8268)">
          <rect
             inkscape:label="a"
             y="-408.63779"
             x="779.00006"
             height="16"
             width="16"
             id="rect11801-1"
             style="color:#bebebe;display:inline;overflow:visible;visibility:visible;fill:none;stroke:none;stroke-width:1;marker:none" />
          <rect
             inkscape:label="a"
             y="-406.638"
             x="780"
             height="2.0002136"
             width="14.000112"
             id="rect11803-2"
             style="color:#bebebe;display:inline;overflow:visible;visibility:visible;fill:#2e3436;fill-opacity:1;stroke:none;stroke-width:1;marker:none" />
          <rect
             inkscape:label="a"
             y="-401.638"
             x="780"
             height="2.0002136"
             width="14.000112"
             id="rect11805-7"
             style="color:#bebebe;display:inline;overflow:visible;visibility:visible;fill:#2e3436;fill-opacity:1;stroke:none;stroke-width:1;marker:none" />
          <rect
             inkscape:label="a"
             y="-396.638"
             x="780"
             height="2.0002136"
             width="14.000112"
             id="rect11807-0"
             style="color:#bebebe;display:inline;overflow:visible;visibility:visible;fill:#2e3436;fill-opacity:1;stroke:none;stroke-width:1;marker:none" />
        </g>
      </g>
    </g>
  </g>
</svg>
