<?xml version="1.0" encoding="UTF-8" standalone="no"?>
<svg
   version="1.1"
   viewBox="0 0 2000 1280"
   id="svg728"
   sodipodi:docname="emergency-calling.svg"
   inkscape:version="1.2.2 (b0a8486541, 2022-12-01)"
   width="2000"
   height="1280"
   inkscape:export-filename="../emergency-calling.png"
   inkscape:export-xdpi="96"
   inkscape:export-ydpi="96"
   xmlns:inkscape="http://www.inkscape.org/namespaces/inkscape"
   xmlns:sodipodi="http://sodipodi.sourceforge.net/DTD/sodipodi-0.dtd"
   xmlns:xlink="http://www.w3.org/1999/xlink"
   xmlns="http://www.w3.org/2000/svg"
   xmlns:svg="http://www.w3.org/2000/svg">
  <sodipodi:namedview
     id="namedview730"
     pagecolor="#eeeeee"
     bordercolor="#666666"
     borderopacity="1.0"
     inkscape:pageshadow="2"
     inkscape:pageopacity="1"
     inkscape:pagecheckerboard="0"
     showgrid="false"
     inkscape:snap-bbox="true"
     inkscape:bbox-nodes="true"
     inkscape:zoom="1.4142136"
     inkscape:cx="1185.4645"
     inkscape:cy="653.36667"
     inkscape:window-width="2560"
     inkscape:window-height="1531"
     inkscape:window-x="0"
     inkscape:window-y="0"
     inkscape:window-maximized="1"
     inkscape:current-layer="svg728"
     showguides="true"
     inkscape:showpageshadow="2"
     inkscape:deskcolor="#eeeeee">
    <inkscape:grid
       type="xygrid"
       id="grid3619"
       empspacing="4" />
  </sodipodi:namedview>
  <defs
     id="defs35">
    <rect
       x="1070.5554"
       y="612.61725"
       width="294.81121"
       height="187.38275"
       id="rect27988" />
    <rect
       x="984"
       y="960"
       width="325.69141"
       height="174.82422"
       id="rect71896" />
    <marker
       id="af"
       overflow="visible"
       orient="auto">
      <path
         transform="scale(0.4)"
         d="M 5.77,0 -2.88,5 V -5 Z"
         fill="context-stroke"
         fill-rule="evenodd"
         stroke="#9a9996"
         stroke-width="1pt"
         id="path2" />
    </marker>
    <clipPath
       id="clipPath7">
      <path
         d="m 596.05,612 c -4.4597,0 -8.0508,3.5911 -8.0508,8.0508 v 15.898 c 0,4.4426 3.5641,8.0214 8,8.0488 v 8.002 l 8,-8 h 19.949 c 4.4597,0 8.0508,-3.5911 8.0508,-8.0508 v -15.898 c 0,-4.4597 -3.5911,-8.0508 -8.0508,-8.0508 z"
         fill="#ffffff"
         fill-rule="evenodd"
         id="path5" />
    </clipPath>
    <linearGradient
       id="ac">
      <stop
         stop-color="#ed6f00"
         offset="0"
         id="stop9" />
      <stop
         stop-color="#ffbe6f"
         offset="1"
         id="stop11" />
    </linearGradient>
    <linearGradient
       id="ad">
      <stop
         stop-color="#ed333b"
         offset="0"
         id="stop14" />
      <stop
         stop-color="#f66151"
         offset="1"
         id="stop16" />
    </linearGradient>
    <marker
       id="ag"
       overflow="visible"
       orient="auto">
      <path
         transform="scale(0.4)"
         d="M 5.77,0 -2.88,5 V -5 Z"
         fill="context-stroke"
         fill-rule="evenodd"
         stroke="#9a9996"
         stroke-width="1pt"
         id="path19" />
    </marker>
    <marker
       id="ae"
       overflow="visible"
       orient="auto">
      <path
         transform="scale(0.4)"
         d="M 5.77,0 -2.88,5 V -5 Z"
         fill="context-stroke"
         fill-rule="evenodd"
         stroke="#9a9996"
         stroke-width="1pt"
         id="path22" />
    </marker>
    <marker
       id="ah"
       overflow="visible"
       orient="auto">
      <path
         transform="scale(0.4)"
         d="M 5.77,0 -2.88,5 V -5 Z"
         fill="context-stroke"
         fill-rule="evenodd"
         stroke="#9a9996"
         stroke-width="1pt"
         id="path25" />
    </marker>
    <marker
       id="ai"
       overflow="visible"
       orient="auto">
      <path
         transform="scale(0.4)"
         d="M 5.77,0 -2.88,5 V -5 Z"
         fill="context-stroke"
         fill-rule="evenodd"
         stroke="#9a9996"
         stroke-width="1pt"
         id="path28" />
    </marker>
    <linearGradient
       id="aa"
       x1="3049.1001"
       x2="3057.5"
       y1="495.20001"
       y2="495.20001"
       gradientTransform="matrix(11.811,0,0,11.811,-37476.528,-7520.2273)"
       gradientUnits="userSpaceOnUse"
       xlink:href="#ad" />
    <linearGradient
       id="aj"
       x1="438.81"
       x2="449.39001"
       y1="221.49001"
       y2="221.49001"
       gradientTransform="matrix(9.4487,0,0,9.4487,-4676.5001,-1053.2735)"
       gradientUnits="userSpaceOnUse"
       xlink:href="#ac" />
    <linearGradient
       id="ab"
       x1="438.81"
       x2="449.39001"
       y1="221.49001"
       y2="221.49001"
       gradientTransform="matrix(2.8802,0,0,2.8802,-2210.3701,371.52564)"
       gradientUnits="userSpaceOnUse"
       xlink:href="#ac" />
    <linearGradient
       id="ak"
       x1="3049.1001"
       x2="3057.5"
       y1="495.20001"
       y2="495.20001"
       gradientTransform="matrix(11.811,0,0,11.811,-37358.71,-7644.029)"
       gradientUnits="userSpaceOnUse"
       xlink:href="#ad" />
    <filter
       id="a"
       x="0"
       y="0"
       width="1"
       height="1">
      <feColorMatrix
         in="SourceGraphic"
         values="0 0 0 0 1 0 0 0 0 1 0 0 0 0 1 0 0 0 1 0"
         id="feColorMatrix53" />
    </filter>
    <mask
       id="b">
      <g
         filter="url(#a)"
         id="g58">
        <path
           d="M 0,0 H 16 V 16 H 0 Z"
           fill-opacity="0.3"
           id="path56" />
      </g>
    </mask>
    <clipPath
       id="c">
      <path
         d="M 0,0 H 1024 V 800 H 0 Z"
         id="path61" />
    </clipPath>
    <mask
       id="d">
      <g
         filter="url(#a)"
         id="g66">
        <path
           d="M 0,0 H 16 V 16 H 0 Z"
           fill-opacity="0.05"
           id="path64" />
      </g>
    </mask>
    <clipPath
       id="e">
      <path
         d="M 0,0 H 1024 V 800 H 0 Z"
         id="path69" />
    </clipPath>
    <mask
       id="f">
      <g
         filter="url(#a)"
         id="g74">
        <path
           d="M 0,0 H 16 V 16 H 0 Z"
           fill-opacity="0.05"
           id="path72" />
      </g>
    </mask>
    <clipPath
       id="g">
      <path
         d="M 0,0 H 1024 V 800 H 0 Z"
         id="path77" />
    </clipPath>
    <mask
       id="h">
      <g
         filter="url(#a)"
         id="g82">
        <path
           d="M 0,0 H 16 V 16 H 0 Z"
           fill-opacity="0.05"
           id="path80" />
      </g>
    </mask>
    <clipPath
       id="i">
      <path
         d="M 0,0 H 1024 V 800 H 0 Z"
         id="path85" />
    </clipPath>
    <mask
       id="j">
      <g
         filter="url(#a)"
         id="g90">
        <path
           d="M 0,0 H 16 V 16 H 0 Z"
           fill-opacity="0.05"
           id="path88" />
      </g>
    </mask>
    <clipPath
       id="k">
      <path
         d="M 0,0 H 1024 V 800 H 0 Z"
         id="path93" />
    </clipPath>
    <mask
       id="l">
      <g
         filter="url(#a)"
         id="g98">
        <path
           d="M 0,0 H 16 V 16 H 0 Z"
           fill-opacity="0.05"
           id="path96" />
      </g>
    </mask>
    <clipPath
       id="m">
      <path
         d="M 0,0 H 1024 V 800 H 0 Z"
         id="path101" />
    </clipPath>
    <mask
       id="n">
      <g
         filter="url(#a)"
         id="g106">
        <path
           d="M 0,0 H 16 V 16 H 0 Z"
           fill-opacity="0.05"
           id="path104" />
      </g>
    </mask>
    <clipPath
       id="o">
      <path
         d="M 0,0 H 1024 V 800 H 0 Z"
         id="path109" />
    </clipPath>
    <mask
       id="al">
      <g
         filter="url(#a)"
         id="g114">
        <path
           d="M 0,0 H 16 V 16 H 0 Z"
           fill-opacity="0.3"
           id="path112" />
      </g>
    </mask>
    <clipPath
       id="am">
      <path
         d="M 0,0 H 1024 V 800 H 0 Z"
         id="path117" />
    </clipPath>
    <mask
       id="an">
      <g
         filter="url(#a)"
         id="g122">
        <path
           d="M 0,0 H 16 V 16 H 0 Z"
           fill-opacity="0.5"
           id="path120" />
      </g>
    </mask>
    <clipPath
       id="ao">
      <path
         d="M 0,0 H 1024 V 800 H 0 Z"
         id="path125" />
    </clipPath>
    <mask
       id="ap">
      <g
         filter="url(#a)"
         id="g130">
        <path
           d="M 0,0 H 16 V 16 H 0 Z"
           fill-opacity="0.4"
           id="path128" />
      </g>
    </mask>
    <clipPath
       id="aq">
      <path
         d="M 0,0 H 1024 V 800 H 0 Z"
         id="path133" />
    </clipPath>
    <mask
       id="ar">
      <g
         filter="url(#a)"
         id="g138">
        <path
           d="M 0,0 H 16 V 16 H 0 Z"
           fill-opacity="0.4"
           id="path136" />
      </g>
    </mask>
    <clipPath
       id="as">
      <path
         d="M 0,0 H 1024 V 800 H 0 Z"
         id="path141" />
    </clipPath>
    <mask
       id="at">
      <g
         filter="url(#a)"
         id="g146">
        <path
           d="M 0,0 H 16 V 16 H 0 Z"
           fill-opacity="0.5"
           id="path144" />
      </g>
    </mask>
    <clipPath
       id="au">
      <path
         d="M 0,0 H 1024 V 800 H 0 Z"
         id="path149" />
    </clipPath>
    <mask
       id="av">
      <g
         filter="url(#a)"
         id="g154">
        <path
           d="M 0,0 H 16 V 16 H 0 Z"
           fill-opacity="0.5"
           id="path152" />
      </g>
    </mask>
    <clipPath
       id="aw">
      <path
         d="M 0,0 H 1024 V 800 H 0 Z"
         id="path157" />
    </clipPath>
    <linearGradient
       inkscape:collect="always"
       xlink:href="#ad"
       id="linearGradient151411"
       gradientUnits="userSpaceOnUse"
       gradientTransform="matrix(11.810864,0,0,11.810864,-36502.014,-7532.7159)"
       x1="3049.0591"
       y1="495.19702"
       x2="3057.5259"
       y2="495.19702" />
    <rect
       x="1070.5554"
       y="612.61725"
       width="294.81121"
       height="187.38275"
       id="rect29260" />
  </defs>
  <rect
     y="224"
     x="1504"
     height="720.00018"
     width="360.00052"
     id="rect188150-5"
     style="fill:#000000;fill-opacity:1;stroke:none;stroke-width:2;stroke-linecap:butt;stroke-linejoin:round;stroke-miterlimit:4;stroke-dasharray:none;stroke-dashoffset:0;stroke-opacity:1" />
  <rect
     x="1040"
     y="224"
     width="360"
     height="720"
     id="rect15794"
     style="fill:#000000" />
  <rect
     x="1055.9999"
     y="872"
     width="328"
     height="104"
     rx="9"
     ry="9"
     fill="#3e3d41"
     stroke="#1c1c1c"
     stroke-linecap="square"
     id="rect43635"
     style="fill:#282828;fill-opacity:1;stroke:#282828;stroke-opacity:1" />
  <text
     x="348.3447"
     y="1664.1266"
     fill="#000000"
     font-family="sans-serif"
     font-size="40px"
     letter-spacing="0px"
     word-spacing="0px"
     style="line-height:1.25"
     xml:space="preserve"
     id="text39" />
  <text
     x="80.767807"
     y="135.29601"
     fill="#000000"
     font-family="Cantarell"
     font-size="64px"
     font-weight="800"
     letter-spacing="0px"
     word-spacing="0px"
     style="font-size:48px;line-height:1.25"
     xml:space="preserve"
     id="text51"><tspan
       x="80.767807"
       y="135.29601"
       font-family="Cantarell"
       font-weight="800"
       id="tspan49"
       style="font-size:48px">Emergency Calling</tspan></text>
  <text
     x="607.32983"
     y="677.63843"
     fill="#2e3436"
     font-family="Cantarell"
     font-size="14.667px"
     letter-spacing="0px"
     word-spacing="0px"
     style="line-height:0%"
     xml:space="preserve"
     id="text162"><tspan
       x="607.32983"
       y="677.63843"
       font-size="14.667px"
       style="line-height:1.25"
       id="tspan160" /></text>
  <text
     style="line-height:1px;font-family:sans-serif;letter-spacing:0px;word-spacing:0px;white-space:pre;shape-inside:url(#rect5671)"
     xml:space="preserve"
     id="text164"
     transform="translate(-2663.8999,108.69)" />
  <text
     style="font-size:0.00000000000000000000000000000001px;line-height:1px;font-family:sans-serif;letter-spacing:0px;word-spacing:0px;white-space:pre;shape-inside:url(#rect5677)"
     xml:space="preserve"
     id="text166"
     transform="translate(-2663.8999,108.69)" />
  <text
     style="font-size:0.00000000000000000000000000000001px;line-height:1px;font-family:sans-serif;letter-spacing:0px;word-spacing:0px;white-space:pre;shape-inside:url(#rect5683)"
     xml:space="preserve"
     id="text168"
     transform="translate(-2663.8999,108.69)" />
  <text
     style="font-size:0.00000000000000000000000000000001px;line-height:1px;font-family:sans-serif;letter-spacing:0px;word-spacing:0px;white-space:pre;shape-inside:url(#rect5689)"
     xml:space="preserve"
     id="text170"
     transform="translate(-2663.8999,108.69)" />
  <rect
     x="96"
     y="224"
     width="360"
     height="720"
     id="rect178" />
  <text
     x="182.63477"
     y="566.66431"
     color="#000000"
     color-rendering="auto"
     image-rendering="auto"
     text-align="center"
     style="font-weight:bold;font-size:29.333px;line-height:110%;font-family:Cantarell;font-variant-ligatures:normal;font-variant-caps:normal;font-variant-numeric:normal;font-feature-settings:normal;text-anchor:middle;fill:#ffffff;stroke-width:4;stroke-linecap:round;shape-rendering:auto;text-rendering:auto"
     xml:space="preserve"
     id="text182"><tspan
       x="182.63477"
       y="566.66431"
       fill="#ffffff"
       font-family="Cantarell"
       font-size="29.333px"
       font-weight="bold"
       stroke-width="4"
       text-align="center"
       text-anchor="middle"
       id="tspan180">1</tspan></text>
  <text
     x="276.23264"
     y="566.66431"
     color="#000000"
     color-rendering="auto"
     image-rendering="auto"
     text-align="center"
     style="font-weight:bold;font-size:29.333px;line-height:110%;font-family:Cantarell;font-variant-ligatures:normal;font-variant-caps:normal;font-variant-numeric:normal;font-feature-settings:normal;text-anchor:middle;fill:#ffffff;stroke-width:4;stroke-linecap:round;shape-rendering:auto;text-rendering:auto"
     xml:space="preserve"
     id="text186"><tspan
       x="276.23264"
       y="566.66431"
       fill="#ffffff"
       font-family="Cantarell"
       font-size="29.333px"
       font-weight="bold"
       stroke-width="4"
       text-align="center"
       text-anchor="middle"
       id="tspan184">2</tspan></text>
  <text
     x="362.89865"
     y="566.66431"
     color="#000000"
     color-rendering="auto"
     image-rendering="auto"
     text-align="center"
     style="font-weight:bold;font-size:29.333px;line-height:110%;font-family:Cantarell;font-variant-ligatures:normal;font-variant-caps:normal;font-variant-numeric:normal;font-feature-settings:normal;text-anchor:middle;fill:#ffffff;stroke-width:4;stroke-linecap:round;shape-rendering:auto;text-rendering:auto"
     xml:space="preserve"
     id="text190"><tspan
       x="362.89865"
       y="566.66431"
       fill="#ffffff"
       font-family="Cantarell"
       font-size="29.333px"
       font-weight="bold"
       stroke-width="4"
       text-align="center"
       text-anchor="middle"
       id="tspan188">3</tspan></text>
  <text
     x="182.63477"
     y="639.99683"
     color="#000000"
     color-rendering="auto"
     image-rendering="auto"
     text-align="center"
     style="font-weight:bold;font-size:29.333px;line-height:110%;font-family:Cantarell;font-variant-ligatures:normal;font-variant-caps:normal;font-variant-numeric:normal;font-feature-settings:normal;text-anchor:middle;fill:#ffffff;stroke-width:4;stroke-linecap:round;shape-rendering:auto;text-rendering:auto"
     xml:space="preserve"
     id="text194"><tspan
       x="182.63477"
       y="639.99683"
       fill="#ffffff"
       font-family="Cantarell"
       font-size="29.333px"
       font-weight="bold"
       stroke-width="4"
       text-align="center"
       text-anchor="middle"
       id="tspan192">4</tspan></text>
  <text
     x="276.23264"
     y="639.99683"
     color="#000000"
     color-rendering="auto"
     image-rendering="auto"
     text-align="center"
     style="font-weight:bold;font-size:29.333px;line-height:110%;font-family:Cantarell;font-variant-ligatures:normal;font-variant-caps:normal;font-variant-numeric:normal;font-feature-settings:normal;text-anchor:middle;fill:#ffffff;stroke-width:4;stroke-linecap:round;shape-rendering:auto;text-rendering:auto"
     xml:space="preserve"
     id="text198"><tspan
       x="276.23264"
       y="639.99683"
       fill="#ffffff"
       font-family="Cantarell"
       font-size="29.333px"
       font-weight="bold"
       stroke-width="4"
       text-align="center"
       text-anchor="middle"
       id="tspan196">5</tspan></text>
  <text
     x="362.89865"
     y="639.99683"
     color="#000000"
     color-rendering="auto"
     image-rendering="auto"
     text-align="center"
     style="font-weight:bold;font-size:29.333px;line-height:110%;font-family:Cantarell;font-variant-ligatures:normal;font-variant-caps:normal;font-variant-numeric:normal;font-feature-settings:normal;text-anchor:middle;fill:#ffffff;stroke-width:4;stroke-linecap:round;shape-rendering:auto;text-rendering:auto"
     xml:space="preserve"
     id="text202"><tspan
       x="362.89865"
       y="639.99683"
       fill="#ffffff"
       font-family="Cantarell"
       font-size="29.333px"
       font-weight="bold"
       stroke-width="4"
       text-align="center"
       text-anchor="middle"
       id="tspan200">6</tspan></text>
  <text
     x="182.63477"
     y="713.32983"
     color="#000000"
     color-rendering="auto"
     image-rendering="auto"
     text-align="center"
     style="font-weight:bold;font-size:29.333px;line-height:110%;font-family:Cantarell;font-variant-ligatures:normal;font-variant-caps:normal;font-variant-numeric:normal;font-feature-settings:normal;text-anchor:middle;fill:#ffffff;stroke-width:4;stroke-linecap:round;shape-rendering:auto;text-rendering:auto"
     xml:space="preserve"
     id="text206"><tspan
       x="182.63477"
       y="713.32983"
       fill="#ffffff"
       font-family="Cantarell"
       font-size="29.333px"
       font-weight="bold"
       stroke-width="4"
       text-align="center"
       text-anchor="middle"
       id="tspan204">7</tspan></text>
  <text
     x="276.23264"
     y="713.32983"
     color="#000000"
     color-rendering="auto"
     image-rendering="auto"
     text-align="center"
     style="font-weight:bold;font-size:29.333px;line-height:110%;font-family:Cantarell;font-variant-ligatures:normal;font-variant-caps:normal;font-variant-numeric:normal;font-feature-settings:normal;text-anchor:middle;fill:#ffffff;stroke-width:4;stroke-linecap:round;shape-rendering:auto;text-rendering:auto"
     xml:space="preserve"
     id="text210"><tspan
       x="276.23264"
       y="713.32983"
       fill="#ffffff"
       font-family="Cantarell"
       font-size="29.333px"
       font-weight="bold"
       stroke-width="4"
       text-align="center"
       text-anchor="middle"
       id="tspan208">8</tspan></text>
  <text
     x="362.89865"
     y="713.32983"
     color="#000000"
     color-rendering="auto"
     image-rendering="auto"
     text-align="center"
     style="font-weight:bold;font-size:29.333px;line-height:110%;font-family:Cantarell;font-variant-ligatures:normal;font-variant-caps:normal;font-variant-numeric:normal;font-feature-settings:normal;text-anchor:middle;fill:#ffffff;stroke-width:4;stroke-linecap:round;shape-rendering:auto;text-rendering:auto"
     xml:space="preserve"
     id="text214"><tspan
       x="362.89865"
       y="713.32983"
       fill="#ffffff"
       font-family="Cantarell"
       font-size="29.333px"
       font-weight="bold"
       stroke-width="4"
       text-align="center"
       text-anchor="middle"
       id="tspan212">9</tspan></text>
  <text
     x="276.23264"
     y="786.6626"
     color="#000000"
     color-rendering="auto"
     image-rendering="auto"
     text-align="center"
     style="font-weight:bold;font-size:29.333px;line-height:110%;font-family:Cantarell;font-variant-ligatures:normal;font-variant-caps:normal;font-variant-numeric:normal;font-feature-settings:normal;text-anchor:middle;fill:#ffffff;stroke-width:4;stroke-linecap:round;shape-rendering:auto;text-rendering:auto"
     xml:space="preserve"
     id="text218"><tspan
       x="276.23264"
       y="786.6626"
       fill="#ffffff"
       font-family="Cantarell"
       font-size="29.333px"
       font-weight="bold"
       stroke-width="4"
       text-align="center"
       text-anchor="middle"
       id="tspan216">0</tspan></text>
  <text
     x="275.32834"
     y="437.33356"
     color="#000000"
     color-rendering="auto"
     font-size="24px"
     image-rendering="auto"
     text-align="center"
     style="line-height:110%;font-family:Cantarell;font-variant-ligatures:normal;font-variant-caps:normal;font-variant-numeric:normal;font-feature-settings:normal;text-anchor:middle;fill:#ffffff;stroke-width:4;stroke-linecap:round;shape-rendering:auto;text-rendering:auto"
     xml:space="preserve"
     id="text224"><tspan
       x="275.32834"
       y="437.33356"
       fill="#ffffff"
       font-family="Cantarell"
       font-size="24px"
       stroke-width="4"
       text-align="center"
       text-anchor="middle"
       style="font-variant-ligatures:normal;font-variant-caps:normal;font-variant-numeric:normal;font-feature-settings:normal"
       id="tspan222">Insert your passcode</tspan></text>
  <path
     d="m 357.70009,768.31996 -9,9 9,9 h 13.55295 c 0.79549,-0.0331 1.44705,-0.73765 1.44705,-1.5 v -15 c 0,-0.79619 -0.51842,-1.5 -1.51335,-1.5 z m 1.5,4.5 h 1.5 c 0.0156,-1.8e-4 0.0312,-6.9e-4 0.047,0 0.38242,0.0168 0.7648,0.19287 1.03125,0.46875 l 1.9218,1.9218 1.96875,-1.9218 c 0.39843,-0.34575 0.67,-0.45825 1.03125,-0.46875 h 1.5 v 1.5 c 0,0.42971 -0.0514,0.82597 -0.375,1.125 l -1.9218,1.9218 1.875,1.875 c 0.28228,0.28226 0.42186,0.68018 0.42187,1.07812 v 1.5 h -1.5 c -0.39795,-10e-6 -0.79588,-0.13964 -1.07812,-0.42187 l -1.9218,-1.9218 -1.9218,1.9218 c -0.28224,0.28228 -0.68019,0.42187 -1.07813,0.42187 h -1.5 v -1.5 c 0,-0.39793 0.13965,-0.79586 0.42188,-1.07812 l 1.9218,-1.875 -1.9218,-1.9218 c -0.31611,-0.29195 -0.45474,-0.70388 -0.42188,-1.125 z"
     color="#000000"
     fill="#ffffff"
     id="path228"
     style="stroke-width:1.00001" />
  <rect
     width="24"
     height="24"
     color="#bebebe"
     enable-background="new"
     fill="none"
     id="rect230"
     x="348.70007"
     y="765.31995"
     style="stroke-width:1.00001" />
  <rect
     x="210.60013"
     y="828.99994"
     width="130.67"
     height="50"
     rx="25"
     ry="25"
     fill="#282828"
     id="rect234" />
  <text
     x="275.42288"
     y="860.49261"
     color="#000000"
     color-rendering="auto"
     fill="#ffffff"
     font-family="Cantarell"
     font-size="16px"
     image-rendering="auto"
     shape-rendering="auto"
     stroke-linecap="round"
     stroke-width="4"
     text-align="center"
     text-anchor="middle"
     text-rendering="auto"
     style="line-height:110%;font-variant-ligatures:normal;font-variant-caps:normal;font-variant-numeric:normal;font-feature-settings:normal"
     xml:space="preserve"
     id="text238"><tspan
       x="275.42288"
       y="860.49261"
       fill="#ffffff"
       font-family="Cantarell"
       font-size="16px"
       font-weight="bold"
       stroke-width="4"
       text-align="center"
       text-anchor="middle"
       style="font-variant-ligatures:normal;font-variant-caps:normal;font-variant-numeric:normal;font-feature-settings:normal"
       id="tspan236">Unlock</tspan></text>
  <text
     x="275.36008"
     y="916.47742"
     color="#000000"
     color-rendering="auto"
     fill="#ffffff"
     font-family="Cantarell"
     font-size="13.333px"
     image-rendering="auto"
     shape-rendering="auto"
     stroke-linecap="round"
     stroke-width="4"
     text-align="center"
     text-anchor="middle"
     text-rendering="auto"
     style="line-height:110%;font-variant-ligatures:normal;font-variant-caps:normal;font-variant-numeric:normal;font-feature-settings:normal"
     xml:space="preserve"
     id="text328"><tspan
       x="275.36008"
       y="916.47742"
       fill="#ffffff"
       font-family="Cantarell"
       font-size="13.333px"
       stroke-width="4"
       text-align="center"
       text-anchor="middle"
       style="font-variant-ligatures:normal;font-variant-caps:normal;font-variant-numeric:normal;font-feature-settings:normal"
       id="tspan326">Emergency</tspan></text>
  <rect
     x="576"
     y="224"
     width="360"
     height="720"
     id="rect396"
     style="fill:#000000" />
  <rect
     x="626"
     y="318.12"
     width="260"
     height="44"
     rx="5"
     ry="5"
     color="#000000"
     color-rendering="auto"
     fill="#282828"
     image-rendering="auto"
     shape-rendering="auto"
     solid-color="#000000"
     stroke="#282828"
     stroke-linecap="square"
     stroke-width="2"
     style="isolation:auto;mix-blend-mode:normal;fill:#282828;stroke:#3584e4;fill-opacity:1"
     id="rect398" />
  <text
     x="755.72107"
     y="347.17322"
     fill="#ffffff"
     font-family="Cantarell"
     font-size="21.333px"
     letter-spacing="0px"
     text-align="center"
     text-anchor="middle"
     word-spacing="0px"
     style="line-height:0%;fill:#ffffff"
     xml:space="preserve"
     id="text402"><tspan
       x="755.72107"
       y="347.17322"
       fill="#ffffff"
       font-family="Cantarell"
       font-size="21.333px"
       text-align="center"
       text-anchor="middle"
       style="line-height:1.25;fill:#ffffff"
       id="tspan400">911</tspan></text>
  <path
     d="m 772.99997,326.74996 v 27"
     fill="none"
     stroke="#ffffff"
     stroke-width="1px"
     id="path406"
     style="fill:none;stroke:#000000;opacity:0.2" />
  <g
     id="g3891"
     style="fill:#f6f5f4;stroke:#f6f5f4"
     transform="translate(7.999878,-128)">
    <rect
       x="807.6001"
       y="761.61987"
       width="66.43"
       height="66.002998"
       rx="1111"
       ry="1111"
       color="#000000"
       color-rendering="auto"
       image-rendering="auto"
       solid-color="#000000"
       style="isolation:auto;mix-blend-mode:normal;fill:#282828;stroke:#282828;stroke-linecap:square;shape-rendering:auto;fill-opacity:1;stroke-opacity:1"
       id="rect464" />
    <rect
       x="622.80011"
       y="761.61987"
       width="66.230003"
       height="66.002998"
       rx="1111"
       ry="1111"
       color="#000000"
       color-rendering="auto"
       image-rendering="auto"
       solid-color="#000000"
       style="isolation:auto;mix-blend-mode:normal;fill:#282828;stroke:#282828;stroke-linecap:square;shape-rendering:auto;fill-opacity:1;stroke-opacity:1"
       id="rect466" />
    <rect
       x="807.6001"
       y="682.61987"
       width="66.43"
       height="66.002998"
       rx="1111"
       ry="1111"
       color="#000000"
       color-rendering="auto"
       image-rendering="auto"
       solid-color="#000000"
       style="isolation:auto;mix-blend-mode:normal;fill:#282828;stroke:#282828;stroke-linecap:square;shape-rendering:auto;fill-opacity:1;stroke-opacity:1"
       id="rect468" />
    <rect
       x="714.6001"
       y="682.61987"
       width="66.428001"
       height="66.002998"
       rx="1111"
       ry="1111"
       color="#000000"
       color-rendering="auto"
       image-rendering="auto"
       solid-color="#000000"
       style="isolation:auto;mix-blend-mode:normal;fill:#282828;stroke:#282828;stroke-linecap:square;shape-rendering:auto;fill-opacity:1;stroke-opacity:1"
       id="rect470" />
    <rect
       x="622.80011"
       y="682.61987"
       width="66.230003"
       height="66.002998"
       rx="1111"
       ry="1111"
       color="#000000"
       color-rendering="auto"
       image-rendering="auto"
       solid-color="#000000"
       style="isolation:auto;mix-blend-mode:normal;fill:#282828;stroke:#282828;stroke-linecap:square;shape-rendering:auto;fill-opacity:1;stroke-opacity:1"
       id="rect472" />
    <rect
       x="714.6001"
       y="761.61987"
       width="66.428001"
       height="66.002998"
       rx="1111"
       ry="1111"
       color="#000000"
       color-rendering="auto"
       image-rendering="auto"
       solid-color="#000000"
       style="isolation:auto;mix-blend-mode:normal;fill:#282828;stroke:#282828;stroke-linecap:square;shape-rendering:auto;fill-opacity:1;stroke-opacity:1"
       id="rect474" />
    <rect
       x="807.6001"
       y="603.61993"
       width="66.43"
       height="66.002998"
       rx="1111"
       ry="1111"
       color="#000000"
       color-rendering="auto"
       image-rendering="auto"
       solid-color="#000000"
       style="isolation:auto;mix-blend-mode:normal;fill:#282828;stroke:#282828;stroke-linecap:square;shape-rendering:auto;fill-opacity:1;stroke-opacity:1"
       id="rect476" />
    <rect
       x="714.6001"
       y="603.61993"
       width="66.428001"
       height="66.002998"
       rx="1111"
       ry="1111"
       color="#000000"
       color-rendering="auto"
       image-rendering="auto"
       solid-color="#000000"
       style="isolation:auto;mix-blend-mode:normal;fill:#282828;stroke:#282828;stroke-linecap:square;shape-rendering:auto;fill-opacity:1;stroke-opacity:1"
       id="rect478" />
    <rect
       x="622.80011"
       y="603.61993"
       width="66.230003"
       height="66.002998"
       rx="1111"
       ry="1111"
       color="#000000"
       color-rendering="auto"
       image-rendering="auto"
       solid-color="#000000"
       style="isolation:auto;mix-blend-mode:normal;fill:#282828;stroke:#282828;stroke-linecap:square;shape-rendering:auto;fill-opacity:1;stroke-opacity:1"
       id="rect480" />
    <rect
       x="807.6001"
       y="524.61993"
       width="66.43"
       height="66.002998"
       rx="1111"
       ry="1111"
       color="#000000"
       color-rendering="auto"
       image-rendering="auto"
       solid-color="#000000"
       style="isolation:auto;mix-blend-mode:normal;fill:#282828;stroke:#282828;stroke-linecap:square;shape-rendering:auto;fill-opacity:1;stroke-opacity:1"
       id="rect482" />
    <rect
       x="714.6001"
       y="524.61993"
       width="66.428001"
       height="66.002998"
       rx="1111"
       ry="1111"
       color="#000000"
       color-rendering="auto"
       image-rendering="auto"
       solid-color="#000000"
       style="isolation:auto;mix-blend-mode:normal;fill:#282828;stroke:#282828;stroke-linecap:square;shape-rendering:auto;fill-opacity:1;stroke-opacity:1"
       id="rect484" />
    <rect
       x="622.80011"
       y="524.61993"
       width="66.230003"
       height="66.002998"
       rx="1111"
       ry="1111"
       color="#000000"
       color-rendering="auto"
       image-rendering="auto"
       solid-color="#000000"
       style="isolation:auto;mix-blend-mode:normal;fill:#282828;stroke:#282828;stroke-linecap:square;shape-rendering:auto;fill-opacity:1;stroke-opacity:1"
       id="rect486" />
  </g>
  <g
     id="g4102"
     style="fill:#ffffff"
     transform="translate(7.999878,-128)">
    <g
       id="g4059"
       style="fill:#ffffff">
      <text
         x="655.91779"
         y="561.12213"
         color="#000000"
         color-rendering="auto"
         font-size="29.333px"
         font-weight="bold"
         image-rendering="auto"
         text-align="center"
         style="line-height:110%;font-family:Cantarell;font-variant-ligatures:normal;font-variant-caps:normal;font-variant-numeric:normal;font-feature-settings:normal;text-anchor:middle;fill:#ffffff;stroke-linecap:round;stroke-linejoin:round;shape-rendering:auto;text-rendering:auto"
         xml:space="preserve"
         id="text492"><tspan
           x="655.91779"
           y="561.12213"
           fill="#ffffff"
           font-size="29.333px"
           id="tspan490"
           style="fill:#ffffff">1</tspan></text>
      <text
         x="747.91919"
         y="561.12213"
         color="#000000"
         color-rendering="auto"
         font-size="29.333px"
         font-weight="bold"
         image-rendering="auto"
         text-align="center"
         style="line-height:110%;font-family:Cantarell;font-variant-ligatures:normal;font-variant-caps:normal;font-variant-numeric:normal;font-feature-settings:normal;text-anchor:middle;fill:#ffffff;stroke-linecap:round;stroke-linejoin:round;shape-rendering:auto;text-rendering:auto"
         xml:space="preserve"
         id="text496"><tspan
           x="747.91919"
           y="561.12213"
           fill="#ffffff"
           font-size="29.333px"
           id="tspan494"
           style="fill:#ffffff">2</tspan></text>
      <text
         x="747.91919"
         y="575.12164"
         color="#000000"
         color-rendering="auto"
         font-size="10.667px"
         image-rendering="auto"
         text-align="center"
         style="line-height:110%;font-family:Cantarell;font-variant-ligatures:normal;font-variant-caps:normal;font-variant-numeric:normal;font-feature-settings:normal;text-anchor:middle;fill:#ffffff;stroke-linecap:round;stroke-linejoin:round;shape-rendering:auto;text-rendering:auto"
         xml:space="preserve"
         id="text500"><tspan
           x="747.91919"
           y="575.12164"
           fill="#ffffff"
           font-family="Cantarell"
           font-size="10.667px"
           id="tspan498"
           style="fill:#ffffff">ABC</tspan></text>
      <text
         x="839.92072"
         y="561.12213"
         color="#000000"
         color-rendering="auto"
         font-size="29.333px"
         font-weight="bold"
         image-rendering="auto"
         text-align="center"
         style="line-height:110%;font-family:Cantarell;font-variant-ligatures:normal;font-variant-caps:normal;font-variant-numeric:normal;font-feature-settings:normal;text-anchor:middle;fill:#ffffff;stroke-linecap:round;stroke-linejoin:round;shape-rendering:auto;text-rendering:auto"
         xml:space="preserve"
         id="text504"><tspan
           x="839.92072"
           y="561.12213"
           fill="#ffffff"
           font-size="29.333px"
           id="tspan502"
           style="fill:#ffffff">3</tspan></text>
      <text
         x="839.92072"
         y="575.12164"
         color="#000000"
         color-rendering="auto"
         font-size="10.667px"
         image-rendering="auto"
         text-align="center"
         style="line-height:110%;font-family:Cantarell;font-variant-ligatures:normal;font-variant-caps:normal;font-variant-numeric:normal;font-feature-settings:normal;text-anchor:middle;fill:#ffffff;stroke-linecap:round;stroke-linejoin:round;shape-rendering:auto;text-rendering:auto"
         xml:space="preserve"
         id="text508"><tspan
           x="839.92072"
           y="575.12164"
           fill="#ffffff"
           font-family="Cantarell"
           font-size="10.667px"
           id="tspan506"
           style="fill:#ffffff">DEF</tspan></text>
      <text
         x="655.91779"
         y="641.12109"
         color="#000000"
         color-rendering="auto"
         font-size="29.333px"
         font-weight="bold"
         image-rendering="auto"
         text-align="center"
         style="line-height:110%;font-family:Cantarell;font-variant-ligatures:normal;font-variant-caps:normal;font-variant-numeric:normal;font-feature-settings:normal;text-anchor:middle;fill:#ffffff;stroke-linecap:round;stroke-linejoin:round;shape-rendering:auto;text-rendering:auto"
         xml:space="preserve"
         id="text512"><tspan
           x="655.91779"
           y="641.12109"
           fill="#ffffff"
           font-size="29.333px"
           id="tspan510"
           style="fill:#ffffff">4</tspan></text>
      <text
         x="655.91779"
         y="655.12158"
         color="#000000"
         color-rendering="auto"
         font-size="10.667px"
         image-rendering="auto"
         text-align="center"
         style="line-height:110%;font-family:Cantarell;font-variant-ligatures:normal;font-variant-caps:normal;font-variant-numeric:normal;font-feature-settings:normal;text-anchor:middle;fill:#ffffff;stroke-linecap:round;stroke-linejoin:round;shape-rendering:auto;text-rendering:auto"
         xml:space="preserve"
         id="text516"><tspan
           x="655.91779"
           y="655.12158"
           fill="#ffffff"
           font-family="Cantarell"
           font-size="10.667px"
           id="tspan514"
           style="fill:#ffffff">GHI</tspan></text>
      <text
         x="747.91919"
         y="641.12109"
         color="#000000"
         color-rendering="auto"
         font-size="29.333px"
         font-weight="bold"
         image-rendering="auto"
         text-align="center"
         style="line-height:110%;font-family:Cantarell;font-variant-ligatures:normal;font-variant-caps:normal;font-variant-numeric:normal;font-feature-settings:normal;text-anchor:middle;fill:#ffffff;stroke-linecap:round;stroke-linejoin:round;shape-rendering:auto;text-rendering:auto"
         xml:space="preserve"
         id="text520"><tspan
           x="747.91919"
           y="641.12109"
           fill="#ffffff"
           font-size="29.333px"
           id="tspan518"
           style="fill:#ffffff">5</tspan></text>
      <text
         x="747.91919"
         y="655.12158"
         color="#000000"
         color-rendering="auto"
         font-size="10.667px"
         image-rendering="auto"
         text-align="center"
         style="line-height:110%;font-family:Cantarell;font-variant-ligatures:normal;font-variant-caps:normal;font-variant-numeric:normal;font-feature-settings:normal;text-anchor:middle;fill:#ffffff;stroke-linecap:round;stroke-linejoin:round;shape-rendering:auto;text-rendering:auto"
         xml:space="preserve"
         id="text524"><tspan
           x="747.91919"
           y="655.12158"
           fill="#ffffff"
           font-family="Cantarell"
           font-size="10.667px"
           id="tspan522"
           style="fill:#ffffff">JKL</tspan></text>
      <text
         x="839.92072"
         y="641.12109"
         color="#000000"
         color-rendering="auto"
         font-size="29.333px"
         font-weight="bold"
         image-rendering="auto"
         text-align="center"
         style="line-height:110%;font-family:Cantarell;font-variant-ligatures:normal;font-variant-caps:normal;font-variant-numeric:normal;font-feature-settings:normal;text-anchor:middle;fill:#ffffff;stroke-linecap:round;stroke-linejoin:round;shape-rendering:auto;text-rendering:auto"
         xml:space="preserve"
         id="text528"><tspan
           x="839.92072"
           y="641.12109"
           fill="#ffffff"
           font-size="29.333px"
           id="tspan526"
           style="fill:#ffffff">6</tspan></text>
      <text
         x="839.92072"
         y="655.12158"
         color="#000000"
         color-rendering="auto"
         font-size="10.667px"
         image-rendering="auto"
         text-align="center"
         style="line-height:110%;font-family:Cantarell;font-variant-ligatures:normal;font-variant-caps:normal;font-variant-numeric:normal;font-feature-settings:normal;text-anchor:middle;fill:#ffffff;stroke-linecap:round;stroke-linejoin:round;shape-rendering:auto;text-rendering:auto"
         xml:space="preserve"
         id="text532"><tspan
           x="839.92072"
           y="655.12158"
           fill="#ffffff"
           font-family="Cantarell"
           font-size="10.667px"
           id="tspan530"
           style="fill:#ffffff">MNO</tspan></text>
      <text
         x="655.91779"
         y="720.12109"
         color="#000000"
         color-rendering="auto"
         font-size="29.333px"
         font-weight="bold"
         image-rendering="auto"
         text-align="center"
         style="line-height:110%;font-family:Cantarell;font-variant-ligatures:normal;font-variant-caps:normal;font-variant-numeric:normal;font-feature-settings:normal;text-anchor:middle;fill:#ffffff;stroke-linecap:round;stroke-linejoin:round;shape-rendering:auto;text-rendering:auto"
         xml:space="preserve"
         id="text536"><tspan
           x="655.91779"
           y="720.12109"
           fill="#ffffff"
           font-size="29.333px"
           id="tspan534"
           style="fill:#ffffff">7</tspan></text>
      <text
         x="655.91779"
         y="734.12109"
         color="#000000"
         color-rendering="auto"
         font-size="10.667px"
         image-rendering="auto"
         text-align="center"
         style="line-height:110%;font-family:Cantarell;font-variant-ligatures:normal;font-variant-caps:normal;font-variant-numeric:normal;font-feature-settings:normal;text-anchor:middle;fill:#ffffff;stroke-linecap:round;stroke-linejoin:round;shape-rendering:auto;text-rendering:auto"
         xml:space="preserve"
         id="text540"><tspan
           x="655.91779"
           y="734.12109"
           fill="#ffffff"
           font-family="Cantarell"
           font-size="10.667px"
           id="tspan538"
           style="fill:#ffffff">PQRS</tspan></text>
      <text
         x="747.91919"
         y="720.12109"
         color="#000000"
         color-rendering="auto"
         font-size="29.333px"
         font-weight="bold"
         image-rendering="auto"
         text-align="center"
         style="line-height:110%;font-family:Cantarell;font-variant-ligatures:normal;font-variant-caps:normal;font-variant-numeric:normal;font-feature-settings:normal;text-anchor:middle;fill:#ffffff;stroke-linecap:round;stroke-linejoin:round;shape-rendering:auto;text-rendering:auto"
         xml:space="preserve"
         id="text544"><tspan
           x="747.91919"
           y="720.12109"
           fill="#ffffff"
           font-size="29.333px"
           id="tspan542"
           style="fill:#ffffff">8</tspan></text>
      <text
         x="747.91919"
         y="734.12109"
         color="#000000"
         color-rendering="auto"
         font-size="10.667px"
         image-rendering="auto"
         text-align="center"
         style="line-height:110%;font-family:Cantarell;font-variant-ligatures:normal;font-variant-caps:normal;font-variant-numeric:normal;font-feature-settings:normal;text-anchor:middle;fill:#ffffff;stroke-linecap:round;stroke-linejoin:round;shape-rendering:auto;text-rendering:auto"
         xml:space="preserve"
         id="text548"><tspan
           x="747.91919"
           y="734.12109"
           fill="#ffffff"
           font-family="Cantarell"
           font-size="10.667px"
           id="tspan546"
           style="fill:#ffffff">TUV</tspan></text>
      <text
         x="839.92072"
         y="720.12109"
         color="#000000"
         color-rendering="auto"
         font-size="29.333px"
         font-weight="bold"
         image-rendering="auto"
         text-align="center"
         style="line-height:110%;font-family:Cantarell;font-variant-ligatures:normal;font-variant-caps:normal;font-variant-numeric:normal;font-feature-settings:normal;text-anchor:middle;fill:#ffffff;stroke-linecap:round;stroke-linejoin:round;shape-rendering:auto;text-rendering:auto"
         xml:space="preserve"
         id="text552"><tspan
           x="839.92072"
           y="720.12109"
           fill="#ffffff"
           font-size="29.333px"
           id="tspan550"
           style="fill:#ffffff">9</tspan></text>
      <text
         x="839.92072"
         y="734.12109"
         color="#000000"
         color-rendering="auto"
         font-size="10.667px"
         image-rendering="auto"
         text-align="center"
         style="line-height:110%;font-family:Cantarell;font-variant-ligatures:normal;font-variant-caps:normal;font-variant-numeric:normal;font-feature-settings:normal;text-anchor:middle;fill:#ffffff;stroke-linecap:round;stroke-linejoin:round;shape-rendering:auto;text-rendering:auto"
         xml:space="preserve"
         id="text556"><tspan
           x="839.92072"
           y="734.12109"
           fill="#ffffff"
           font-family="Cantarell"
           font-size="10.667px"
           id="tspan554"
           style="fill:#ffffff">WXYZ</tspan></text>
      <text
         x="747.91919"
         y="799.12012"
         color="#000000"
         color-rendering="auto"
         font-size="29.333px"
         font-weight="bold"
         image-rendering="auto"
         text-align="center"
         style="line-height:110%;font-family:Cantarell;font-variant-ligatures:normal;font-variant-caps:normal;font-variant-numeric:normal;font-feature-settings:normal;text-anchor:middle;fill:#ffffff;stroke-linecap:round;stroke-linejoin:round;shape-rendering:auto;text-rendering:auto"
         xml:space="preserve"
         id="text560"><tspan
           x="747.91919"
           y="799.12012"
           fill="#ffffff"
           font-size="29.333px"
           id="tspan558"
           style="fill:#ffffff">0</tspan></text>
      <path
         d="m 654.80009,786.70996 0.325,6.6661 -5.373,-3.8321 -1.0703,1.6328 5.9198,3.4102 -5.9493,3.375 1.0178,1.6309 5.455,-3.8321 -0.325,6.7403 h 0.2645 1.6679 l -0.2796,-6.7032 5.6016,3.9063 1.0174,-1.6328 -6.1542,-3.5137 6.1251,-3.2188 -1.0253,-1.6386 -5.5646,3.6972 0.2796,-6.6875 z"
         color="#000000"
         color-rendering="auto"
         fill="#ffffff"
         image-rendering="auto"
         style="font-variant-ligatures:normal;font-variant-caps:normal;font-variant-numeric:normal;font-feature-settings:normal;fill:#ffffff;shape-rendering:auto"
         id="path564" />
      <text
         x="747.92389"
         y="813.41382"
         color="#000000"
         color-rendering="auto"
         fill="#ffffff"
         font-family="Cantarell"
         font-size="10.667px"
         image-rendering="auto"
         stroke-linecap="round"
         stroke-linejoin="round"
         text-align="center"
         text-anchor="middle"
         text-rendering="auto"
         style="line-height:110%;font-variant-ligatures:normal;font-variant-caps:normal;font-variant-numeric:normal;font-feature-settings:normal;fill:#ffffff;shape-rendering:auto"
         xml:space="preserve"
         id="text568"><tspan
           x="747.92389"
           y="813.41382"
           fill="#ffffff"
           font-family="Cantarell"
           font-size="10.667px"
           id="tspan566"
           style="fill:#ffffff">+</tspan></text>
      <path
         d="m 836.92599,802.91102 h 1.6561 v -4.34416 h 4.464 v 4.34416 h 1.6558 v -4.34416 h 3.0962 v -1.51199 h -3.0962 v -4.99196 h 3.0962 v -1.51199 h -3.0962 v -4.29578 h -1.6558 v 4.29578 h -4.464 v -4.29578 h -1.6561 v 4.29578 h -3.168 v 1.51199 h 3.168 v 4.99196 h -3.168 v 1.51199 h 3.168 z m 1.6561,-5.85596 v -4.99197 h 4.464 v 4.99197 z"
         fill="#ffffff"
         id="path570"
         style="color:#000000;font-variant-ligatures:normal;font-variant-caps:normal;font-variant-numeric:normal;font-feature-settings:normal;fill:#ffffff;stroke-width:3.7795;stroke-linecap:round;stroke-linejoin:round;color-rendering:auto;image-rendering:auto;shape-rendering:auto" />
    </g>
  </g>
  <rect
     x="696.5"
     y="734.61987"
     width="119"
     height="64"
     rx="32"
     ry="32"
     color="#000000"
     color-rendering="auto"
     fill="#3584e4"
     image-rendering="auto"
     shape-rendering="auto"
     solid-color="#000000"
     stroke="#3584e4"
     stroke-linecap="square"
     style="isolation:auto;mix-blend-mode:normal;fill:#3584e4;stroke:#3584e4"
     id="rect680" />
  <rect
     x="739.99896"
     y="750.58997"
     width="32"
     height="32"
     color="#bebebe"
     fill="none"
     id="rect682" />
  <path
     d="m 760.29897,753.08996 c -1.108,0 -2,0.892 -2,2 v 6 c 0,1.108 0.892,2 2,2 h 1.422 a 13.944,13.944 0 0 1 -9.42,9.42 v -1.42 c 0,-1.108 -0.894,-2 -2,-2 h -6 c -1.11,0 -2,0.892 -2,2 v 3 a 5,5 0 0 0 5,5 h 1 c 11.008,0 20,-8.99 20,-20 v -1 a 5,5 0 0 0 -5,-5 z"
     color="#000000"
     fill="#ffffff"
     font-family="sans-serif"
     font-weight="400"
     overflow="visible"
     style="font-variant-ligatures:normal;font-variant-position:normal;font-variant-caps:normal;font-variant-numeric:normal;font-variant-alternates:normal;font-feature-settings:normal;text-indent:0;text-decoration-line:none;text-decoration-style:solid;text-decoration-color:#000000;text-transform:none;text-orientation:mixed;shape-padding:0;isolation:auto;mix-blend-mode:normal"
     id="path684" />
  <text
     font-family="sans-serif"
     font-size="1e-32px"
     letter-spacing="0px"
     word-spacing="0px"
     style="line-height:1px;white-space:pre;shape-inside:url(#rect2805)"
     xml:space="preserve"
     id="text688"
     transform="translate(-2663.8999,108.69)" />
  <g
     id="g246030"
     transform="translate(52)">
    <rect
       x="624.5"
       y="864.61987"
       width="159"
       height="39"
       rx="20"
       ry="20"
       color="#000000"
       color-rendering="auto"
       fill="#3584e4"
       image-rendering="auto"
       shape-rendering="auto"
       solid-color="#000000"
       stroke="#3584e4"
       stroke-linecap="square"
       style="isolation:auto;mix-blend-mode:normal;fill:#e01b24;stroke:#e01b24;stroke-width:1"
       id="rect4696" />
    <text
       x="703.70667"
       y="888.94788"
       font-family="Cantarell"
       font-size="10.667px"
       font-weight="bold"
       letter-spacing="0px"
       text-align="center"
       text-anchor="middle"
       word-spacing="0px"
       style="font-size:14.6667px;line-height:125%;fill:#ffffff"
       xml:space="preserve"
       id="text4530"><tspan
         x="703.70667"
         y="888.94788"
         fill="#e5e5e5"
         font-family="Cantarell"
         font-weight="normal"
         id="tspan4528"
         style="font-style:normal;font-variant:normal;font-weight:bold;font-stretch:normal;font-size:14.6667px;font-family:Cantarell;-inkscape-font-specification:'Cantarell Bold';fill:#ffffff">Emergency Info</tspan></text>
  </g>
  <g
     id="g117792"
     transform="translate(48.736941,-124)"
     style="fill:#ffffff">
    <text
       x="1170.951"
       y="387.2937"
       color="#000000"
       color-rendering="auto"
       fill="#ff6363"
       font-family="Cantarell"
       font-size="22.898px"
       image-rendering="auto"
       shape-rendering="auto"
       stroke-linecap="round"
       stroke-width="6.8694"
       text-align="center"
       text-anchor="middle"
       text-rendering="auto"
       style="font-size:16px;line-height:110%;font-variant-ligatures:normal;font-variant-caps:normal;font-variant-numeric:normal;font-feature-settings:normal;fill:#ffffff"
       xml:space="preserve"
       id="text364"><tspan
         x="1170.951"
         y="387.2937"
         fill="#ff6363"
         font-family="Cantarell"
         font-size="22.898px"
         font-weight="800"
         stroke-width="6.8694"
         text-align="center"
         text-anchor="middle"
         style="font-style:normal;font-variant:normal;font-weight:bold;font-stretch:normal;font-size:16px;font-family:Cantarell;-inkscape-font-specification:'Cantarell Bold';font-variant-ligatures:normal;font-variant-caps:normal;font-variant-numeric:normal;font-feature-settings:normal;fill:#ffffff"
         id="tspan362">Emergency Info</tspan></text>
    <g
       aria-label="*"
       id="g11037-3"
       style="font-size:98.3726px;font-family:Cantarell;text-align:center;letter-spacing:0.69408px;word-spacing:0px;text-anchor:middle;fill:#ffffff;stroke:none;stroke-width:7.97857"
       transform="matrix(0.32879831,0,0,0.32879831,399.08064,195.56947)" />
  </g>
  <text
     x="1215.5361"
     y="317.70068"
     fill="#ffffff"
     font-family="Cantarell"
     font-size="24px"
     font-weight="800"
     letter-spacing="0px"
     text-align="center"
     text-anchor="middle"
     word-spacing="0px"
     style="line-height:0%;text-align:center;text-anchor:middle;fill:#ffffff"
     xml:space="preserve"
     id="text370"><tspan
       x="1219.952"
       y="317.70068"
       fill="#ffffff"
       font-family="Cantarell"
       font-size="24px"
       font-weight="800"
       style="line-height:1.25;text-align:center;text-anchor:middle;fill:#ffffff"
       id="tspan368">Owner Name</tspan></text>
  <rect
     x="1055.9999"
     y="380"
     width="328.00012"
     height="437.35922"
     rx="9"
     ry="9"
     fill="#3e3d41"
     stroke="#1c1c1c"
     stroke-linecap="square"
     id="rect372"
     style="fill:#282828;fill-opacity:1;stroke:#282828;stroke-width:0.999996;stroke-opacity:1" />
  <text
     x="1070.5554"
     y="572.28711"
     fill="#e5e5e5"
     font-size="14.667px"
     style="font-style:normal;font-variant:normal;font-weight:normal;font-stretch:normal;font-size:12px;line-height:0%;font-family:Cantarell;-inkscape-font-specification:Cantarell;letter-spacing:0px;word-spacing:0px;fill:#c0bfbc"
     xml:space="preserve"
     id="text380"><tspan
       x="1070.5554"
       y="572.28711"
       fill="#e5e5e5"
       font-size="14.667px"
       style="font-style:normal;font-variant:normal;font-weight:normal;font-stretch:normal;font-size:12px;line-height:1.25;font-family:Cantarell;-inkscape-font-specification:Cantarell;fill:#c0bfbc"
       id="tspan378">Allergies &amp; Reactions</tspan></text>
  <text
     x="1070.5554"
     y="632.61725"
     fill="#e5e5e5"
     font-size="14.667px"
     style="font-style:normal;font-variant:normal;font-weight:normal;font-stretch:normal;font-size:12px;line-height:0%;font-family:Cantarell;-inkscape-font-specification:Cantarell;letter-spacing:0px;word-spacing:0px;fill:#c0bfbc"
     xml:space="preserve"
     id="text384"><tspan
       x="1070.5554"
       y="632.61725"
       fill="#e5e5e5"
       font-size="14.667px"
       style="font-style:normal;font-variant:normal;font-weight:normal;font-stretch:normal;font-size:12px;line-height:1.25;font-family:Cantarell;-inkscape-font-specification:Cantarell;fill:#c0bfbc"
       id="tspan382">Medical Conditions</tspan></text>
  <text
     x="1041.6791"
     y="596.28711"
     fill="#888a85"
     font-size="13.75px"
     text-align="end"
     text-anchor="end"
     style="font-style:normal;font-variant:normal;font-weight:bold;font-stretch:normal;line-height:125%;font-family:Cantarell;-inkscape-font-specification:'Cantarell Bold';letter-spacing:0px;word-spacing:0px;fill:#ffffff"
     xml:space="preserve"
     id="text388"><tspan
       x="1071.0491"
       y="596.28711"
       id="tspan386"
       style="font-style:normal;font-variant:normal;font-weight:normal;font-stretch:normal;font-family:Cantarell;-inkscape-font-specification:'Cantarell Bold';text-align:start;text-anchor:start;fill:#ffffff">Peanuts, fish, Name of Medication</tspan></text>
  <text
     x="-3259.604"
     y="637.18829"
     fill="#888a85"
     font-size="13.75px"
     text-align="end"
     text-anchor="end"
     style="font-style:normal;font-variant:normal;font-weight:bold;font-stretch:normal;line-height:125%;font-family:Cantarell;-inkscape-font-specification:'Cantarell Bold';letter-spacing:0px;word-spacing:0px;fill:#ffffff"
     xml:space="preserve"
     id="text392"><tspan
       x="1109.0491"
       y="637.18829"
       id="tspan390"
       style="font-style:normal;font-variant:normal;font-weight:bold;font-stretch:normal;font-family:Cantarell;-inkscape-font-specification:'Cantarell Bold';text-align:start;text-anchor:start;fill:#ffffff" /></text>
  <flowRoot
     transform="translate(2827.5264,-411.37004)"
     fill="#000000"
     font-family="sans-serif"
     font-size="40px"
     letter-spacing="0px"
     word-spacing="0px"
     style="line-height:1.25;opacity:0.8;fill:#ffffff"
     xml:space="preserve"
     id="flowRoot424"><flowRegion
       id="flowRegion420"
       style="fill:#ffffff"><rect
         x="-1770"
         y="1230.7"
         width="417.5"
         height="74"
         id="rect418"
         style="fill:#ffffff" /></flowRegion><flowPara
       font-family="Cantarell"
       font-size="14.667px"
       font-weight="bold"
       id="flowPara422">Emergency Contacts</flowPara></flowRoot>
  <text
     x="1070.5552"
     y="947.72949"
     fill="#e5e5e5"
     font-family="Cantarell"
     font-size="14.667px"
     letter-spacing="0px"
     word-spacing="0px"
     style="font-style:normal;font-variant:normal;font-weight:bold;font-stretch:normal;line-height:0%;font-family:Cantarell;-inkscape-font-specification:'Cantarell Bold';fill:#c0bfbc"
     xml:space="preserve"
     id="text430"><tspan
       x="1070.5552"
       y="947.72949"
       fill="#e5e5e5"
       font-size="14.667px"
       style="font-style:normal;font-variant:normal;font-weight:bold;font-stretch:normal;line-height:1.25;font-family:Cantarell;-inkscape-font-specification:'Cantarell Bold';fill:#c0bfbc"
       id="tspan428">Alice</tspan></text>
  <text
     x="1070.5552"
     y="897.979"
     fill="#e5e5e5"
     font-family="Cantarell"
     font-size="14.667px"
     letter-spacing="0px"
     word-spacing="0px"
     style="font-style:normal;font-variant:normal;font-weight:bold;font-stretch:normal;line-height:0%;font-family:Cantarell;-inkscape-font-specification:'Cantarell Bold';fill:#c0bfbc"
     xml:space="preserve"
     id="text434"><tspan
       x="1070.5552"
       y="897.979"
       fill="#e5e5e5"
       font-size="14.667px"
       style="font-style:normal;font-variant:normal;font-weight:bold;font-stretch:normal;line-height:1.25;font-family:Cantarell;-inkscape-font-specification:'Cantarell Bold';fill:#c0bfbc"
       id="tspan432">Bob</tspan></text>
  <path
     d="m 1383.9999,611.5 h -328"
     stroke="#1c1c1c"
     stroke-width="1px"
     id="path452"
     style="opacity:0.2;fill:none;stroke:#000000"
     sodipodi:nodetypes="cc" />
  <path
     id="path139090"
     style="font-variant-ligatures:normal;font-variant-position:normal;font-variant-caps:normal;font-variant-numeric:normal;font-variant-alternates:normal;font-feature-settings:normal;text-indent:0;text-decoration-line:none;text-decoration-style:solid;text-decoration-color:#000000;text-transform:none;text-orientation:mixed;white-space:normal;shape-padding:0;isolation:auto;mix-blend-mode:normal;fill:#ffffff"
     d="m 1362.0273,893.50977 v 1 c 0,0.27499 0.1087,0.52269 0.2872,0.70312 v 0.002 l 4.293,4.29297 -4.293,4.29297 v 0.004 c -0.1796,0.18059 -0.2891,0.42908 -0.2891,0.70508 v 1 h 1 c 0.3188,0 0.6004,-0.148 0.7832,-0.37891 l 5.6231,-5.62305 -5.6348,-5.63476 c -0.1831,-0.22208 -0.4598,-0.36328 -0.7715,-0.36328 z" />
  <path
     d="m 1363.7264,941.76996 -1.414,1.414 4.293,4.293 -4.293,4.293 1.414,1.414 5.707,-5.707 z"
     color="#000000"
     font-family="sans-serif"
     font-weight="400"
     overflow="visible"
     solid-color="#000000"
     style="font-variant-ligatures:normal;font-variant-position:normal;font-variant-caps:normal;font-variant-numeric:normal;font-variant-alternates:normal;font-feature-settings:normal;text-indent:0;text-decoration-line:none;text-decoration-style:solid;text-decoration-color:#000000;text-transform:none;text-orientation:mixed;white-space:normal;shape-padding:0;isolation:auto;mix-blend-mode:normal;fill:#ffffff"
     id="path700" />
  <path
     d="m 1363.0264,952.47996 h -1 v 1 h 1 z m 0,-11 h -1 v 1 h 1 z"
     color="#000000"
     overflow="visible"
     id="path702"
     style="fill:#ffffff" />
  <path
     d="m 1363.0264,941.47996 c -0.554,0 -1,0.446 -1,1 0,0.554 0.446,1 1,1 0.554,0 1,-0.446 1,-1 0,-0.554 -0.446,-1 -1,-1 z m 0,10 c -0.554,0 -1,0.446 -1,1 0,0.554 0.446,1 1,1 0.554,0 1,-0.446 1,-1 0,-0.554 -0.446,-1 -1,-1 z"
     color="#000000"
     overflow="visible"
     id="path704"
     style="fill:#ffffff" />
  <text
     x="1351.861"
     y="903.98816"
     fill="#888a85"
     font-family="Cantarell"
     font-size="13.75px"
     letter-spacing="0px"
     text-align="end"
     text-anchor="end"
     word-spacing="0px"
     style="line-height:125%;fill:#ffffff"
     xml:space="preserve"
     id="text710"><tspan
       x="1351.861"
       y="903.98816"
       id="tspan708"
       style="fill:#ffffff">+123456789</tspan></text>
  <text
     x="1350.9672"
     y="951.73865"
     fill="#888a85"
     font-family="Cantarell"
     font-size="13.75px"
     letter-spacing="0px"
     text-align="end"
     text-anchor="end"
     word-spacing="0px"
     style="line-height:125%;fill:#ffffff"
     xml:space="preserve"
     id="text714"><tspan
       x="1350.9672"
       y="951.73865"
       id="tspan712"
       style="fill:#ffffff">+987654321</tspan></text>
  <text
     x="1070.5554"
     y="450.61725"
     fill="#e5e5e5"
     font-size="14.667px"
     style="font-style:normal;font-variant:normal;font-weight:normal;font-stretch:normal;line-height:0%;font-family:Cantarell;-inkscape-font-specification:Cantarell;letter-spacing:0px;word-spacing:0px;fill:#c0bfbc"
     xml:space="preserve"
     id="text26289"><tspan
       x="1070.5554"
       y="450.61725"
       fill="#e5e5e5"
       font-size="14.667px"
       style="font-style:normal;font-variant:normal;font-weight:normal;font-stretch:normal;line-height:1.25;font-family:Cantarell;-inkscape-font-specification:Cantarell;fill:#c0bfbc"
       id="tspan26287">Blood Type</tspan></text>
  <text
     x="1369.0491"
     y="449.18829"
     fill="#888a85"
     font-size="13.75px"
     text-align="end"
     text-anchor="end"
     style="font-style:normal;font-variant:normal;font-weight:normal;font-stretch:normal;line-height:125%;font-family:Cantarell;-inkscape-font-specification:Cantarell;letter-spacing:0px;word-spacing:0px;fill:#ffffff"
     xml:space="preserve"
     id="text26293"><tspan
       x="1369.0491"
       y="449.18829"
       id="tspan26291"
       style="font-style:normal;font-variant:normal;font-weight:normal;font-stretch:normal;font-family:Cantarell;-inkscape-font-specification:Cantarell;fill:#ffffff">O-</tspan></text>
  <path
     d="m 1383.9999,465.5 h -328"
     stroke="#1c1c1c"
     stroke-width="1px"
     id="path26295"
     style="fill:none;stroke:#000000;opacity:0.2"
     sodipodi:nodetypes="cc" />
  <flowRoot
     transform="translate(2831.5264,-883.37004)"
     fill="#000000"
     font-family="sans-serif"
     font-size="40px"
     letter-spacing="0px"
     word-spacing="0px"
     style="line-height:0.25;fill:#ffffff;opacity:0.8"
     xml:space="preserve"
     id="flowRoot33169"><flowRegion
       id="flowRegion33165"
       style="fill:#ffffff"><rect
         x="-1770"
         y="1230.7"
         width="417.5"
         height="74"
         id="rect33163"
         style="fill:#ffffff" /></flowRegion><flowPara
       font-family="Cantarell"
       font-size="14.667px"
       font-weight="bold"
       id="flowPara33167">Information</flowPara></flowRoot>
  <text
     x="1070.5554"
     y="534.61725"
     fill="#e5e5e5"
     font-size="14.667px"
     style="font-style:normal;font-variant:normal;font-weight:normal;font-stretch:normal;line-height:0%;font-family:Cantarell;-inkscape-font-specification:Cantarell;letter-spacing:0px;word-spacing:0px;fill:#c0bfbc"
     xml:space="preserve"
     id="text39157"><tspan
       x="1070.5554"
       y="534.61725"
       fill="#e5e5e5"
       font-size="14.667px"
       style="font-style:normal;font-variant:normal;font-weight:normal;font-stretch:normal;line-height:1.25;font-family:Cantarell;-inkscape-font-specification:Cantarell;fill:#c0bfbc"
       id="tspan39155">Weight</tspan></text>
  <path
     d="m 1383.9999,549.5 h -328"
     stroke="#1c1c1c"
     stroke-width="1px"
     id="path39159"
     style="fill:none;stroke:#000000;opacity:0.2"
     sodipodi:nodetypes="cc" />
  <text
     x="1369.0491"
     y="533.18829"
     fill="#888a85"
     font-size="13.75px"
     text-align="end"
     text-anchor="end"
     style="font-style:normal;font-variant:normal;font-weight:normal;font-stretch:normal;line-height:125%;font-family:Cantarell;-inkscape-font-specification:Cantarell;letter-spacing:0px;word-spacing:0px;fill:#ffffff"
     xml:space="preserve"
     id="text41005"><tspan
       x="1369.0491"
       y="533.18829"
       id="tspan41003"
       style="font-style:normal;font-variant:normal;font-weight:normal;font-stretch:normal;font-family:Cantarell;-inkscape-font-specification:Cantarell;fill:#ffffff">75 kg</tspan></text>
  <path
     d="m 1383.9999,923.5 h -328"
     stroke="#1c1c1c"
     stroke-width="1px"
     id="path47654"
     style="opacity:0.2;fill:none;stroke:#000000"
     sodipodi:nodetypes="cc" />
  <text
     x="1070.5554"
     y="492.61725"
     fill="#e5e5e5"
     font-size="14.667px"
     style="font-style:normal;font-variant:normal;font-weight:normal;font-stretch:normal;line-height:0%;font-family:Cantarell;-inkscape-font-specification:Cantarell;letter-spacing:0px;word-spacing:0px;fill:#c0bfbc"
     xml:space="preserve"
     id="text49255"><tspan
       x="1070.5554"
       y="492.61725"
       fill="#e5e5e5"
       font-size="14.667px"
       style="font-style:normal;font-variant:normal;font-weight:normal;font-stretch:normal;line-height:1.25;font-family:Cantarell;-inkscape-font-specification:Cantarell;fill:#c0bfbc"
       id="tspan49253">Height</tspan></text>
  <text
     x="1369.0491"
     y="491.18829"
     fill="#888a85"
     font-size="13.75px"
     text-align="end"
     text-anchor="end"
     style="font-style:normal;font-variant:normal;font-weight:normal;font-stretch:normal;line-height:125%;font-family:Cantarell;-inkscape-font-specification:Cantarell;letter-spacing:0px;word-spacing:0px;fill:#ffffff"
     xml:space="preserve"
     id="text49259"><tspan
       x="1369.0491"
       y="491.18829"
       id="tspan49257"
       style="font-style:normal;font-variant:normal;font-weight:normal;font-stretch:normal;font-family:Cantarell;-inkscape-font-specification:Cantarell;fill:#ffffff">183 cm</tspan></text>
  <path
     d="m 1383.9999,507.5 h -328"
     stroke="#1c1c1c"
     stroke-width="1px"
     id="path49261"
     style="fill:none;stroke:#000000;opacity:0.2"
     sodipodi:nodetypes="cc" />
  <text
     x="1070.5552"
     y="911.979"
     fill="#e5e5e5"
     font-family="Cantarell"
     font-size="14.667px"
     letter-spacing="0px"
     word-spacing="0px"
     style="font-style:normal;font-variant:normal;font-weight:bold;font-stretch:normal;font-size:10.6667px;line-height:0%;font-family:Cantarell;-inkscape-font-specification:'Cantarell Bold';opacity:0.7;fill:#c0bfbc"
     xml:space="preserve"
     id="text53225"><tspan
       x="1070.5552"
       y="911.979"
       fill="#e5e5e5"
       font-size="14.667px"
       style="font-style:normal;font-variant:normal;font-weight:normal;font-stretch:normal;font-size:10.6667px;line-height:1.25;font-family:Cantarell;-inkscape-font-specification:Cantarell;fill:#c0bfbc"
       id="tspan53223">Brother</tspan></text>
  <text
     x="1070.5552"
     y="961.979"
     fill="#e5e5e5"
     font-family="Cantarell"
     font-size="14.667px"
     letter-spacing="0px"
     word-spacing="0px"
     style="font-style:normal;font-variant:normal;font-weight:bold;font-stretch:normal;font-size:10.6667px;line-height:0%;font-family:Cantarell;-inkscape-font-specification:'Cantarell Bold';opacity:0.7;fill:#c0bfbc"
     xml:space="preserve"
     id="text56901"><tspan
       x="1070.5552"
       y="961.979"
       fill="#e5e5e5"
       font-size="14.667px"
       style="font-style:normal;font-variant:normal;font-weight:normal;font-stretch:normal;font-size:10.6667px;line-height:1.25;font-family:Cantarell;-inkscape-font-specification:Cantarell;fill:#c0bfbc"
       id="tspan56899">Mother</tspan></text>
  <text
     xml:space="preserve"
     id="text71894"
     style="font-style:normal;font-weight:normal;font-size:14.6667px;line-height:1.25;font-family:sans-serif;white-space:pre;shape-inside:url(#rect71896);fill:#77767b;fill-opacity:1;stroke:none"
     transform="translate(77.99988,32)"><tspan
       x="984"
       y="973.17088"
       id="tspan29729"><tspan
         style="font-family:Cantarell;-inkscape-font-specification:Cantarell"
         id="tspan29727">When you call an emergency contact, a text </tspan></tspan><tspan
       x="984"
       y="991.69853"
       id="tspan29733"><tspan
         style="font-family:Cantarell;-inkscape-font-specification:Cantarell"
         id="tspan29731">message will be sent as well with location data.</tspan></tspan></text>
  <flowRoot
     transform="translate(1877.5264,-265.37004)"
     fill="#000000"
     font-family="sans-serif"
     font-size="40px"
     letter-spacing="0px"
     word-spacing="0px"
     style="line-height:0.5"
     xml:space="preserve"
     id="flowRoot80671"><flowRegion
       id="flowRegion80667"><rect
         x="-1770"
         y="1230.7"
         width="345.08786"
         height="88.396255"
         id="rect80665" /></flowRegion><flowPara
       font-family="Cantarell"
       font-size="14.667px"
       font-weight="bold"
       id="flowPara80669">Normal view of the lock screen, tapping &quot;Emergency&quot; opens the emergency dialler.</flowPara></flowRoot>
  <flowRoot
     transform="translate(2345.5264,-265.37004)"
     fill="#000000"
     font-family="sans-serif"
     font-size="40px"
     letter-spacing="0px"
     word-spacing="0px"
     style="line-height:0.5"
     xml:space="preserve"
     id="flowRoot84151"><flowRegion
       id="flowRegion84147"><rect
         x="-1770"
         y="1230.7"
         width="343.89648"
         height="257.02905"
         id="rect84145" /></flowRegion><flowPara
       font-family="Cantarell"
       font-size="14.667px"
       font-weight="bold"
       id="flowPara84149">Emergency Dialler screen, integrated into the Shell UI for a quick way to call emergency services. </flowPara><flowPara
       font-family="Cantarell"
       font-size="14.667px"
       font-weight="bold"
       id="flowPara130798" /><flowPara
       font-family="Cantarell"
       font-size="14.667px"
       font-weight="bold"
       id="flowPara130800" /><flowPara
       font-family="Cantarell"
       font-size="14.667px"
       font-weight="bold"
       id="flowPara158016">A button to access the device owner's &quot;Emergency Info&quot; is prominent on the bottom.</flowPara><flowPara
       font-family="Cantarell"
       font-size="14.667px"
       font-weight="bold"
       id="flowPara157099" /><flowPara
       font-family="Cantarell"
       font-size="14.667px"
       font-weight="bold"
       id="flowPara157097" /><flowPara
       font-family="Cantarell"
       font-size="14.667px"
       font-weight="bold"
       id="flowPara157210">Making a call proceeds to the ongoing Emergency Call screen</flowPara></flowRoot>
  <path
     d="m 849.70009,756.31996 -9,9 9,9 h 13.55295 c 0.79549,-0.0331 1.44705,-0.73765 1.44705,-1.5 v -15 c 0,-0.79619 -0.51842,-1.5 -1.51335,-1.5 z m 1.5,4.5 h 1.5 c 0.0156,-1.8e-4 0.0312,-6.9e-4 0.047,0 0.38242,0.0168 0.7648,0.19287 1.03125,0.46875 l 1.9218,1.9218 1.96875,-1.9218 c 0.39843,-0.34575 0.67,-0.45825 1.03125,-0.46875 h 1.5 v 1.5 c 0,0.42971 -0.0514,0.82597 -0.375,1.125 l -1.9218,1.9218 1.875,1.875 c 0.28228,0.28226 0.42186,0.68018 0.42187,1.07812 v 1.5 h -1.5 c -0.39795,-10e-6 -0.79588,-0.13964 -1.07812,-0.42187 l -1.9218,-1.9218 -1.9218,1.9218 c -0.28224,0.28228 -0.68019,0.42187 -1.07813,0.42187 h -1.5 v -1.5 c 0,-0.39793 0.13965,-0.79586 0.42188,-1.07812 l 1.9218,-1.875 -1.9218,-1.9218 c -0.31611,-0.29195 -0.45474,-0.70388 -0.42188,-1.125 z"
     color="#000000"
     fill="#ffffff"
     id="path84335"
     style="fill:#ffffff;stroke-width:1.00001" />
  <text
     x="1070.5554"
     y="410.61725"
     fill="#e5e5e5"
     font-size="14.667px"
     style="font-style:normal;font-variant:normal;font-weight:normal;font-stretch:normal;line-height:0%;font-family:Cantarell;-inkscape-font-specification:Cantarell;letter-spacing:0px;word-spacing:0px;fill:#c0bfbc"
     xml:space="preserve"
     id="text108185"><tspan
       x="1070.5554"
       y="410.61725"
       fill="#e5e5e5"
       font-size="14.667px"
       style="font-style:normal;font-variant:normal;font-weight:normal;font-stretch:normal;line-height:1.25;font-family:Cantarell;-inkscape-font-specification:Cantarell;fill:#c0bfbc"
       id="tspan108183">Age</tspan></text>
  <text
     x="1369.0491"
     y="409.18829"
     fill="#888a85"
     font-size="13.75px"
     text-align="end"
     text-anchor="end"
     style="font-style:normal;font-variant:normal;font-weight:normal;font-stretch:normal;line-height:125%;font-family:Cantarell;-inkscape-font-specification:Cantarell;letter-spacing:0px;word-spacing:0px;fill:#ffffff"
     xml:space="preserve"
     id="text108189"><tspan
       x="1369.0491"
       y="409.18829"
       id="tspan108187"
       style="font-style:normal;font-variant:normal;font-weight:normal;font-stretch:normal;font-family:Cantarell;-inkscape-font-specification:Cantarell;fill:#ffffff">27</tspan></text>
  <path
     d="m 1383.9999,425.5 h -328"
     stroke="#1c1c1c"
     stroke-width="1px"
     id="path108191"
     style="fill:none;stroke:#000000;opacity:0.2"
     sodipodi:nodetypes="cc" />
  <rect
     x="1056"
     y="240"
     width="39"
     height="39"
     rx="20"
     ry="20"
     color="#000000"
     color-rendering="auto"
     fill="#3584e4"
     image-rendering="auto"
     shape-rendering="auto"
     solid-color="#000000"
     stroke="#3584e4"
     stroke-linecap="square"
     style="isolation:auto;mix-blend-mode:normal;fill:#282828;stroke:#282828;stroke-width:0.999999;fill-opacity:1;stroke-opacity:1"
     id="rect138887" />
  <path
     id="path139090-7"
     style="font-variant-ligatures:normal;font-variant-position:normal;font-variant-caps:normal;font-variant-numeric:normal;font-variant-alternates:normal;font-feature-settings:normal;text-indent:0;text-decoration-line:none;text-decoration-style:solid;text-decoration-color:#000000;text-transform:none;text-orientation:mixed;white-space:normal;shape-padding:0;isolation:auto;mix-blend-mode:normal;fill:#f6f5f4"
     d="m 1079,251 v 1 c 0,0.27499 -0.1087,0.52269 -0.2872,0.70312 v 0.002 l -6.2929,6.29297 6.2929,6.29297 v 0.004 c 0.1796,0.18059 0.2891,0.42908 0.2891,0.70508 v 1 h -1 c -0.3188,0 -0.6004,-0.148 -0.7832,-0.37891 l -7.6231,-7.62305 7.6348,-7.63476 c 0.1831,-0.22208 0.4598,-0.36324 0.7715,-0.36328 z"
     sodipodi:nodetypes="cscccccscscccsc" />
  <text
     xml:space="preserve"
     style="font-style:normal;font-variant:normal;font-weight:800;font-stretch:normal;font-size:24px;line-height:0%;font-family:Cantarell;-inkscape-font-specification:'Cantarell Ultra-Bold';text-align:center;letter-spacing:0px;word-spacing:0px;text-anchor:middle;display:inline;fill:#ffffff;fill-opacity:1;stroke:none;stroke-width:0.999999"
     x="1683.9126"
     y="339.31702"
     id="text11969-7"><tspan
       style="font-style:normal;font-variant:normal;font-weight:800;font-stretch:normal;font-size:24px;line-height:1.25;font-family:Cantarell;-inkscape-font-specification:'Cantarell Ultra-Bold';fill:#ffffff;fill-opacity:1;stroke-width:0.999999"
       sodipodi:role="line"
       id="tspan11967-4"
       x="1683.9126"
       y="339.31702">Emergency Call</tspan></text>
  <text
     id="text11973-4"
     y="369.31787"
     x="1683.9126"
     style="font-style:normal;font-variant:normal;font-weight:normal;font-stretch:normal;font-size:14.6667px;line-height:0%;font-family:Cantarell;-inkscape-font-specification:Cantarell;text-align:center;letter-spacing:0px;word-spacing:0px;text-anchor:middle;display:inline;fill:#ffffff;fill-opacity:1;stroke:none;stroke-width:0.999999"
     xml:space="preserve"><tspan
       y="369.31787"
       x="1683.9126"
       id="tspan11971-3"
       sodipodi:role="line"
       style="font-style:normal;font-variant:normal;font-weight:normal;font-stretch:normal;font-size:14.6667px;line-height:1.25;font-family:Cantarell;-inkscape-font-specification:Cantarell;fill:#ffffff;fill-opacity:1;stroke-width:0.999999">911</tspan></text>
  <text
     id="text12001-0"
     y="549.75952"
     x="1683.9126"
     style="font-style:normal;font-variant:normal;font-weight:normal;font-stretch:normal;font-size:24px;line-height:0%;font-family:Cantarell;-inkscape-font-specification:Cantarell;text-align:center;letter-spacing:0px;word-spacing:0px;text-anchor:middle;display:inline;fill:#ffffff;fill-opacity:1;stroke:none;stroke-width:0.999999"
     xml:space="preserve"><tspan
       y="549.75952"
       x="1683.9126"
       id="tspan11999-7"
       sodipodi:role="line"
       style="font-style:normal;font-variant:normal;font-weight:normal;font-stretch:normal;font-size:24px;line-height:1.25;font-family:Cantarell;-inkscape-font-specification:Cantarell;fill:#ffffff;fill-opacity:1;stroke-width:0.999999">00:51</tspan></text>
  <text
     id="text12144-8"
     y="804.00037"
     x="1625.0238"
     style="font-style:normal;font-variant:normal;font-weight:normal;font-stretch:normal;font-size:14.6667px;line-height:0%;font-family:Cantarell;-inkscape-font-specification:Cantarell;text-align:start;letter-spacing:0px;word-spacing:0px;text-anchor:start;display:inline;fill:#ffffff;fill-opacity:1;stroke:none;stroke-width:0.999999"
     xml:space="preserve"><tspan
       y="804.00037"
       x="1625.0238"
       id="tspan12142-4"
       sodipodi:role="line"
       style="font-style:normal;font-variant:normal;font-weight:normal;font-stretch:normal;font-size:14.6667px;line-height:1.25;font-family:Cantarell;-inkscape-font-specification:Cantarell;text-align:start;text-anchor:start;fill:#ffffff;fill-opacity:1;stroke-width:0.999999">This call is encrypted</tspan></text>
  <path
     style="color:#bebebe;display:inline;overflow:visible;visibility:visible;fill:#ffffff;fill-opacity:1;fill-rule:nonzero;stroke:none;stroke-width:2;marker:none"
     d="m 1611.0235,791.0003 c -1.6448,0 -3.0001,1.3553 -3.0001,3.0002 v 2.9998 h -1.0001 c -0.5537,0 -0.9997,0.4459 -0.9997,1 v 0.531 5.469 h 4.9999 1.9998 5.0003 v -5.469 -0.531 c 0,-0.5541 -0.446,-1 -1.0001,-1 h -1 v -2.9998 c 0,-1.6449 -1.3554,-3.0002 -3.0002,-3.0002 z m 0,2.0001 h 1.9998 c 0.5715,0 1.0001,0.4286 1.0001,1.0001 v 2.9998 h -3.9999 v -2.9998 c 0,-0.5715 0.4286,-1.0001 1,-1.0001 z"
     id="path12146-3"
     inkscape:connector-curvature="0" />
  <rect
     inkscape:export-ydpi="90"
     inkscape:export-xdpi="90"
     inkscape:export-filename="/home/lapo.fedora/SparkleShare/gnome-mockups/content selection/content-selection.png"
     ry="12"
     rx="12"
     y="630.50269"
     x="1537.502"
     height="68.999924"
     width="88.999916"
     id="rect13739-1"
     style="color:#000000;display:inline;overflow:visible;visibility:visible;fill:#282828;fill-opacity:1;fill-rule:nonzero;stroke:#282828;stroke-width:0.999999;stroke-linecap:butt;stroke-linejoin:miter;stroke-miterlimit:4;stroke-dasharray:none;stroke-dashoffset:0;stroke-opacity:1;marker:none;enable-background:accumulate" />
  <rect
     style="color:#000000;display:inline;overflow:visible;visibility:visible;fill:#282828;fill-opacity:1;fill-rule:nonzero;stroke:#282828;stroke-width:0.999999;stroke-linecap:butt;stroke-linejoin:miter;stroke-miterlimit:4;stroke-dasharray:none;stroke-dashoffset:0;stroke-opacity:1;marker:none;enable-background:accumulate"
     id="rect13741-4"
     width="88.999916"
     height="68.999924"
     x="1639.501"
     y="630.50269"
     rx="12"
     ry="12"
     inkscape:export-filename="/home/lapo.fedora/SparkleShare/gnome-mockups/content selection/content-selection.png"
     inkscape:export-xdpi="90"
     inkscape:export-ydpi="90" />
  <path
     style="color:#bebebe;display:inline;overflow:visible;visibility:visible;fill:#ffffff;fill-opacity:1;fill-rule:nonzero;stroke:none;stroke-width:1;marker:none"
     d="m 1671.9988,651.5016 h 3.7266 l 4.4531,-4.4997 h 0.8203 v 17.9988 h -0.713 l -4.5604,-4.5009 h -3.7266 z"
     id="path13743-0"
     sodipodi:nodetypes="ccccccccc"
     inkscape:connector-curvature="0" />
  <rect
     y="644.00195"
     x="1671.9988"
     height="24.000002"
     width="24.000002"
     id="rect13745-6"
     style="color:#bebebe;display:inline;overflow:visible;visibility:visible;opacity:0.1;fill:#ffffff;fill-opacity:0;stroke:none;stroke-width:1;marker:none" />
  <path
     sodipodi:nodetypes="scccscccs"
     inkscape:connector-curvature="0"
     id="path13747-8"
     d="m 1694.4988,656.0022 c 0,-4.2213 -1.5,-7.7576 -3.8784,-10.5 h -2.1216 v 2.2211 c 1.897,2.2789 3,4.829 3,8.2789 0,3.4499 -1.1693,6 -3,8.2789 v 2.2211 h 2.0719 c 2.1986,-2.4606 3.9281,-6.2786 3.9281,-10.5 z"
     style="color:#000000;display:inline;overflow:visible;visibility:visible;fill:#ffffff;fill-opacity:1;fill-rule:nonzero;stroke:none;stroke-width:1;stroke-linecap:round;stroke-linejoin:round;stroke-miterlimit:4;stroke-dasharray:none;stroke-dashoffset:0;stroke-opacity:0;marker:none;enable-background:accumulate" />
  <path
     sodipodi:nodetypes="scccscccs"
     inkscape:connector-curvature="0"
     id="path13749-9"
     d="m 1689.9988,656.0022 c 0,-3.2499 -1.1082,-6.0297 -3,-7.5 h -1.5 v 3 c 0.9098,1.1832 1.5,2.6383 1.5,4.5 0,1.8617 -0.5902,3.3291 -1.5,4.5 v 3 h 1.5 c 1.8343,-1.4921 3,-4.3101 3,-7.5 z"
     style="color:#000000;display:inline;overflow:visible;visibility:visible;fill:#ffffff;fill-opacity:1;fill-rule:nonzero;stroke:none;stroke-width:1;stroke-linecap:round;stroke-linejoin:round;stroke-miterlimit:4;stroke-dasharray:none;stroke-dashoffset:0;stroke-opacity:0;marker:none;enable-background:accumulate" />
  <path
     sodipodi:nodetypes="zccccz"
     inkscape:connector-curvature="0"
     id="path13751-2"
     d="m 1685.4988,656.0022 c 0,-1.886 -0.4675,-3.3235 -1.5,-4.5 h -1.5 v 9 h 1.5 c 1.0081,-1.2553 1.5,-2.614 1.5,-4.5 z"
     clip-path="none"
     mask="none"
     style="color:#000000;font-style:normal;font-variant:normal;font-weight:normal;font-stretch:normal;font-size:medium;line-height:normal;font-family:Sans;-inkscape-font-specification:Sans;text-indent:0;text-align:start;text-decoration:none;text-decoration-line:none;letter-spacing:normal;word-spacing:normal;text-transform:none;writing-mode:lr-tb;direction:ltr;baseline-shift:baseline;text-anchor:start;display:inline;overflow:visible;visibility:visible;fill:#ffffff;fill-opacity:1;stroke:none;stroke-width:2.32782;marker:none;enable-background:accumulate" />
  <text
     id="text13759-6"
     y="685.00269"
     x="1683.9111"
     style="font-style:normal;font-variant:normal;font-weight:normal;font-stretch:normal;font-size:12px;line-height:0%;font-family:Cantarell;-inkscape-font-specification:Cantarell;text-align:center;letter-spacing:0px;word-spacing:0px;text-anchor:middle;display:inline;fill:#ffffff;fill-opacity:1;stroke:none;stroke-width:0.999999"
     xml:space="preserve"><tspan
       y="685.00269"
       x="1683.9111"
       id="tspan13757-6"
       sodipodi:role="line"
       style="font-style:normal;font-variant:normal;font-weight:normal;font-stretch:normal;font-size:12px;line-height:1.25;font-family:Cantarell;-inkscape-font-specification:Cantarell;fill:#ffffff;fill-opacity:1;stroke-width:0.999999">Speaker</tspan></text>
  <text
     id="text13767-4"
     y="685.00269"
     x="1581.9121"
     style="font-style:normal;font-variant:normal;font-weight:normal;font-stretch:normal;font-size:12px;line-height:0%;font-family:Cantarell;-inkscape-font-specification:Cantarell;text-align:center;letter-spacing:0px;word-spacing:0px;text-anchor:middle;display:inline;fill:#ffffff;fill-opacity:1;stroke:none;stroke-width:0.999999"
     xml:space="preserve"><tspan
       y="685.00269"
       x="1581.9121"
       id="tspan13765-9"
       sodipodi:role="line"
       style="font-style:normal;font-variant:normal;font-weight:normal;font-stretch:normal;font-size:12px;line-height:1.25;font-family:Cantarell;-inkscape-font-specification:Cantarell;fill:#ffffff;fill-opacity:1;stroke-width:0.999999">Mute</tspan></text>
  <rect
     style="color:#bebebe;display:inline;overflow:visible;visibility:visible;fill:#ffffff;fill-opacity:0;stroke:none;stroke-width:1;marker:none"
     id="rect13775-0"
     width="23.999701"
     height="23.999701"
     x="1569.999"
     y="644.00244" />
  <path
     d="m 1580.4991,644.0024 c -2.493,0 -4.5,2.007 -4.5,4.5 v 7.5 c 0,2.493 2.007,4.5 4.5,4.5 1.16,0 2.2037,-0.4473 3,-1.1631 v -0.3369 h 0.3369 c 0.7158,-0.7963 1.1631,-1.8401 1.1631,-3 v -7.5 c 0,-2.493 -2.007,-4.5 -4.5,-4.5 z m 0,3 c 0.831,0 1.5,0.669 1.5,1.5 v 7.5 c 0,0.831 -0.669,1.5 -1.5,1.5 -0.831,0 -1.5,-0.669 -1.5,-1.5 v -7.5 c 0,-0.831 0.669,-1.5 1.5,-1.5 z m -9,6 v 3.0146 c 0,4.4487 3.2481,8.1358 7.5,8.8506 v 3.1348 h 3 v -3.1348 c 0.5163,-0.087 1.0173,-0.222 1.5,-0.3925 v -2.4405 c -0.9049,0.4457 -1.9126,0.7178 -3,0.7178 -3.76,0 -6.75,-2.9852 -6.75,-6.7354 v -3.0146 z m 15.75,0 v 3.0146 c 0,1.0816 -0.2737,2.0844 -0.7178,2.9854 h 2.4434 c 0.3319,-0.9355 0.5244,-1.9362 0.5244,-2.9854 v -3.0146 z"
     style="line-height:normal;font-variant-ligatures:normal;font-variant-position:normal;font-variant-caps:normal;font-variant-numeric:normal;font-variant-alternates:normal;font-feature-settings:normal;text-indent:0;text-align:start;text-decoration-line:none;text-decoration-style:solid;text-decoration-color:#000000;text-transform:none;text-orientation:mixed;white-space:normal;shape-padding:0;isolation:auto;mix-blend-mode:normal;solid-color:#000000;solid-opacity:1;fill:#ffffff;fill-opacity:1;stroke-width:0.666666"
     color="#000000"
     font-weight="400"
     font-family="sans-serif"
     overflow="visible"
     opacity="0.35"
     id="path196260-8" />
  <path
     d="m 1584.9991,660.5024 h 2.0625 l 1.6875,1.6406 1.6406,-1.6406 h 2.1094 v 2.2031 l -1.6406,1.5938 1.6406,1.5937 v 2.1094 h -2.1562 l -1.5938,-1.5937 -1.5937,1.5937 h -2.1563 v -2.1094 l 1.5938,-1.5937 -1.5938,-1.5938 z"
     style="fill:#ffffff;fill-opacity:1;stroke-width:0.666666;marker:none"
     color="#bebebe"
     overflow="visible"
     id="path196262-7" />
  <rect
     inkscape:export-ydpi="90"
     inkscape:export-xdpi="90"
     inkscape:export-filename="/home/lapo.fedora/SparkleShare/gnome-mockups/content selection/content-selection.png"
     ry="12"
     rx="12"
     y="630.50244"
     x="1741.501"
     height="68.999931"
     width="88.999916"
     id="rect13801-1"
     style="color:#000000;display:inline;overflow:visible;visibility:visible;fill:#282828;fill-opacity:1;fill-rule:nonzero;stroke:#282828;stroke-width:1;stroke-linecap:butt;stroke-linejoin:miter;stroke-miterlimit:4;stroke-dasharray:none;stroke-dashoffset:0;stroke-opacity:1;marker:none;enable-background:accumulate" />
  <rect
     y="644.00342"
     x="1773.9937"
     height="23.999866"
     width="23.999866"
     id="rect13803-7"
     style="color:#bebebe;display:inline;overflow:visible;visibility:visible;fill:#ffffff;fill-opacity:0;stroke:none;stroke-width:1;marker:none" />
  <path
     style="color:#000000;display:inline;overflow:visible;visibility:visible;fill:#ffffff;fill-opacity:1;fill-rule:nonzero;stroke:none;stroke-width:1;marker:none;enable-background:accumulate"
     d="m 1779.2513,644.0018 c 0,0 -2.25,0 -2.25,2.25 v 13.5 c 0,2.25 2.25,2.25 2.25,2.25 h 2.25 v 3 c 0,0.831 0.669,1.5 1.5,1.5 h 6 c 0.831,0 1.5,-0.669 1.5,-1.5 v -3 h 2.25 c 2.25,0 2.25,-2.25 2.25,-2.25 v -13.5 c 0,-2.25 -2.25,-2.25 -2.25,-2.25 z m 0.75,3 h 3 v 3 h -3 z m 4.5,0 h 3 v 3 h -3 z m 4.5,0 h 3 v 3 h -3 z m -9,4.5 h 3 v 3 h -3 z m 4.5,0 h 3 v 3 h -3 z m 4.5,0 h 3 v 3 h -3 z m -9,4.5 h 3 v 3 h -3 z m 4.5,0 h 3 v 3 h -3 z m 4.5,0 h 3 v 3 h -3 z m -4.5,4.5 h 3 v 3 h -3 z"
     id="path13589"
     inkscape:connector-curvature="0"
     sodipodi:nodetypes="cssccsssscscscccccccccccccccccccccccccccccccccccccccccccccccccccc" />
  <text
     id="text13817-7"
     y="685.00293"
     x="1785.9116"
     style="font-style:normal;font-variant:normal;font-weight:normal;font-stretch:normal;font-size:12px;line-height:0%;font-family:Cantarell;-inkscape-font-specification:Cantarell;text-align:center;letter-spacing:0px;word-spacing:0px;text-anchor:middle;display:inline;fill:#ffffff;fill-opacity:1;stroke:none;stroke-width:1"
     xml:space="preserve"><tspan
       y="685.00293"
       x="1785.9116"
       id="tspan13815-2"
       sodipodi:role="line"
       style="font-style:normal;font-variant:normal;font-weight:normal;font-stretch:normal;font-size:12px;line-height:1.25;font-family:Cantarell;-inkscape-font-specification:Cantarell;fill:#ffffff;fill-opacity:1;stroke-width:1">Dialpad</tspan></text>
  <rect
     inkscape:export-ydpi="192"
     inkscape:export-xdpi="192"
     style="color:#000000;clip-rule:nonzero;display:inline;overflow:visible;visibility:visible;isolation:auto;mix-blend-mode:normal;color-interpolation:sRGB;color-interpolation-filters:linearRGB;solid-color:#000000;solid-opacity:1;fill:#ed333b;fill-opacity:1;fill-rule:nonzero;stroke:#ed333b;stroke-width:0.999999;stroke-linecap:square;stroke-linejoin:miter;stroke-miterlimit:4;stroke-dasharray:none;stroke-dashoffset:0;stroke-opacity:1;marker:none;color-rendering:auto;image-rendering:auto;shape-rendering:auto;text-rendering:auto;enable-background:accumulate"
     id="rect9335-6-2"
     width="118.99523"
     height="64.000046"
     x="1624.5039"
     y="839.5"
     ry="32.000023"
     rx="32.000023" />
  <rect
     y="855.50085"
     x="1668.0015"
     height="31.999985"
     width="31.999985"
     id="rect9337-0-1"
     style="color:#bebebe;display:inline;overflow:visible;visibility:visible;fill:none;stroke:none;stroke-width:1;marker:none" />
  <path
     d="m 1696.4859,877.5156 a 1.9580491,1.9580491 0 0 1 -2.774,0 l -2.0801,-2.0801 -2.082,-2.08 a 1.9580491,1.9580491 0 0 1 0,-2.7761 l 0.986,-0.986 a 13.676343,13.676343 0 0 0 -13.0683,0 l 0.986,0.986 a 1.9580491,1.9580491 0 0 1 0,2.7741 l -2.0801,2.08 -2.08,2.0801 a 1.9580491,1.9580491 0 0 1 -2.7761,0 l -2.08,-2.0801 a 4.9041231,4.9041231 0 0 1 0,-6.9342 l 0.694,-0.694 c 7.6362,-7.6362 20.1045,-7.6362 27.7407,0 l 0.694,0.694 c 1.914,1.9161 1.914,5.0202 0,6.9362 z"
     style="line-height:normal;font-variant-ligatures:normal;font-variant-position:normal;font-variant-caps:normal;font-variant-numeric:normal;font-variant-alternates:normal;font-feature-settings:normal;text-indent:0;text-align:start;text-decoration-line:none;text-decoration-style:solid;text-decoration-color:#000000;text-transform:none;text-orientation:mixed;shape-padding:0;isolation:auto;mix-blend-mode:normal;fill:#ffffff;fill-opacity:1;stroke-width:0.999999;marker:none"
     color="#000000"
     font-weight="400"
     font-family="sans-serif"
     overflow="visible"
     fill="#2e3436"
     id="path209539-0" />
  <circle
     style="font-size:4.84796px;line-height:0%;font-family:Cantarell;-inkscape-font-specification:Cantarell;letter-spacing:0px;word-spacing:0px;fill:url(#linearGradient151411);fill-opacity:1;stroke:none;stroke-width:3.99999;stroke-dashoffset:26.4"
     id="circle133372-3-9-7"
     cx="-440.00439"
     cy="-1684.0071"
     r="49.999321"
     transform="matrix(0,-1,-1,0,0,0)" />
  <text
     id="text104757-3-4-5-8"
     y="455.18469"
     x="1684.0071"
     style="font-style:normal;font-variant:normal;font-weight:normal;font-stretch:normal;font-size:37.4995px;line-height:0%;font-family:Cantarell;-inkscape-font-specification:Cantarell;text-align:center;letter-spacing:3.12495px;word-spacing:0px;text-anchor:middle;display:inline;fill:#fbbab4;fill-opacity:1;stroke:none;stroke-width:1"
     xml:space="preserve"><tspan
       style="font-weight:bold;font-size:43.7494px;line-height:1.25;text-align:center;text-anchor:middle;fill:#fbbab4;fill-opacity:1;stroke-width:1"
       y="455.18469"
       x="1685.5696"
       id="tspan104755-1-9-0-9"
       sodipodi:role="line">🞶</tspan></text>
  <flowRoot
     transform="translate(3285.5264,-263.37004)"
     fill="#000000"
     font-family="sans-serif"
     font-size="40px"
     letter-spacing="0px"
     word-spacing="0px"
     style="line-height:0.5"
     xml:space="preserve"
     id="flowRoot174280"><flowRegion
       id="flowRegion174276"><rect
         x="-1770"
         y="1230.7"
         width="345.08786"
         height="88.396255"
         id="rect174274" /></flowRegion><flowPara
       font-family="Cantarell"
       font-size="14.667px"
       font-weight="bold"
       id="flowPara174278">The ongoing &quot;Emergency Call&quot; screen is just a special case of the regular Calls screen but in bold visuals consistent with the rest of the screens in this context</flowPara></flowRoot>
  <path
     style="fill:none;stroke:#3584e4;stroke-width:4;stroke-linecap:butt;stroke-linejoin:miter;stroke-miterlimit:4;stroke-dasharray:4, 4;stroke-dashoffset:0;stroke-opacity:1"
     d="M 328,912 H 540"
     id="path186521"
     sodipodi:nodetypes="cc" />
  <path
     style="fill:#3584e4;fill-opacity:1;stroke:none;stroke-width:1px;stroke-linecap:butt;stroke-linejoin:miter;stroke-opacity:1"
     d="m 544,904 v 16 l 8,-8 z"
     id="path186669" />
  <path
     style="fill:none;stroke:#3584e4;stroke-width:4;stroke-linecap:butt;stroke-linejoin:miter;stroke-miterlimit:4;stroke-dasharray:4, 4;stroke-dashoffset:0;stroke-opacity:1"
     d="M 1020,832 H 762 v 36"
     id="path187240"
     sodipodi:nodetypes="ccc" />
  <path
     style="fill:#3584e4;fill-opacity:1;stroke:none;stroke-width:1px;stroke-linecap:butt;stroke-linejoin:miter;stroke-opacity:1"
     d="m 956,252 v 16 l -8,-8 z"
     id="path187643" />
  <rect
     x="596"
     y="240"
     width="39"
     height="39"
     rx="20"
     ry="20"
     color="#000000"
     color-rendering="auto"
     fill="#3584e4"
     image-rendering="auto"
     shape-rendering="auto"
     solid-color="#000000"
     stroke="#3584e4"
     stroke-linecap="square"
     style="isolation:auto;mix-blend-mode:normal;fill:#282828;fill-opacity:1;stroke:#282828;stroke-width:0.999999;stroke-opacity:1"
     id="rect237741" />
  <path
     id="path237743"
     style="font-variant-ligatures:normal;font-variant-position:normal;font-variant-caps:normal;font-variant-numeric:normal;font-variant-alternates:normal;font-feature-settings:normal;text-indent:0;text-decoration-line:none;text-decoration-style:solid;text-decoration-color:#000000;text-transform:none;text-orientation:mixed;white-space:normal;shape-padding:0;isolation:auto;mix-blend-mode:normal;fill:#f6f5f4"
     d="m 619,251 v 1 c 0,0.27499 -0.1087,0.52269 -0.2872,0.70312 v 0.002 l -6.2929,6.29297 6.2929,6.29297 v 0.004 c 0.1796,0.18059 0.2891,0.42908 0.2891,0.70508 v 1 h -1 c -0.3188,0 -0.6004,-0.148 -0.7832,-0.37891 l -7.6231,-7.62305 7.6348,-7.63476 c 0.1831,-0.22208 0.4598,-0.36324 0.7715,-0.36328 z"
     sodipodi:nodetypes="cscccccscscccsc" />
  <path
     style="fill:none;stroke:#3584e4;stroke-width:4;stroke-linecap:butt;stroke-linejoin:miter;stroke-miterlimit:4;stroke-dasharray:4, 4;stroke-dashoffset:0;stroke-opacity:1"
     d="M 600,260 H 500"
     id="path237745"
     sodipodi:nodetypes="cc" />
  <path
     style="fill:#3584e4;fill-opacity:1;stroke:none;stroke-width:1px;stroke-linecap:butt;stroke-linejoin:miter;stroke-opacity:1"
     d="m 496,252 v 16 l -8,-8 z"
     id="path237747" />
  <text
     x="755.38397"
     y="263.2937"
     color="#000000"
     color-rendering="auto"
     fill="#ff6363"
     font-family="Cantarell"
     font-size="22.898px"
     image-rendering="auto"
     shape-rendering="auto"
     stroke-linecap="round"
     stroke-width="6.8694"
     text-align="center"
     text-anchor="middle"
     text-rendering="auto"
     style="font-size:16px;line-height:110%;font-variant-ligatures:normal;font-variant-caps:normal;font-variant-numeric:normal;font-feature-settings:normal;fill:#ffffff"
     xml:space="preserve"
     id="text237751"><tspan
       x="755.38397"
       y="263.2937"
       fill="#ff6363"
       font-family="Cantarell"
       font-size="22.898px"
       font-weight="800"
       stroke-width="6.8694"
       text-align="center"
       text-anchor="middle"
       style="font-style:normal;font-variant:normal;font-weight:bold;font-stretch:normal;font-size:16px;font-family:Cantarell;-inkscape-font-specification:'Cantarell Bold';font-variant-ligatures:normal;font-variant-caps:normal;font-variant-numeric:normal;font-feature-settings:normal;fill:#ffffff"
       id="tspan237749">Emergency</tspan></text>
  <text
     xml:space="preserve"
     id="text27986"
     style="font-style:normal;font-weight:normal;font-size:14.6667px;line-height:1.25;font-family:sans-serif;white-space:pre;shape-inside:url(#rect27988);fill:#ffffff;fill-opacity:1;stroke:none"
     transform="translate(0,32)"><tspan
       x="1070.5547"
       y="625.78807"
       id="tspan29737"><tspan
         style="font-family:Cantarell;-inkscape-font-specification:Cantarell"
         id="tspan29735">Lorem ipsum dolor sit amet, consectetur </tspan></tspan><tspan
       x="1070.5547"
       y="644.31572"
       id="tspan29741"><tspan
         style="font-family:Cantarell;-inkscape-font-specification:Cantarell"
         id="tspan29739">adipiscing elit, sed do eiusmod tempor </tspan></tspan><tspan
       x="1070.5547"
       y="662.84337"
       id="tspan29745"><tspan
         style="font-family:Cantarell;-inkscape-font-specification:Cantarell"
         id="tspan29743">incididunt ut labore et dolore magna aliqua.</tspan></tspan></text>
  <text
     x="1070.5554"
     y="732.28711"
     fill="#e5e5e5"
     font-size="14.667px"
     style="font-style:normal;font-variant:normal;font-weight:normal;font-stretch:normal;font-size:12px;line-height:0%;font-family:Cantarell;-inkscape-font-specification:Cantarell;letter-spacing:0px;word-spacing:0px;fill:#c0bfbc"
     xml:space="preserve"
     id="text29128"><tspan
       x="1070.5554"
       y="732.28711"
       fill="#e5e5e5"
       font-size="14.667px"
       style="font-style:normal;font-variant:normal;font-weight:normal;font-stretch:normal;font-size:12px;line-height:1.25;font-family:Cantarell;-inkscape-font-specification:Cantarell;fill:#c0bfbc"
       id="tspan29126">Medical Notes</tspan></text>
  <path
     d="m 1383.9999,711.5 h -328"
     stroke="#1c1c1c"
     stroke-width="1px"
     id="path29134"
     style="opacity:0.2;fill:none;stroke:#000000"
     sodipodi:nodetypes="cc" />
  <text
     xml:space="preserve"
     id="text29258"
     style="font-style:normal;font-weight:normal;font-size:14.6667px;line-height:1.25;font-family:sans-serif;white-space:pre;shape-inside:url(#rect29260);fill:#ffffff;fill-opacity:1;stroke:none"
     transform="translate(0,132)"><tspan
       x="1070.5547"
       y="625.78807"
       id="tspan29749"><tspan
         style="font-family:Cantarell;-inkscape-font-specification:Cantarell"
         id="tspan29747">Ut enim ad minim veniam, quis nostrud </tspan></tspan><tspan
       x="1070.5547"
       y="644.31572"
       id="tspan29753"><tspan
         style="font-family:Cantarell;-inkscape-font-specification:Cantarell"
         id="tspan29751">exercitation ullamco laboris nisi ut aliquip ex </tspan></tspan><tspan
       x="1070.5547"
       y="662.84337"
       id="tspan29757"><tspan
         style="font-family:Cantarell;-inkscape-font-specification:Cantarell"
         id="tspan29755">ea commodo consequat.</tspan></tspan></text>
</svg>
