<?xml version="1.0" encoding="UTF-8" standalone="no"?>
<!-- Created with Inkscape (http://www.inkscape.org/) -->

<svg
   width="520"
   height="500.00003"
   viewBox="0 0 137.58333 132.29168"
   version="1.1"
   id="svg1"
   inkscape:version="1.3.2 (091e20ef0f, 2023-11-25)"
   sodipodi:docname="connect-drive-dialog.svg"
   inkscape:export-filename="../connect-drive-dialog.png"
   inkscape:export-xdpi="96"
   inkscape:export-ydpi="96"
   xmlns:inkscape="http://www.inkscape.org/namespaces/inkscape"
   xmlns:sodipodi="http://sodipodi.sourceforge.net/DTD/sodipodi-0.dtd"
   xmlns="http://www.w3.org/2000/svg"
   xmlns:svg="http://www.w3.org/2000/svg">
  <sodipodi:namedview
     id="namedview1"
     pagecolor="#ffffff"
     bordercolor="#000000"
     borderopacity="0.25"
     inkscape:showpageshadow="2"
     inkscape:pageopacity="0.0"
     inkscape:pagecheckerboard="0"
     inkscape:deskcolor="#d1d1d1"
     inkscape:document-units="px"
     showgrid="true"
     inkscape:zoom="1"
     inkscape:cx="272.5"
     inkscape:cy="278.5"
     inkscape:window-width="2560"
     inkscape:window-height="1371"
     inkscape:window-x="0"
     inkscape:window-y="0"
     inkscape:window-maximized="1"
     inkscape:current-layer="layer1"
     inkscape:export-bgcolor="#ffffffff">
    <inkscape:grid
       id="grid1"
       units="px"
       originx="0"
       originy="0"
       spacingx="0.26458333"
       spacingy="0.26458334"
       empcolor="#0099e5"
       empopacity="0.30196078"
       color="#0099e5"
       opacity="0.14901961"
       empspacing="5"
       dotted="false"
       gridanglex="30"
       gridanglez="30"
       visible="true" />
  </sodipodi:namedview>
  <defs
     id="defs1">
    <clipPath
       clipPathUnits="userSpaceOnUse"
       id="clipPath89">
      <g
         id="g90"
         style="stroke-width:0.255134"
         transform="matrix(3.9195098,0,0,3.9195098,2481.5443,-6839.0967)">
        <rect
           inkscape:export-ydpi="90"
           inkscape:export-xdpi="90"
           style="display:inline;fill:#fafafa;fill-opacity:1;stroke:#fafafa;stroke-width:0;stroke-miterlimit:4;stroke-dasharray:none;stroke-opacity:1"
           id="rect89"
           width="241.57314"
           height="235.47707"
           x="-368.18661"
           y="-197.13361"
           rx="2.2962053"
           ry="2.296205" />
      </g>
    </clipPath>
  </defs>
  <g
     inkscape:label="Layer 1"
     inkscape:groupmode="layer"
     id="layer1">
    <rect
       inkscape:export-ydpi="96"
       inkscape:export-xdpi="96"
       style="display:inline;fill:#000000;fill-opacity:0.152861;stroke:#fafafa;stroke-width:0;stroke-miterlimit:4;stroke-dasharray:none;stroke-opacity:1"
       id="rect13"
       width="116.41668"
       height="95.25"
       x="10.583332"
       y="27.516665"
       rx="4.7624993"
       ry="4.7625008"
       inkscape:export-filename="/home/aday/Documents/platform-design-blog-post/contacts-mockup.png" />
    <rect
       inkscape:export-ydpi="90"
       inkscape:export-xdpi="90"
       style="display:inline;fill:#fafafa;fill-opacity:1;stroke:#fafafa;stroke-width:0;stroke-miterlimit:4;stroke-dasharray:none;stroke-opacity:1"
       id="rect68"
       width="111.12501"
       height="89.958328"
       x="13.229169"
       y="30.162909"
       rx="2.3812499"
       ry="2.3812492" />
    <rect
       inkscape:export-ydpi="90"
       inkscape:export-xdpi="90"
       style="display:inline;fill:#3584e4;fill-opacity:1;stroke:#ececec;stroke-width:0;stroke-miterlimit:4;stroke-dasharray:none;stroke-opacity:1"
       id="rect148"
       width="23.812502"
       height="8.9958344"
       x="98.172302"
       y="32.014606"
       rx="2.1883843"
       ry="2.1883841" />
    <text
       xml:space="preserve"
       style="font-style:normal;font-variant:normal;font-weight:bold;font-stretch:normal;font-size:3.88056px;line-height:0%;font-family:Cantarell;-inkscape-font-specification:'Cantarell Bold';text-align:center;letter-spacing:0px;word-spacing:0px;text-anchor:middle;display:inline;fill:#2e3436;fill-opacity:1;stroke:none;stroke-width:0.264583"
       x="68.786484"
       y="37.918224"
       id="text161"><tspan
         style="font-style:normal;font-variant:normal;font-weight:bold;font-stretch:normal;font-size:3.88056px;line-height:1.25;font-family:Cantarell;-inkscape-font-specification:'Cantarell Bold';text-align:center;text-anchor:middle;stroke-width:0.264583"
         sodipodi:role="line"
         id="tspan161"
         x="68.786484"
         y="37.918224">Connect Drive</tspan></text>
    <rect
       inkscape:export-ydpi="90"
       inkscape:export-xdpi="90"
       style="display:inline;fill:#000000;fill-opacity:0.08;stroke:#000000;stroke-width:0;stroke-miterlimit:4;stroke-dasharray:none;stroke-opacity:1"
       id="rect161"
       width="95.779175"
       height="30.162502"
       x="20.902243"
       y="62.441936"
       rx="2.5897787"
       ry="2.5897787" />
    <rect
       inkscape:export-ydpi="90"
       inkscape:export-xdpi="90"
       style="display:inline;fill:#fcfdff;fill-opacity:1;stroke:#ececec;stroke-width:0;stroke-miterlimit:4;stroke-dasharray:none;stroke-opacity:1"
       id="rect162"
       width="95.247093"
       height="28.839584"
       x="21.166822"
       y="62.706402"
       rx="2.3812499"
       ry="2.3812499" />
    <text
       id="text162"
       y="71.177299"
       x="25.932804"
       style="font-style:normal;font-variant:normal;font-weight:normal;font-stretch:normal;font-size:3.88056px;line-height:0%;font-family:Cantarell;-inkscape-font-specification:Cantarell;letter-spacing:0px;word-spacing:0px;display:inline;fill:#2e3436;fill-opacity:1;stroke:none;stroke-width:0.264583"
       xml:space="preserve"><tspan
         y="71.177299"
         x="25.932804"
         id="tspan162"
         sodipodi:role="line"
         style="font-size:3.88056px;line-height:1.25;stroke-width:0.264583">Username</tspan></text>
    <rect
       y="106.10011"
       x="67.735191"
       height="4.2333336"
       width="4.2333336"
       id="rect163"
       style="fill:none;fill-opacity:1;stroke-width:0.264583"
       transform="matrix(0,1,1,0,0,0)" />
    <g
       id="g165"
       inkscape:label="document save as name pencil write change "
       transform="matrix(0.26458335,0,0,0.26458335,21.431253,78.316781)"
       style="fill:#222222">
      <title
         id="title163">edit</title>
      <path
         id="path165"
         style="fill:#222222;fill-opacity:1"
         d="m 332.27734,-39.16797 c -0.57966,0.007 -1.16955,0.23205 -1.6914,0.75391 l -9,9 C 321.21087,-29.03904 321.0001,-28.5304 321,-28 v 3 h 3 c 0.5304,-10e-5 1.03904,-0.21087 1.41406,-0.58594 l 9,-9 c 1.78921,-1.78921 0.0827,-4.39013 -1.88867,-4.57226 -0.0821,-0.008 -0.16524,-0.0108 -0.24805,-0.01 z m -1.77734,3.60742 1.06055,1.06055 -0.5293,0.53125 -6,6 -0.53125,0.5293 -1.06055,-1.06055 0.5293,-0.53125 6,-6 z" />
      <rect
         y="-336"
         x="-40.000008"
         height="16"
         width="16"
         id="rect165"
         style="fill:none;fill-opacity:1"
         transform="rotate(90)" />
    </g>
    <rect
       inkscape:export-ydpi="90"
       inkscape:export-xdpi="90"
       style="display:inline;fill:#000000;fill-opacity:0.08;stroke:#000000;stroke-width:0;stroke-miterlimit:4;stroke-dasharray:none;stroke-opacity:1"
       id="rect167"
       width="95.779175"
       height="15.610417"
       x="20.902243"
       y="97.090607"
       rx="2.5997264"
       ry="2.5997264" />
    <path
       style="display:inline;fill:none;stroke:#ebebeb;stroke-width:1.55554px;stroke-linecap:butt;stroke-linejoin:miter;stroke-opacity:1"
       d="m 1922.3032,-6946.56 h -560"
       id="path225"
       inkscape:connector-curvature="0"
       clip-path="url(#clipPath89)"
       transform="matrix(0.1700893,0,0,0.1700893,-210.4661,1258.6492)" />
    <text
       id="text227"
       y="85.715134"
       x="25.932804"
       style="font-style:normal;font-variant:normal;font-weight:normal;font-stretch:normal;font-size:3.88056px;line-height:0%;font-family:Cantarell;-inkscape-font-specification:Cantarell;letter-spacing:0px;word-spacing:0px;display:inline;fill:#2e3436;fill-opacity:1;stroke:none;stroke-width:0.264583"
       xml:space="preserve"><tspan
         y="85.715134"
         x="25.932804"
         id="tspan227"
         sodipodi:role="line"
         style="font-size:3.88056px;line-height:1.25;stroke-width:0.264583">Password</tspan></text>
    <rect
       inkscape:export-ydpi="90"
       inkscape:export-xdpi="90"
       style="display:inline;fill:#fcfdff;fill-opacity:1;stroke:#ececec;stroke-width:0;stroke-miterlimit:4;stroke-dasharray:none;stroke-opacity:1"
       id="rect11-3"
       width="95.247093"
       height="14.2875"
       x="21.169741"
       y="97.355186"
       rx="2.3812504"
       ry="2.3812501" />
    <text
       xml:space="preserve"
       style="font-style:normal;font-variant:normal;font-weight:normal;font-stretch:normal;font-size:3.88056px;line-height:0%;font-family:Cantarell;-inkscape-font-specification:Cantarell;letter-spacing:0px;word-spacing:0px;display:inline;fill:#2e3436;fill-opacity:1;stroke:none;stroke-width:0.264583"
       x="25.930073"
       y="105.83035"
       id="text29-6"><tspan
         style="font-size:3.88056px;line-height:1.25;stroke-width:0.264583"
         sodipodi:role="line"
         id="tspan20-1"
         x="25.930073"
         y="105.83035">Save Password</tspan></text>
    <rect
       ry="3.3072915"
       rx="3.3072913"
       y="101.17838"
       x="-112.45163"
       height="6.614583"
       width="12.700008"
       id="rect70"
       style="fill:#d3d3d3;fill-opacity:1;stroke:none;stroke-width:0.264583;stroke-linecap:round;stroke-miterlimit:4;stroke-dasharray:none;stroke-opacity:1"
       transform="scale(-1,1)" />
    <rect
       ry="2.5887942"
       rx="2.588845"
       y="101.89677"
       x="-105.73277"
       height="5.1776214"
       width="5.1777225"
       id="rect76-2"
       style="fill:#ffffff;fill-opacity:1;stroke:none;stroke-width:0.264583;stroke-linecap:round;stroke-miterlimit:4;stroke-dasharray:none;stroke-opacity:1"
       transform="scale(-1,1)" />
    <rect
       inkscape:export-ydpi="90"
       inkscape:export-xdpi="90"
       style="display:inline;fill:#d9d9d9;fill-opacity:1;stroke:#ececec;stroke-width:0;stroke-miterlimit:4;stroke-dasharray:none;stroke-opacity:1"
       id="rect257"
       width="23.812502"
       height="8.9958344"
       x="15.093152"
       y="32.014606"
       rx="2.1883843"
       ry="2.1883841" />
    <text
       xml:space="preserve"
       style="font-style:normal;font-variant:normal;font-weight:bold;font-stretch:normal;font-size:3.88056px;line-height:0%;font-family:Cantarell;-inkscape-font-specification:'Cantarell Bold';text-align:center;letter-spacing:0px;word-spacing:0px;text-anchor:middle;display:inline;fill:#2e3436;fill-opacity:1;stroke:none;stroke-width:0.264583"
       x="110.07468"
       y="37.918224"
       id="text261"><tspan
         style="font-style:normal;font-variant:normal;font-weight:bold;font-stretch:normal;font-size:3.88056px;line-height:1.25;font-family:Cantarell;-inkscape-font-specification:'Cantarell Bold';text-align:center;text-anchor:middle;fill:#ffffff;stroke-width:0.264583"
         sodipodi:role="line"
         id="tspan261"
         x="110.07468"
         y="37.918224">Connect</tspan></text>
    <text
       xml:space="preserve"
       style="font-style:normal;font-variant:normal;font-weight:bold;font-stretch:normal;font-size:3.88056px;line-height:0%;font-family:Cantarell;-inkscape-font-specification:'Cantarell Bold';text-align:center;letter-spacing:0px;word-spacing:0px;text-anchor:middle;display:inline;fill:#2e3436;fill-opacity:1;stroke:none;stroke-width:0.264583"
       x="26.947016"
       y="37.918224"
       id="text262"><tspan
         style="font-style:normal;font-variant:normal;font-weight:bold;font-stretch:normal;font-size:3.88056px;line-height:1.25;font-family:Cantarell;-inkscape-font-specification:'Cantarell Bold';text-align:center;text-anchor:middle;stroke-width:0.264583"
         sodipodi:role="line"
         id="tspan262"
         x="26.947016"
         y="37.918224">Cancel</tspan></text>
    <g
       id="g266"
       inkscape:label="document save as name pencil write change "
       transform="matrix(0.26458335,0,0,0.26458335,10.847919,92.868735)"
       style="fill:#222222">
      <title
         id="title262">edit</title>
      <path
         id="path265"
         style="fill:#222222;fill-opacity:1"
         d="m 332.27734,-39.16797 c -0.57966,0.007 -1.16955,0.23205 -1.6914,0.75391 l -9,9 C 321.21087,-29.03904 321.0001,-28.5304 321,-28 v 3 h 3 c 0.5304,-10e-5 1.03904,-0.21087 1.41406,-0.58594 l 9,-9 c 1.78921,-1.78921 0.0827,-4.39013 -1.88867,-4.57226 -0.0821,-0.008 -0.16524,-0.0108 -0.24805,-0.01 z m -1.77734,3.60742 1.06055,1.06055 -0.5293,0.53125 -6,6 -0.53125,0.5293 -1.06055,-1.06055 0.5293,-0.53125 6,-6 z" />
      <rect
         y="-336"
         x="-40.000008"
         height="16"
         width="16"
         id="rect266"
         style="fill:none;fill-opacity:1"
         transform="rotate(90)" />
    </g>
    <g
       style="fill:none"
       inkscape:label="eye open visibility toggle on pupil"
       id="g379"
       transform="matrix(0.26458335,0,0,0.26458335,62.441672,-172.07503)">
      <title
         id="title379">eye-open-negative-filled</title>
      <rect
         style="fill:none"
         id="rect379"
         width="16"
         height="16"
         x="165"
         y="961.36218" />
      <path
         id="path379"
         d="m 173,963.36186 a 8,8 0 0 0 -7.73828,6.00977 8,8 0 0 0 7.73828,5.99023 8,8 0 0 0 7.73828,-6.00977 A 8,8 0 0 0 173,963.36186 Z m 0,2 a 4,4 0 0 1 4,4 4,4 0 0 1 -4,4 4,4 0 0 1 -4,-4 4,4 0 0 1 4,-4 z"
         style="fill:#222222"
         mask="none" />
      <circle
         style="fill:#222222"
         id="circle379"
         cx="173"
         cy="969.36188"
         r="2"
         mask="none" />
    </g>
    <text
       xml:space="preserve"
       style="font-style:normal;font-variant:normal;font-weight:bold;font-stretch:normal;font-size:7.05556px;line-height:0%;font-family:Cantarell;-inkscape-font-specification:'Cantarell Bold';text-align:start;letter-spacing:0px;word-spacing:0px;text-anchor:start;display:inline;fill:#2e3436;fill-opacity:1;stroke:none;stroke-width:0.264583"
       x="10.585443"
       y="15.818751"
       id="text1"><tspan
         style="font-style:normal;font-variant:normal;font-weight:800;font-stretch:normal;font-size:7.05556px;line-height:1.25;font-family:Cantarell;-inkscape-font-specification:'Cantarell Ultra-Bold';text-align:start;text-anchor:start;stroke-width:0.264583"
         sodipodi:role="line"
         id="tspan1"
         x="10.585443"
         y="15.818751">Connect Drive Dialog</tspan></text>
    <text
       xml:space="preserve"
       style="font-style:normal;font-variant:normal;font-weight:normal;font-stretch:normal;font-size:3.88056px;line-height:1.45;font-family:Cantarell;-inkscape-font-specification:Cantarell;text-align:center;letter-spacing:0px;word-spacing:0px;text-anchor:middle;white-space:pre;inline-size:83.0546;display:inline;fill:#2e3436;fill-opacity:1;stroke:none;stroke-width:0.264583"
       x="79.387283"
       y="61.909519"
       id="text5"
       transform="translate(-10.583333,-11.1125)"><tspan
         x="79.387283"
         y="61.909519"
         id="tspan5">User details may be required to connect to<tspan
   y="61.909519"
   id="tspan6"> </tspan></tspan><tspan
         x="79.387283"
         y="67.53633"
         id="tspan7">“drive-name”</tspan></text>
  </g>
</svg>
