<?xml version="1.0" encoding="UTF-8" standalone="no"?>
<!-- Created with Inkscape (http://www.inkscape.org/) -->

<svg
   width="1800"
   height="1080"
   viewBox="0 0 1800 1080"
   id="svg2"
   version="1.1"
   inkscape:version="1.2.1 (9c6d41e410, 2022-07-14)"
   sodipodi:docname="search-bar.svg"
   inkscape:export-filename="../search-bar.png"
   inkscape:export-xdpi="96"
   inkscape:export-ydpi="96"
   xml:space="preserve"
   xmlns:inkscape="http://www.inkscape.org/namespaces/inkscape"
   xmlns:sodipodi="http://sodipodi.sourceforge.net/DTD/sodipodi-0.dtd"
   xmlns:xlink="http://www.w3.org/1999/xlink"
   xmlns="http://www.w3.org/2000/svg"
   xmlns:svg="http://www.w3.org/2000/svg"
   xmlns:rdf="http://www.w3.org/1999/02/22-rdf-syntax-ns#"
   xmlns:cc="http://creativecommons.org/ns#"
   xmlns:dc="http://purl.org/dc/elements/1.1/"><defs
     id="defs4"><linearGradient
       inkscape:collect="always"
       id="linearGradient18441"><stop
         style="stop-color:#ffffff;stop-opacity:1;"
         offset="0"
         id="stop18437" /><stop
         style="stop-color:#ffffff;stop-opacity:0;"
         offset="1"
         id="stop18439" /></linearGradient><clipPath
       clipPathUnits="userSpaceOnUse"
       id="clipPath4599"><circle
         r="50.799999"
         cy="229.26665"
         cx="67.73333"
         id="circle4601"
         style="opacity:1;fill:#635b82;fill-opacity:1;stroke:none;stroke-width:0.529167;stroke-linecap:round;stroke-linejoin:miter;stroke-miterlimit:4;stroke-dasharray:none;stroke-dashoffset:0;stroke-opacity:1" /></clipPath><clipPath
       clipPathUnits="userSpaceOnUse"
       id="clipPath4624"><path
         style="color:#000000;font-style:normal;font-variant:normal;font-weight:normal;font-stretch:normal;font-size:medium;line-height:normal;font-family:sans-serif;text-indent:0;text-align:start;text-decoration:none;text-decoration-line:none;text-decoration-style:solid;text-decoration-color:#000000;letter-spacing:normal;word-spacing:normal;text-transform:none;writing-mode:lr-tb;direction:ltr;baseline-shift:baseline;text-anchor:start;white-space:normal;shape-padding:0;clip-rule:nonzero;display:inline;overflow:visible;visibility:visible;opacity:1;isolation:auto;mix-blend-mode:normal;color-interpolation:sRGB;color-interpolation-filters:linearRGB;solid-color:#000000;solid-opacity:1;fill:#ededed;fill-opacity:1;fill-rule:nonzero;stroke:none;stroke-width:2.11667;stroke-linecap:round;stroke-linejoin:round;stroke-miterlimit:4;stroke-dasharray:none;stroke-dashoffset:0;stroke-opacity:1;color-rendering:auto;image-rendering:auto;shape-rendering:auto;text-rendering:auto;enable-background:accumulate"
         d="m 66.464844,121.31641 c -0.166029,-9.4e-4 -0.329949,0.0372 -0.478516,0.11132 0,0 -17.413222,8.75537 -21.734375,31.44141 -2.377685,12.48284 0.802049,33.95579 2.148438,44.54492 0.978798,7.6981 2.089843,13.01953 2.089843,13.01953 0.102489,0.49013 0.534422,0.84139 1.035157,0.8418 h 31.75 c 0.487305,-3.3e-4 0.911415,-0.33332 1.027343,-0.80664 0,0 1.265381,-5.16939 2.328125,-12.89063 1.398164,-10.15816 4.286935,-31.08304 1.919922,-44.69335 C 84.401063,140.52389 79.537234,132.64711 75.177734,127.87891 70.818235,123.1107 66.875,121.40234 66.875,121.40234 c -0.129627,-0.0557 -0.269079,-0.0849 -0.410156,-0.0859 z"
         id="path4626"
         inkscape:connector-curvature="0"
         sodipodi:nodetypes="ccssccccsssccc" /></clipPath><clipPath
       clipPathUnits="userSpaceOnUse"
       id="clipPath4880"><circle
         r="46.991886"
         cy="96.880188"
         cx="-174.21211"
         id="circle4882"
         style="opacity:1;fill:#aaccf9;fill-opacity:1;stroke:none;stroke-width:2.11667;stroke-linecap:round;stroke-linejoin:round;stroke-miterlimit:4;stroke-dasharray:none;stroke-dashoffset:0;stroke-opacity:1"
         transform="rotate(-45)" /></clipPath><clipPath
       clipPathUnits="userSpaceOnUse"
       id="clipPath5451"><rect
         inkscape:export-ydpi="90"
         inkscape:export-xdpi="90"
         style="display:inline;fill:#fafafa;fill-opacity:1;stroke:#fafafa;stroke-width:0;stroke-miterlimit:4;stroke-dasharray:none;stroke-opacity:1"
         id="rect5453"
         width="251.6273"
         height="203.7291"
         x="212.03876"
         y="-165.38414"
         rx="2.3812499"
         ry="2.3812499" /></clipPath><clipPath
       id="clipPath6262-3"
       clipPathUnits="userSpaceOnUse"><rect
         style="color:#bebebe;display:inline;overflow:visible;visibility:visible;fill:#bebebe;fill-opacity:1;fill-rule:nonzero;stroke:none;stroke-width:2;marker:none"
         id="rect6264-6"
         width="3.8250003"
         height="6.3750005"
         x="26.849981"
         y="220.75" /></clipPath><clipPath
       id="clipPath6258-7"
       clipPathUnits="userSpaceOnUse"><rect
         style="color:#bebebe;display:inline;overflow:visible;visibility:visible;fill:#bebebe;fill-opacity:1;fill-rule:nonzero;stroke:none;stroke-width:2;marker:none"
         id="rect6260-5"
         width="2.8977275"
         height="5.3129687"
         x="26.965673"
         y="221.28162" /></clipPath><clipPath
       id="clipPath6254-3"
       clipPathUnits="userSpaceOnUse"><rect
         style="color:#bebebe;display:inline;overflow:visible;visibility:visible;fill:#bebebe;fill-opacity:1;stroke:none;stroke-width:2;marker:none"
         id="rect6256-5"
         width="1.876245"
         height="4.8783236"
         x="26.998718"
         y="221.50153" /></clipPath><rect
       x="256.00781"
       y="309.59766"
       width="273.61328"
       height="62.347656"
       id="rect246221" /><rect
       x="256.00781"
       y="309.59766"
       width="273.61328"
       height="62.347656"
       id="rect246223" /><rect
       x="256.00781"
       y="309.59766"
       width="273.61328"
       height="62.347656"
       id="rect246225" /><rect
       x="256.00781"
       y="309.59766"
       width="273.61328"
       height="62.347656"
       id="rect246227" /><rect
       x="256.00781"
       y="309.59766"
       width="273.61328"
       height="62.347656"
       id="rect246229" /><rect
       x="256.00781"
       y="309.59766"
       width="273.61328"
       height="62.347656"
       id="rect246231" /><rect
       x="256.00781"
       y="309.59766"
       width="273.61328"
       height="62.347656"
       id="rect246233" /><rect
       x="256.00781"
       y="309.59766"
       width="273.61328"
       height="62.347656"
       id="rect501798" /><rect
       x="256.00781"
       y="309.59766"
       width="273.61328"
       height="62.347656"
       id="rect246223-6" /><rect
       x="256.00781"
       y="309.59766"
       width="273.61328"
       height="62.347656"
       id="rect246223-6-3" /><rect
       x="256.00781"
       y="309.59766"
       width="273.61328"
       height="62.347656"
       id="rect5292" /><rect
       x="256.00781"
       y="309.59766"
       width="273.61328"
       height="62.347656"
       id="rect39336" /><rect
       x="256.00781"
       y="309.59766"
       width="273.61328"
       height="62.347656"
       id="rect39338" /><rect
       x="256.00781"
       y="309.59766"
       width="273.61328"
       height="62.347656"
       id="rect84029" /><rect
       x="256.00781"
       y="309.59766"
       width="273.61328"
       height="62.347656"
       id="rect84031" /><rect
       x="256.00781"
       y="309.59766"
       width="273.61328"
       height="62.347656"
       id="rect3605" /><rect
       x="256.00781"
       y="309.59766"
       width="273.61328"
       height="62.347656"
       id="rect5292-6" /><rect
       x="256.00781"
       y="309.59766"
       width="273.61328"
       height="62.347656"
       id="rect23474" /><rect
       x="256.00781"
       y="309.59766"
       width="273.61328"
       height="62.347656"
       id="rect23482" /><rect
       x="256.00781"
       y="309.59766"
       width="273.61328"
       height="62.347656"
       id="rect23490" /><rect
       x="256.00781"
       y="309.59766"
       width="273.61328"
       height="62.347656"
       id="rect23560" /><rect
       x="256.00781"
       y="309.59766"
       width="273.61328"
       height="62.347656"
       id="rect23794" /><rect
       x="256.00781"
       y="309.59766"
       width="273.61328"
       height="62.347656"
       id="rect23796" /><rect
       x="256.00781"
       y="309.59766"
       width="273.61328"
       height="62.347656"
       id="rect26302" /><rect
       x="256.00781"
       y="309.59766"
       width="273.61328"
       height="62.347656"
       id="rect26304" /><rect
       x="256.00781"
       y="309.59766"
       width="273.61328"
       height="62.347656"
       id="rect26306" /><rect
       x="256.00781"
       y="309.59766"
       width="273.61328"
       height="62.347656"
       id="rect26308" /><rect
       x="256.00781"
       y="309.59766"
       width="273.61328"
       height="62.347656"
       id="rect26310" /><rect
       x="256.00781"
       y="309.59766"
       width="273.61328"
       height="62.347656"
       id="rect26312" /><rect
       x="256.00781"
       y="309.59766"
       width="346.98911"
       height="38.171875"
       id="rect26314" /><rect
       x="256.00781"
       y="309.59766"
       width="273.61328"
       height="62.347656"
       id="rect26427" /><rect
       x="256.00781"
       y="309.59766"
       width="273.61328"
       height="62.347656"
       id="rect23474-2" /><rect
       x="256.00781"
       y="309.59766"
       width="273.61328"
       height="62.347656"
       id="rect42436" /><rect
       x="256.00781"
       y="309.59766"
       width="273.61328"
       height="62.347656"
       id="rect43754" /><rect
       x="256.00781"
       y="309.59766"
       width="273.61328"
       height="62.347656"
       id="rect43975" /><rect
       x="256.00781"
       y="309.59766"
       width="273.61328"
       height="62.347656"
       id="rect43977" /><rect
       x="256.00781"
       y="309.59766"
       width="273.61328"
       height="62.347656"
       id="rect43979" /><rect
       x="256.00781"
       y="309.59766"
       width="273.61328"
       height="62.347656"
       id="rect43981" /><rect
       x="256.00781"
       y="309.59766"
       width="273.61328"
       height="62.347656"
       id="rect43983" /><rect
       x="256.00781"
       y="309.59766"
       width="273.61328"
       height="62.347656"
       id="rect43985" /><rect
       x="256.00781"
       y="309.59766"
       width="273.61328"
       height="62.347656"
       id="rect43987" /><rect
       x="256.00781"
       y="309.59766"
       width="273.61328"
       height="62.347656"
       id="rect43989" /><rect
       x="256.00781"
       y="309.59766"
       width="273.61328"
       height="62.347656"
       id="rect1577" /><rect
       x="256.00781"
       y="309.59766"
       width="273.61328"
       height="62.347656"
       id="rect1579" /><rect
       x="256.00781"
       y="309.59766"
       width="273.61328"
       height="62.347656"
       id="rect1581" /><rect
       x="256.00781"
       y="309.59766"
       width="273.61328"
       height="62.347656"
       id="rect1583" /><rect
       x="256.00781"
       y="309.59766"
       width="273.61328"
       height="62.347656"
       id="rect1585" /><rect
       x="256.00781"
       y="309.59766"
       width="273.61328"
       height="62.347656"
       id="rect1587" /><rect
       x="256.00781"
       y="309.59766"
       width="273.61328"
       height="62.347656"
       id="rect1589" /><rect
       x="256.00781"
       y="309.59766"
       width="273.61328"
       height="62.347656"
       id="rect2698" /><rect
       x="256.00781"
       y="309.59766"
       width="273.61328"
       height="62.347656"
       id="rect2698-6" /><rect
       x="256.00781"
       y="309.59766"
       width="273.61328"
       height="62.347656"
       id="rect26302-7" /><rect
       x="256.00781"
       y="309.59766"
       width="273.61328"
       height="62.347656"
       id="rect26314-0" /><rect
       x="256.00781"
       y="309.59766"
       width="273.61328"
       height="62.347656"
       id="rect26427-9" /><rect
       x="256.00781"
       y="309.59766"
       width="273.61328"
       height="62.347656"
       id="rect2698-3" /><rect
       x="256.00781"
       y="309.59766"
       width="273.61328"
       height="62.347656"
       id="rect3565" /><rect
       x="256.00781"
       y="309.59766"
       width="273.61328"
       height="62.347656"
       id="rect3776" /><rect
       x="256.00781"
       y="309.59766"
       width="273.61328"
       height="62.347656"
       id="rect36509" /><rect
       x="256.00781"
       y="309.59766"
       width="273.61328"
       height="62.347656"
       id="rect36511" /><rect
       x="256.00781"
       y="309.59766"
       width="273.61328"
       height="62.347656"
       id="rect36513" /><rect
       x="256.00781"
       y="309.59766"
       width="273.61328"
       height="62.347656"
       id="rect36515" /><rect
       x="256.00781"
       y="309.59766"
       width="273.61328"
       height="62.347656"
       id="rect36517" /><rect
       x="256.00781"
       y="309.59766"
       width="273.61328"
       height="62.347656"
       id="rect36519" /><rect
       x="256.00781"
       y="309.59766"
       width="273.61328"
       height="62.347656"
       id="rect85433" /><rect
       x="256.00781"
       y="309.59766"
       width="273.61328"
       height="62.347656"
       id="rect85435" /><rect
       x="256.00781"
       y="309.59766"
       width="273.61328"
       height="62.347656"
       id="rect85437" /><rect
       x="256.00781"
       y="309.59766"
       width="273.61328"
       height="62.347656"
       id="rect85963" /><rect
       x="256.00781"
       y="309.59766"
       width="273.61328"
       height="62.347656"
       id="rect85965" /><rect
       x="256.00781"
       y="309.59766"
       width="273.61328"
       height="62.347656"
       id="rect90497" /><rect
       x="256.00781"
       y="309.59766"
       width="273.61328"
       height="62.347656"
       id="rect90499" /><rect
       x="256.00781"
       y="309.59766"
       width="273.61328"
       height="62.347656"
       id="rect96440" /><rect
       x="256.00781"
       y="309.59766"
       width="273.61328"
       height="62.347656"
       id="rect96442" /><rect
       x="256.00781"
       y="309.59766"
       width="273.61328"
       height="62.347656"
       id="rect2698-3-0" /><rect
       x="256.00781"
       y="309.59766"
       width="273.61328"
       height="62.347656"
       id="rect99421" /><rect
       x="256.00781"
       y="309.59766"
       width="273.61328"
       height="62.347656"
       id="rect103780" /><rect
       x="256.00781"
       y="309.59766"
       width="273.61328"
       height="62.347656"
       id="rect103962" /><rect
       x="256.00781"
       y="309.59766"
       width="273.61328"
       height="62.347656"
       id="rect105522" /><rect
       x="256.00781"
       y="309.59766"
       width="273.61328"
       height="62.347656"
       id="rect105524" /><rect
       x="256.00781"
       y="309.59766"
       width="273.61328"
       height="62.347656"
       id="rect140530" /><rect
       x="256.00781"
       y="309.59766"
       width="273.61328"
       height="62.347656"
       id="rect43987-4" /><rect
       x="256.00781"
       y="309.59766"
       width="273.61328"
       height="62.347656"
       id="rect105522-0" /><rect
       x="256.00781"
       y="309.59766"
       width="273.61328"
       height="62.347656"
       id="rect105524-6" /><rect
       x="256.00781"
       y="309.59766"
       width="273.61328"
       height="62.347656"
       id="rect26302-3" /><rect
       x="256.00781"
       y="309.59766"
       width="346.98911"
       height="38.171875"
       id="rect26314-6" /><rect
       x="256.00781"
       y="309.59766"
       width="273.61328"
       height="62.347656"
       id="rect26427-7" /><rect
       x="256.00781"
       y="309.59766"
       width="273.61328"
       height="62.347656"
       id="rect2698-5" /><rect
       x="256.00781"
       y="309.59766"
       width="273.61328"
       height="62.347656"
       id="rect105522-0-3" /><rect
       x="256.00781"
       y="309.59766"
       width="273.61328"
       height="62.347656"
       id="rect105524-6-5" /><rect
       x="256.00781"
       y="309.59766"
       width="273.61328"
       height="62.347656"
       id="rect4571" /><rect
       x="256.00781"
       y="309.59766"
       width="273.61328"
       height="62.347656"
       id="rect4573" /><rect
       x="256.00781"
       y="309.59766"
       width="273.61328"
       height="62.347656"
       id="rect26314-0-3" /><rect
       x="256.00781"
       y="309.59766"
       width="273.61328"
       height="62.347656"
       id="rect26427-9-6" /><rect
       x="256.00781"
       y="309.59766"
       width="273.61328"
       height="62.347656"
       id="rect8131" /><rect
       x="256.00781"
       y="309.59766"
       width="273.61328"
       height="62.347656"
       id="rect15671" /><rect
       x="256.00781"
       y="309.59766"
       width="273.61328"
       height="62.347656"
       id="rect15673" /><rect
       x="256.00781"
       y="309.59766"
       width="273.61328"
       height="62.347656"
       id="rect21260" /><rect
       x="256.00781"
       y="309.59766"
       width="273.61328"
       height="62.347656"
       id="rect22170" /><rect
       x="256.00781"
       y="309.59766"
       width="273.61328"
       height="62.347656"
       id="rect62067" /><rect
       x="256.00781"
       y="309.59766"
       width="273.61328"
       height="62.347656"
       id="rect65433" /><rect
       x="256.00781"
       y="309.59766"
       width="273.61328"
       height="62.347656"
       id="rect65435" /><rect
       x="256.00781"
       y="309.59766"
       width="273.61328"
       height="62.347656"
       id="rect65437" /><rect
       x="256.00781"
       y="309.59766"
       width="273.61328"
       height="62.347656"
       id="rect67381" /><rect
       x="256.00781"
       y="309.59766"
       width="273.61328"
       height="62.347656"
       id="rect67383" /><rect
       x="256.00781"
       y="309.59766"
       width="273.61328"
       height="62.347656"
       id="rect67385" /><rect
       x="256.00781"
       y="309.59766"
       width="273.61328"
       height="62.347656"
       id="rect68627" /><rect
       x="256.00781"
       y="309.59766"
       width="273.61328"
       height="62.347656"
       id="rect2698-0" /><rect
       x="256.00781"
       y="309.59766"
       width="352.99225"
       height="65.154846"
       id="rect72259" /><rect
       x="256.00781"
       y="309.59766"
       width="273.61328"
       height="62.347656"
       id="rect89101" /><rect
       x="256.00781"
       y="309.59766"
       width="273.61328"
       height="62.347656"
       id="rect89103" /><rect
       x="256.00781"
       y="309.59766"
       width="273.61328"
       height="62.347656"
       id="rect89105" /><rect
       x="256.00781"
       y="309.59766"
       width="273.61328"
       height="62.347656"
       id="rect105182" /><rect
       x="256.00781"
       y="309.59766"
       width="273.61328"
       height="62.347656"
       id="rect105184" /><rect
       x="256.00781"
       y="309.59766"
       width="273.61328"
       height="62.347656"
       id="rect105186" /><rect
       x="256.00781"
       y="309.59766"
       width="273.61328"
       height="62.347656"
       id="rect119914" /><rect
       x="256.00781"
       y="309.59766"
       width="273.61328"
       height="62.347656"
       id="rect26302-9" /><rect
       x="256.00781"
       y="309.59766"
       width="273.61328"
       height="62.347656"
       id="rect26302-31" /><rect
       x="256.00781"
       y="309.59766"
       width="346.98911"
       height="38.171875"
       id="rect26314-4" /><rect
       x="256.00781"
       y="309.59766"
       width="273.61328"
       height="62.347656"
       id="rect26427-5" /><rect
       x="256.00781"
       y="309.59766"
       width="273.61328"
       height="62.347656"
       id="rect2698-03" /><rect
       x="256.00781"
       y="309.59766"
       width="273.61328"
       height="62.347656"
       id="rect36509-6" /><rect
       x="256.00781"
       y="309.59766"
       width="273.61328"
       height="62.347656"
       id="rect36509-4" /><rect
       x="256.00781"
       y="309.59766"
       width="273.61328"
       height="62.347656"
       id="rect70553" /><rect
       x="256.00781"
       y="309.59766"
       width="273.61328"
       height="62.347656"
       id="rect70553-5" /><rect
       x="256.00781"
       y="309.59766"
       width="273.61328"
       height="62.347656"
       id="rect70813" /><rect
       x="256.00781"
       y="309.59766"
       width="273.61328"
       height="62.347656"
       id="rect70553-9" /><rect
       x="256.00781"
       y="309.59766"
       width="273.61328"
       height="62.347656"
       id="rect70553-1" /><rect
       x="256.00781"
       y="309.59766"
       width="273.61328"
       height="62.347656"
       id="rect72848" /><rect
       x="256.00781"
       y="309.59766"
       width="273.61328"
       height="62.347656"
       id="rect70553-1-1" /><rect
       x="256.00781"
       y="309.59766"
       width="273.61328"
       height="62.347656"
       id="rect96890" /><rect
       x="256.00781"
       y="309.59766"
       width="273.61328"
       height="62.347656"
       id="rect26314-0-4" /><rect
       x="256.00781"
       y="309.59766"
       width="273.61328"
       height="62.347656"
       id="rect26427-9-7" /><rect
       x="256.00781"
       y="309.59766"
       width="273.61328"
       height="62.347656"
       id="rect2698-54" /><rect
       x="256.00781"
       y="309.59766"
       width="273.61328"
       height="62.347656"
       id="rect105524-6-0" /><rect
       x="256.00781"
       y="309.59766"
       width="273.61328"
       height="62.347656"
       id="rect2698-54-7" /><rect
       x="256.00781"
       y="309.59766"
       width="273.61328"
       height="62.347656"
       id="rect5772" /><rect
       x="256.00781"
       y="309.59766"
       width="273.61328"
       height="62.347656"
       id="rect5866" /><rect
       x="256.00781"
       y="309.59766"
       width="273.61328"
       height="62.347656"
       id="rect5960" /><rect
       x="256.00781"
       y="309.59766"
       width="273.61328"
       height="62.347656"
       id="rect105524-6-0-3" /><rect
       x="256.00781"
       y="309.59766"
       width="273.61328"
       height="62.347656"
       id="rect8503" /><rect
       x="256.00781"
       y="309.59766"
       width="273.61328"
       height="62.347656"
       id="rect105524-6-0-3-1" /><rect
       x="256.00781"
       y="309.59766"
       width="273.61328"
       height="62.347656"
       id="rect8503-2" /><rect
       x="256.00781"
       y="309.59766"
       width="273.61328"
       height="62.347656"
       id="rect24724" /><rect
       x="256.00781"
       y="309.59766"
       width="273.61328"
       height="62.347656"
       id="rect5866-0" /><rect
       x="256.00781"
       y="309.59766"
       width="273.61328"
       height="62.347656"
       id="rect5866-8" /><rect
       x="256.00781"
       y="309.59766"
       width="273.61328"
       height="62.347656"
       id="rect5866-2" /><rect
       x="256.00781"
       y="309.59766"
       width="273.61328"
       height="62.347656"
       id="rect5866-22" /><rect
       x="256.00781"
       y="309.59766"
       width="273.61328"
       height="62.347656"
       id="rect26314-0-1" /><rect
       x="256.00781"
       y="309.59766"
       width="273.61328"
       height="62.347656"
       id="rect26427-9-2" /><rect
       x="256.00781"
       y="309.59766"
       width="273.61328"
       height="62.347656"
       id="rect112510" /><rect
       x="256.00781"
       y="309.59766"
       width="309.33594"
       height="35.154942"
       id="rect112698" /><rect
       x="256.00781"
       y="309.59766"
       width="273.61328"
       height="62.347656"
       id="rect124896" /><rect
       x="256.00781"
       y="309.59766"
       width="273.61328"
       height="62.347656"
       id="rect126000" /><linearGradient
       inkscape:collect="always"
       xlink:href="#linearGradient18441"
       id="linearGradient35277"
       gradientUnits="userSpaceOnUse"
       gradientTransform="translate(-1532.3022,-1006.5333)"
       x1="530.76886"
       y1="911.53333"
       x2="550"
       y2="911.53333" /><linearGradient
       inkscape:collect="always"
       xlink:href="#linearGradient18441"
       id="linearGradient35281"
       gradientUnits="userSpaceOnUse"
       gradientTransform="translate(514.7644,-1006.5333)"
       x1="531.76892"
       y1="911.53333"
       x2="550"
       y2="911.53333" /><linearGradient
       inkscape:collect="always"
       xlink:href="#linearGradient18441"
       id="linearGradient35329"
       gradientUnits="userSpaceOnUse"
       gradientTransform="translate(-1231.9176,-1009.0333)"
       x1="530.76886"
       y1="911.53333"
       x2="550"
       y2="911.53333" /><linearGradient
       inkscape:collect="always"
       xlink:href="#linearGradient18441"
       id="linearGradient35334"
       gradientUnits="userSpaceOnUse"
       gradientTransform="translate(-991.9176,-1009.0333)"
       x1="530.76886"
       y1="911.53333"
       x2="550"
       y2="911.53333" /><rect
       x="-32.15834"
       y="1078.1389"
       width="435.53082"
       height="83.911575"
       id="rect16299" /><rect
       x="-32.15834"
       y="1078.1389"
       width="415.11047"
       height="95.155006"
       id="rect16301" /><rect
       x="-32.15834"
       y="1078.1389"
       width="492.24329"
       height="75.564629"
       id="rect16303" /><rect
       x="-32.15834"
       y="1078.1389"
       width="492.24329"
       height="75.564629"
       id="rect16305" /><rect
       x="-32.15834"
       y="1078.1389"
       width="492.24329"
       height="75.564629"
       id="rect16317" /><rect
       x="-32.15834"
       y="1078.1389"
       width="373.42297"
       height="148.50603"
       id="rect16311" /></defs><sodipodi:namedview
     id="base"
     pagecolor="#ffffff"
     bordercolor="#666666"
     borderopacity="1.0"
     inkscape:pageopacity="1"
     inkscape:pageshadow="2"
     inkscape:zoom="1"
     inkscape:cx="566.5"
     inkscape:cy="782"
     inkscape:document-units="px"
     inkscape:current-layer="layer1"
     showgrid="false"
     units="px"
     inkscape:window-width="1920"
     inkscape:window-height="1011"
     inkscape:window-x="0"
     inkscape:window-y="0"
     inkscape:window-maximized="1"
     inkscape:snap-bbox="true"
     inkscape:bbox-paths="true"
     inkscape:snap-bbox-midpoints="true"
     inkscape:snap-intersection-paths="true"
     inkscape:object-paths="true"
     inkscape:object-nodes="true"
     inkscape:snap-smooth-nodes="true"
     inkscape:snap-midpoints="true"
     inkscape:bbox-nodes="true"
     inkscape:snap-global="true"
     inkscape:pagecheckerboard="0"
     showguides="false"
     inkscape:showpageshadow="2"
     inkscape:deskcolor="#d1d1d1"><inkscape:grid
       type="xygrid"
       id="grid4514"
       empspacing="5"
       originx="0"
       originy="0" /></sodipodi:namedview><metadata
     id="metadata7"><rdf:RDF><cc:Work
         rdf:about=""><dc:format>image/svg+xml</dc:format><dc:type
           rdf:resource="http://purl.org/dc/dcmitype/StillImage" /></cc:Work></rdf:RDF></metadata><g
     inkscape:label="layer"
     inkscape:groupmode="layer"
     id="layer1"
     transform="translate(0,-161.53331)"
     style="display:inline"><path
       id="path15952"
       style="display:inline;fill:#000000;fill-opacity:0.152861;stroke:#fafafa;stroke-width:0;stroke-miterlimit:4;stroke-dasharray:none;stroke-opacity:1"
       d="m 108,601.53331 c -9.971998,0 -18,8.028 -18,18 v 82 h 1090 v -82 c 0,-9.972 -8.028,-18 -18,-18 z"
       sodipodi:nodetypes="ssccsss" /><path
       id="path15954"
       style="display:inline;fill:#ffffff;fill-opacity:1;stroke:#fafafa;stroke-width:0;stroke-miterlimit:4;stroke-dasharray:none;stroke-opacity:1"
       d="m 109,611.53331 c -4.986,0 -9,4.014 -9,9 v 81 h 1070 v -81 c 0,-4.986 -4.014,-9 -9,-9 z"
       sodipodi:nodetypes="ssccsss" /><rect
       style="display:inline;fill:url(#linearGradient35329);fill-opacity:1;stroke:none;stroke-width:2;stroke-linecap:round;stroke-linejoin:round;stroke-dasharray:none;stroke-dashoffset:2"
       id="rect35275-3"
       width="41.230759"
       height="1135"
       x="-723.14868"
       y="-1202.5"
       transform="matrix(0,-1,-1,0,0,0)" /><path
       id="path35273"
       style="display:inline;fill:#ebebeb;fill-opacity:1;stroke:#ebebeb;stroke-width:0;stroke-miterlimit:4;stroke-dasharray:none;stroke-opacity:1"
       d="m 109,611.5335 1052.0004,-0.013 c 4.9858,-10e-5 8.9996,4.0001 8.9996,9.0022 v 39.0105 l -1070,0.013 v -39.0105 c 0,-4.9873 4.0142,-9.0021 9,-9.0022 z"
       sodipodi:nodetypes="sssccss" /><path
       id="rect68158"
       style="display:inline;fill:#000000;fill-opacity:0.152861;stroke:#fafafa;stroke-width:0;stroke-miterlimit:4;stroke-dasharray:none;stroke-opacity:1"
       d="m 108,361.53331 c -9.971998,0 -18,8.028 -18,18 v 82 h 1090 v -82 c 0,-9.972 -8.028,-18 -18,-18 z"
       sodipodi:nodetypes="ssccsss" /><path
       id="rect68160"
       style="display:inline;fill:#ffffff;fill-opacity:1;stroke:#fafafa;stroke-width:0;stroke-miterlimit:4;stroke-dasharray:none;stroke-opacity:1"
       d="m 109,371.53331 c -4.986,0 -9,4.014 -9,9 v 81 h 1070 v -81 c 0,-4.986 -4.014,-9 -9,-9 z"
       sodipodi:nodetypes="ssccsss" /><path
       id="path68162"
       style="display:inline;fill:#ebebeb;fill-opacity:1;stroke:#ebebeb;stroke-width:0;stroke-miterlimit:4;stroke-dasharray:none;stroke-opacity:1"
       d="m 109,371.5335 1052.0004,-0.013 c 4.9858,-1e-4 8.9996,4.0001 8.9996,9.0022 v 39.0105 l -1070,0.013 v -39.0105 c 0,-4.9873 4.0142,-9.0021 9,-9.0022 z"
       sodipodi:nodetypes="sssccss" /><g
       id="g68170"
       transform="translate(130,120)"
       style="display:inline"><g
         id="g68168"><rect
           style="fill:#ebebeb;fill-opacity:1;stroke:#d2d2d2;stroke-width:0;stroke-opacity:1"
           id="rect68164"
           width="33.999992"
           height="33.999992"
           x="956.11023"
           y="258.53333"
           rx="8.3186388"
           ry="8.3186388" /><path
           id="path68166"
           style="fill:#2e3436;fill-opacity:1;stroke:none;stroke-width:2;stroke-linecap:square;stroke-linejoin:round;stroke-dasharray:8, 8"
           d="m 966,269.53331 v 2 h 14 v -2 z m 0,5 v 2 h 14 v -2 z m 0,5 v 2 h 14 v -2 z" /></g></g><circle
       style="display:inline;fill:#d8d8d8;fill-opacity:1;stroke:#3584e4;stroke-width:0;stroke-miterlimit:4;stroke-dasharray:none"
       id="circle68172"
       cx="-1145.9098"
       cy="395.53223"
       r="10.999997"
       transform="scale(-1,1)" /><g
       transform="matrix(-1,0,0,1,1194.9062,-372.45383)"
       id="g68176"
       style="display:inline;fill:#2e3436;fill-opacity:1"><path
         inkscape:connector-curvature="0"
         d="m 45,764 h 1 c 0.01037,-1.2e-4 0.02079,-4.6e-4 0.03125,0 0.254951,0.0112 0.50987,0.12858 0.6875,0.3125 L 49,766.59375 51.3125,764.3125 C 51.578125,764.082 51.759172,764.007 52,764 h 1 v 1 c 0,0.28647 -0.03434,0.55065 -0.25,0.75 l -2.28125,2.28125 2.25,2.25 C 52.906938,770.46942 52.999992,770.7347 53,771 v 1 h -1 c -0.265301,-10e-6 -0.530586,-0.0931 -0.71875,-0.28125 L 49,769.4375 46.71875,771.71875 C 46.530586,771.90694 46.26529,772 46,772 h -1 v -1 c -3e-6,-0.26529 0.09306,-0.53058 0.28125,-0.71875 l 2.28125,-2.25 L 45.28125,765.75 C 45.070508,765.55537 44.97809,765.28075 45,765 Z"
         id="path68174"
         style="color:#bebebe;font-style:normal;font-variant:normal;font-weight:normal;font-stretch:normal;font-size:medium;line-height:normal;font-family:'Andale Mono';-inkscape-font-specification:'Andale Mono';text-indent:0;text-align:start;text-decoration:none;text-decoration-line:none;letter-spacing:normal;word-spacing:normal;text-transform:none;writing-mode:lr-tb;direction:ltr;text-anchor:start;display:inline;overflow:visible;visibility:visible;fill:#2e3436;fill-opacity:1;fill-rule:nonzero;stroke:none;stroke-width:1.78125;marker:none;enable-background:new" /></g><g
       id="g68188"
       transform="matrix(-1,0,0,1,249.99999,110.00002)"
       style="display:inline"><rect
         style="fill:#ebebeb;fill-opacity:1;stroke:#d2d2d2;stroke-width:0;stroke-opacity:1"
         id="rect68178"
         width="33.999992"
         height="33.999992"
         x="108"
         y="268.53333"
         rx="8.3186388"
         ry="8.3186388" /><g
         inkscape:label="go next following arrow right back"
         id="g68186"
         transform="matrix(0,1,1,0,-78.003178,114.39752)"><title
           id="title68180">go-next</title><path
           d="m 165.13672,199.00391 a 1,1 0 0 0 -0.70899,0.29296 1,1 0 0 0 0,1.41407 l 6,6 a 1.0001,1.0001 0 0 0 1.41602,0 l 6,-6 a 1,1 0 0 0 0,-1.41407 1,1 0 0 0 -1.41602,0 l -5.29101,5.29297 -5.29297,-5.29297 a 1,1 0 0 0 -0.70703,-0.29296 z"
           id="path68182"
           style="fill:#2e3436;fill-opacity:1" /><rect
           y="195.00317"
           x="163.1358"
           height="16"
           width="16"
           id="rect68184"
           style="fill:none;fill-opacity:1" /></g></g><g
       id="g68200"
       transform="translate(40,110.00002)"
       style="display:inline"><rect
         style="fill:#ebebeb;fill-opacity:1;stroke:#d2d2d2;stroke-width:0;stroke-opacity:1"
         id="rect68190"
         width="33.999992"
         height="33.999992"
         x="108"
         y="268.53333"
         rx="8.3186388"
         ry="8.3186388" /><g
         inkscape:label="go next following arrow right back"
         id="g68198"
         transform="matrix(0,1,1,0,-78.003178,114.39752)"><title
           id="title68192">go-next</title><path
           d="m 165.13672,199.00391 a 1,1 0 0 0 -0.70899,0.29296 1,1 0 0 0 0,1.41407 l 6,6 a 1.0001,1.0001 0 0 0 1.41602,0 l 6,-6 a 1,1 0 0 0 0,-1.41407 1,1 0 0 0 -1.41602,0 l -5.29101,5.29297 -5.29297,-5.29297 a 1,1 0 0 0 -0.70703,-0.29296 z"
           id="path68194"
           style="fill:#2e3436;fill-opacity:1" /><rect
           y="195.00317"
           x="163.1358"
           height="16"
           width="16"
           id="rect68196"
           style="fill:none;fill-opacity:1" /></g></g><rect
       style="display:inline;fill:#d8d8d8;fill-opacity:1;stroke:#d2d2d2;stroke-width:0;stroke-opacity:1"
       id="rect71022"
       width="504"
       height="33.999992"
       x="383"
       y="378.53333"
       rx="8.3186388"
       ry="8.3186388" /><g
       transform="translate(-858.98661,962.5333)"
       id="g6466"
       inkscape:label="home directory personal"><title
         id="title21414">user-home</title><path
         id="path3991-70"
         d="m 1260.9729,-573.995 a 1.0001,1.0001 0 0 0 -0.5801,0.18555 l -7,5 a 1,1 0 0 0 -0.2344,1.39453 1,1 0 0 0 0.8145,0.41797 v 4.00195 c 0,1.64501 1.355,3 3,3 h 8 c 1.645,0 3,-1.31839 3,-3 v -4.00195 a 1,1 0 0 0 0.8145,-0.41797 1,1 0 0 0 -0.2325,-1.39453 l -7,-5 a 1.0001,1.0001 0 0 0 -0.582,-0.18555 z m 0,2.22852 5,3.57031 v 5.20117 c 0,0.56413 -0.4359,1 -1,1 h -3 v -4 c 0,-0.554 -0.446,-1 -1,-1 h -1 c -0.554,0 -1,0.446 -1,1 v 4 h -2 c -0.5641,0 -1,-0.43587 -1,-1 v -5.20117 z"
         style="fill:#2e3436;fill-opacity:1" /><rect
         y="-575"
         x="1253.0002"
         height="16"
         width="16"
         id="rect12880-8"
         style="fill:none" /></g><text
       xml:space="preserve"
       style="font-style:normal;font-variant:normal;font-weight:normal;font-stretch:normal;font-size:42.6667px;line-height:0%;font-family:Cantarell;-inkscape-font-specification:'Cantarell, Normal';font-variant-ligatures:normal;font-variant-caps:normal;font-variant-numeric:normal;font-variant-east-asian:normal;text-align:start;letter-spacing:0px;word-spacing:0px;text-anchor:start;display:inline;fill:#2e3436;fill-opacity:1;stroke:none;stroke-width:0.999999"
       x="109.30124"
       y="287.43463"
       id="text4682-3-2"><tspan
         sodipodi:role="line"
         id="tspan4680-5-9"
         x="109.30124"
         y="287.43463"
         style="font-style:normal;font-variant:normal;font-weight:800;font-stretch:normal;font-size:42.6667px;line-height:1.25;font-family:Cantarell;-inkscape-font-specification:'Cantarell Ultra-Bold';font-variant-ligatures:normal;font-variant-caps:normal;font-variant-numeric:normal;font-variant-east-asian:normal;text-align:start;text-anchor:start;fill:#2e3436;fill-opacity:1;stroke-width:0.999999">Search Bar</tspan></text><path
       id="path116621"
       style="display:inline;fill:#000000;fill-opacity:0.152861;stroke:#fafafa;stroke-width:0;stroke-miterlimit:4;stroke-dasharray:none;stroke-opacity:1"
       d="m 108,901.53331 c -9.971998,0 -18,8.028 -18,18 v 61.99999 76 21 c 0,9.972 8.028002,18 18,18 h 1054 c 9.972,0 18,-8.028 18,-18 v -23 -74 -61.99999 c 0,-9.972 -8.028,-18 -18,-18 z"
       sodipodi:nodetypes="ssccssssccsss" /><path
       id="path116623"
       style="display:inline;fill:#ffffff;fill-opacity:1;stroke:#fafafa;stroke-width:0;stroke-miterlimit:4;stroke-dasharray:none;stroke-opacity:1"
       d="m 109,911.53331 c -4.986,0 -9,4.014 -9,9 v 60.99999 76 20 c 0,4.986 4.014,9 9,9 h 1052 c 4.986,0 9,-4.014 9,-9 v -22 -74 -60.99999 c 0,-4.986 -4.014,-9 -9,-9 z"
       sodipodi:nodetypes="ssccssssccsss" /><g
       id="g116633"
       transform="translate(130,360)"
       style="display:inline"><g
         id="g116631"><rect
           style="fill:#ebebeb;fill-opacity:1;stroke:#d2d2d2;stroke-width:0;stroke-opacity:1"
           id="rect116627"
           width="33.999992"
           height="33.999992"
           x="956.11023"
           y="258.53333"
           rx="8.3186388"
           ry="8.3186388" /><path
           id="path116629"
           style="fill:#2e3436;fill-opacity:1;stroke:none;stroke-width:2;stroke-linecap:square;stroke-linejoin:round;stroke-dasharray:8, 8"
           d="m 966,269.53331 v 2 h 14 v -2 z m 0,5 v 2 h 14 v -2 z m 0,5 v 2 h 14 v -2 z" /></g></g><circle
       style="display:inline;fill:#d8d8d8;fill-opacity:1;stroke:#3584e4;stroke-width:0;stroke-miterlimit:4;stroke-dasharray:none"
       id="circle116635"
       cx="-1145.9098"
       cy="635.53223"
       r="10.999997"
       transform="scale(-1,1)" /><g
       transform="matrix(-1,0,0,1,1194.9062,-132.45383)"
       id="g116639"
       style="display:inline;fill:#2e3436;fill-opacity:1"><path
         inkscape:connector-curvature="0"
         d="m 45,764 h 1 c 0.01037,-1.2e-4 0.02079,-4.6e-4 0.03125,0 0.254951,0.0112 0.50987,0.12858 0.6875,0.3125 L 49,766.59375 51.3125,764.3125 C 51.578125,764.082 51.759172,764.007 52,764 h 1 v 1 c 0,0.28647 -0.03434,0.55065 -0.25,0.75 l -2.28125,2.28125 2.25,2.25 C 52.906938,770.46942 52.999992,770.7347 53,771 v 1 h -1 c -0.265301,-10e-6 -0.530586,-0.0931 -0.71875,-0.28125 L 49,769.4375 46.71875,771.71875 C 46.530586,771.90694 46.26529,772 46,772 h -1 v -1 c -3e-6,-0.26529 0.09306,-0.53058 0.28125,-0.71875 l 2.28125,-2.25 L 45.28125,765.75 C 45.070508,765.55537 44.97809,765.28075 45,765 Z"
         id="path116637"
         style="color:#bebebe;font-style:normal;font-variant:normal;font-weight:normal;font-stretch:normal;font-size:medium;line-height:normal;font-family:'Andale Mono';-inkscape-font-specification:'Andale Mono';text-indent:0;text-align:start;text-decoration:none;text-decoration-line:none;letter-spacing:normal;word-spacing:normal;text-transform:none;writing-mode:lr-tb;direction:ltr;text-anchor:start;display:inline;overflow:visible;visibility:visible;fill:#2e3436;fill-opacity:1;fill-rule:nonzero;stroke:none;stroke-width:1.78125;marker:none;enable-background:new" /></g><g
       id="g116651"
       transform="matrix(-1,0,0,1,249.99999,350.00002)"
       style="display:inline"><rect
         style="fill:#ebebeb;fill-opacity:1;stroke:#d2d2d2;stroke-width:0;stroke-opacity:1"
         id="rect116641"
         width="33.999992"
         height="33.999992"
         x="108"
         y="268.53333"
         rx="8.3186388"
         ry="8.3186388" /><g
         inkscape:label="go next following arrow right back"
         id="g116649"
         transform="matrix(0,1,1,0,-78.003178,114.39752)"><title
           id="title116643">go-next</title><path
           d="m 165.13672,199.00391 a 1,1 0 0 0 -0.70899,0.29296 1,1 0 0 0 0,1.41407 l 6,6 a 1.0001,1.0001 0 0 0 1.41602,0 l 6,-6 a 1,1 0 0 0 0,-1.41407 1,1 0 0 0 -1.41602,0 l -5.29101,5.29297 -5.29297,-5.29297 a 1,1 0 0 0 -0.70703,-0.29296 z"
           id="path116645"
           style="fill:#2e3436;fill-opacity:1" /><rect
           y="195.00317"
           x="163.1358"
           height="16"
           width="16"
           id="rect116647"
           style="fill:none;fill-opacity:1" /></g></g><g
       id="g116663"
       transform="translate(40,350.00002)"
       style="display:inline"><rect
         style="fill:#ebebeb;fill-opacity:1;stroke:#d2d2d2;stroke-width:0;stroke-opacity:1"
         id="rect116653"
         width="33.999992"
         height="33.999992"
         x="108"
         y="268.53333"
         rx="8.3186388"
         ry="8.3186388" /><g
         inkscape:label="go next following arrow right back"
         id="g116661"
         transform="matrix(0,1,1,0,-78.003178,114.39752)"><title
           id="title116655">go-next</title><path
           d="m 165.13672,199.00391 a 1,1 0 0 0 -0.70899,0.29296 1,1 0 0 0 0,1.41407 l 6,6 a 1.0001,1.0001 0 0 0 1.41602,0 l 6,-6 a 1,1 0 0 0 0,-1.41407 1,1 0 0 0 -1.41602,0 l -5.29101,5.29297 -5.29297,-5.29297 a 1,1 0 0 0 -0.70703,-0.29296 z"
           id="path116657"
           style="fill:#2e3436;fill-opacity:1" /><rect
           y="195.00317"
           x="163.1358"
           height="16"
           width="16"
           id="rect116659"
           style="fill:none;fill-opacity:1" /></g></g><rect
       style="display:inline;fill:#d8d8d8;fill-opacity:1;stroke:#62a0ea;stroke-width:2;stroke-dasharray:none;stroke-opacity:1"
       id="rect116673"
       width="504"
       height="33.999992"
       x="383"
       y="618.53333"
       rx="8.3186388"
       ry="8.3186388" /><g
       inkscape:label="edit clear delete remove backspace"
       id="g135021"
       transform="rotate(90,286.80283,751.20034)"><title
         id="title135007">edit-clear</title><path
         id="rect298747-1"
         style="fill:#2e3436;fill-opacity:1"
         d="m 227,162 c -0.83333,0 -1.55807,0.34381 -2.29297,0.78125 -0.7349,0.43744 -1.46362,1.00262 -2.12695,1.59961 -0.66333,0.59699 -1.25599,1.22191 -1.70899,1.79687 -0.2265,0.28749 -0.41796,0.56013 -0.57031,0.83594 C 220.14843,167.28948 220,167.54167 220,168 c 0,0.45833 0.14843,0.71052 0.30078,0.98633 0.15235,0.27581 0.34381,0.54845 0.57031,0.83594 0.453,0.57496 1.04566,1.19988 1.70899,1.79687 0.66333,0.59699 1.39205,1.16217 2.12695,1.59961 C 225.44193,173.65619 226.16667,174 227,174 h 6 c 1.6447,0 3,-1.3553 3,-3 v -6 c 0,-1.6447 -1.3553,-3 -3,-3 z m 1,3 c 0.2652,4e-5 0.51953,0.10542 0.70703,0.29297 l 1.29297,1.29297 1.29297,-1.29297 C 231.48047,165.10542 231.7348,165.00004 232,165 c 0.2652,4e-5 0.51953,0.10542 0.70703,0.29297 0.39042,0.39051 0.39042,1.02355 0,1.41406 L 231.41406,168 l 1.29297,1.29297 c 0.39042,0.39051 0.39042,1.02355 0,1.41406 -0.39051,0.39042 -1.02355,0.39042 -1.41406,0 L 230,169.41406 l -1.29297,1.29297 c -0.39051,0.39042 -1.02355,0.39042 -1.41406,0 -0.39042,-0.39051 -0.39042,-1.02355 0,-1.41406 L 228.58594,168 l -1.29297,-1.29297 c -0.39042,-0.39051 -0.39042,-1.02355 0,-1.41406 C 227.48047,165.10542 227.7348,165.00004 228,165 Z"
         transform="rotate(-90,217.06949,213.93368)" /><rect
         y="195.00317"
         x="163.1358"
         height="16"
         width="16"
         id="rect135009"
         style="fill:none;fill-opacity:1" /></g><g
       id="g2391"
       inkscape:label="funnel filter category group tag"
       transform="matrix(1,0,0,-1,838.00025,939.5333)"
       style="fill:#222222"><title
         id="title2383">funnel</title><rect
         y="296"
         x="19.99975"
         height="16"
         width="16"
         id="rect2385"
         style="fill:none" /><path
         id="path54955"
         d="m 19.99975,311 h 15 l -6,-7 v -6 l -3,-2 v 8 z"
         style="fill:#2e3436;fill-opacity:1" /></g><g
       id="g68206"
       transform="translate(90,360)"
       style="display:inline;fill:#ebebeb;fill-opacity:1"><g
         id="g68204"
         style="fill:#ebebeb;fill-opacity:1"><rect
           style="fill:#ebebeb;fill-opacity:1;stroke:#d2d2d2;stroke-width:0;stroke-opacity:1"
           id="rect68202"
           width="33.999992"
           height="33.999992"
           x="956.11023"
           y="258.53333"
           rx="8.3186388"
           ry="8.3186388" /></g></g><g
       inkscape:label="view list three lines dots squares"
       id="g126538"
       transform="rotate(90,400.85794,865.25545)"><title
         id="title126498">view-list</title><path
         id="rect6191"
         style="fill:#2e3436;fill-opacity:1;stroke-width:1.1547"
         d="m -209.00317,164.13581 c -0.554,0 -1,0.446 -1,1 v 2 c 0,0.554 0.446,1 1,1 h 2 c 0.554,0 1,-0.446 1,-1 v -2 c 0,-0.554 -0.446,-1 -1,-1 z m 5,1 v 2 h 8 v -2 z m -5,4.01562 c -0.554,0 -1,0.446 -1,1 v 1.97852 c 0,0.554 0.446,1 1,1 h 2 c 0.554,0 1,-0.446 1,-1 v -1.97852 c 0,-0.554 -0.446,-1 -1,-1 z m 5,0.98438 v 2 h 8 v -2 z m -5,4 c -0.554,0 -1,0.446 -1,1 v 1.97851 c 0,0.554 0.446,1 1,1 h 2 c 0.554,0 1,-0.446 1,-1 v -1.97851 c 0,-0.554 -0.446,-1 -1,-1 z m 5,0.98437 v 2 h 8 v -2 z"
         transform="rotate(-90)" /><rect
         y="195.00317"
         x="163.1358"
         height="16"
         width="16"
         id="rect126500"
         style="fill:none;fill-opacity:1" /></g><rect
       style="fill:#ebebeb;fill-opacity:1;stroke:#d2d2d2;stroke-width:0;stroke-opacity:1"
       id="rect6931"
       width="33.999992"
       height="33.999992"
       x="894.11023"
       y="378.53333"
       rx="8.3186388"
       ry="8.3186388" /><g
       inkscape:label="edit find search loupe"
       id="g132298"
       transform="rotate(90,444.85792,669.25544)"><title
         id="title132282">edit-find</title><rect
         y="195.00317"
         x="163.1358"
         height="16"
         width="16"
         id="rect132284"
         style="fill:none;fill-opacity:1" /><path
         id="path104159"
         d="m 163.13581,204.50317 c 0,3.5779 2.9221,6.5 6.5,6.5 3.5779,0 6.49805,-2.9221 6.49805,-6.5 0,-1.42901 -0.46837,-2.75273 -1.25586,-3.82812 l 3.94531,-3.94532 c 0.93804,-0.95834 -0.49946,-2.36459 -1.4375,-1.40625 l -3.92969,3.92969 c -1.07377,-0.78482 -2.39435,-1.25 -3.82031,-1.25 -3.5779,0 -6.5,2.9221 -6.5,6.5 z m 2,0 c 0,-2.497 2.003,-4.5 4.5,-4.5 2.497,0 4.49805,2.003 4.49805,4.5 0,2.497 -2.00105,4.5 -4.49805,4.5 -2.497,0 -4.5,-2.003 -4.5,-4.5 z"
         style="fill:#2e3436;fill-opacity:1" /></g><g
       id="g4278"
       inkscape:label="view more three dots vertical"
       transform="translate(768.99392,-319.46669)"><title
         id="title39743">view-more</title><rect
         id="rect20588"
         width="16"
         height="16"
         x="92.00605"
         y="708"
         style="fill:none" /><path
         id="path4264"
         style="opacity:1;fill:#2e3436;fill-opacity:1;stroke-width:0"
         d="m 67.994141,222 a 2,2 0 0 0 -2,2 2,2 0 0 0 2,2 2,2 0 0 0 2,-2 2,2 0 0 0 -2,-2 z m 0,6 a 2,2 0 0 0 -2,2 2,2 0 0 0 2,2 2,2 0 0 0 2,-2 2,2 0 0 0 -2,-2 z m 0,6 a 2,2 0 0 0 -2,2 2,2 0 0 0 2,2 2,2 0 0 0 2,-2 2,2 0 0 0 -2,-2 z"
         transform="translate(32.00605,486)" /></g><g
       id="g6956"
       transform="translate(90,120)"
       style="display:inline;fill:#ebebeb;fill-opacity:1"><g
         id="g6954"
         style="fill:#ebebeb;fill-opacity:1"><rect
           style="fill:#ebebeb;fill-opacity:1;stroke:#d2d2d2;stroke-width:0;stroke-opacity:1"
           id="rect6952"
           width="33.999992"
           height="33.999992"
           x="956.11023"
           y="258.53333"
           rx="8.3186388"
           ry="8.3186388" /></g></g><g
       inkscape:label="view list three lines dots squares"
       id="g6964"
       transform="rotate(90,520.85794,745.25545)"><title
         id="title6958">view-list</title><path
         id="path6960"
         style="fill:#2e3436;fill-opacity:1;stroke-width:1.1547"
         d="m -209.00317,164.13581 c -0.554,0 -1,0.446 -1,1 v 2 c 0,0.554 0.446,1 1,1 h 2 c 0.554,0 1,-0.446 1,-1 v -2 c 0,-0.554 -0.446,-1 -1,-1 z m 5,1 v 2 h 8 v -2 z m -5,4.01562 c -0.554,0 -1,0.446 -1,1 v 1.97852 c 0,0.554 0.446,1 1,1 h 2 c 0.554,0 1,-0.446 1,-1 v -1.97852 c 0,-0.554 -0.446,-1 -1,-1 z m 5,0.98438 v 2 h 8 v -2 z m -5,4 c -0.554,0 -1,0.446 -1,1 v 1.97851 c 0,0.554 0.446,1 1,1 h 2 c 0.554,0 1,-0.446 1,-1 v -1.97851 c 0,-0.554 -0.446,-1 -1,-1 z m 5,0.98437 v 2 h 8 v -2 z"
         transform="rotate(-90)" /><rect
         y="195.00317"
         x="163.1358"
         height="16"
         width="16"
         id="rect6962"
         style="fill:none;fill-opacity:1" /></g><rect
       style="fill:#d8d8d8;fill-opacity:1;stroke:#d2d2d2;stroke-width:0;stroke-opacity:1"
       id="rect6966"
       width="33.999992"
       height="33.999992"
       x="894.11023"
       y="618.53333"
       rx="8.3186388"
       ry="8.3186388" /><g
       inkscape:label="edit find search loupe"
       id="g6974"
       transform="rotate(90,324.85792,789.25544)"><title
         id="title6968">edit-find</title><rect
         y="195.00317"
         x="163.1358"
         height="16"
         width="16"
         id="rect6970"
         style="fill:none;fill-opacity:1" /><path
         id="path6972"
         d="m 163.13581,204.50317 c 0,3.5779 2.9221,6.5 6.5,6.5 3.5779,0 6.49805,-2.9221 6.49805,-6.5 0,-1.42901 -0.46837,-2.75273 -1.25586,-3.82812 l 3.94531,-3.94532 c 0.93804,-0.95834 -0.49946,-2.36459 -1.4375,-1.40625 l -3.92969,3.92969 c -1.07377,-0.78482 -2.39435,-1.25 -3.82031,-1.25 -3.5779,0 -6.5,2.9221 -6.5,6.5 z m 2,0 c 0,-2.497 2.003,-4.5 4.5,-4.5 2.497,0 4.49805,2.003 4.49805,4.5 0,2.497 -2.00105,4.5 -4.49805,4.5 -2.497,0 -4.5,-2.003 -4.5,-4.5 z"
         style="fill:#2e3436;fill-opacity:1" /></g><text
       xml:space="preserve"
       style="font-style:normal;font-variant:normal;font-weight:normal;font-stretch:normal;font-size:14.6667px;line-height:0%;font-family:Cantarell;-inkscape-font-specification:'Cantarell, Normal';font-variant-ligatures:normal;font-variant-caps:normal;font-variant-numeric:normal;font-variant-east-asian:normal;text-align:start;letter-spacing:0px;word-spacing:0px;text-anchor:start;display:inline;fill:#2e3436;fill-opacity:1;stroke:none;stroke-width:0.999999"
       x="415.30124"
       y="401.43512"
       id="text15224"><tspan
         sodipodi:role="line"
         id="tspan15222"
         x="415.30124"
         y="401.43512"
         style="font-style:normal;font-variant:normal;font-weight:bold;font-stretch:normal;font-size:14.6667px;line-height:1.25;font-family:Cantarell;-inkscape-font-specification:Cantarell;font-variant-ligatures:normal;font-variant-caps:normal;font-variant-numeric:normal;font-variant-east-asian:normal;text-align:start;text-anchor:start;fill:#2e3436;fill-opacity:1;stroke-width:0.999999">Home</tspan></text><path
       id="path15956"
       style="display:inline;fill:#ebebeb;fill-opacity:1;stroke:#ebebeb;stroke-width:0;stroke-miterlimit:4;stroke-dasharray:none;stroke-opacity:1"
       d="m 109,911.5335 1052.0004,-0.013 c 4.9858,-10e-5 8.9996,4.0001 8.9996,9.0022 v 39.0105 l -1070,0.013 v -39.0105 c 0,-4.9873 4.0142,-9.0021 9,-9.0022 z"
       sodipodi:nodetypes="sssccss" /><g
       id="g15964"
       transform="translate(130,660)"
       style="display:inline"><g
         id="g15962"><rect
           style="fill:#ebebeb;fill-opacity:1;stroke:#d2d2d2;stroke-width:0;stroke-opacity:1"
           id="rect15958"
           width="33.999992"
           height="33.999992"
           x="956.11023"
           y="258.53333"
           rx="8.3186388"
           ry="8.3186388" /><path
           id="path15960"
           style="fill:#2e3436;fill-opacity:1;stroke:none;stroke-width:2;stroke-linecap:square;stroke-linejoin:round;stroke-dasharray:8, 8"
           d="m 966,269.53331 v 2 h 14 v -2 z m 0,5 v 2 h 14 v -2 z m 0,5 v 2 h 14 v -2 z" /></g></g><circle
       style="display:inline;fill:#d8d8d8;fill-opacity:1;stroke:#3584e4;stroke-width:0;stroke-miterlimit:4;stroke-dasharray:none"
       id="circle15966"
       cx="-1145.9098"
       cy="935.53223"
       r="10.999997"
       transform="scale(-1,1)" /><g
       transform="matrix(-1,0,0,1,1194.9062,167.54617)"
       id="g15970"
       style="display:inline;fill:#2e3436;fill-opacity:1"><path
         inkscape:connector-curvature="0"
         d="m 45,764 h 1 c 0.01037,-1.2e-4 0.02079,-4.6e-4 0.03125,0 0.254951,0.0112 0.50987,0.12858 0.6875,0.3125 L 49,766.59375 51.3125,764.3125 C 51.578125,764.082 51.759172,764.007 52,764 h 1 v 1 c 0,0.28647 -0.03434,0.55065 -0.25,0.75 l -2.28125,2.28125 2.25,2.25 C 52.906938,770.46942 52.999992,770.7347 53,771 v 1 h -1 c -0.265301,-10e-6 -0.530586,-0.0931 -0.71875,-0.28125 L 49,769.4375 46.71875,771.71875 C 46.530586,771.90694 46.26529,772 46,772 h -1 v -1 c -3e-6,-0.26529 0.09306,-0.53058 0.28125,-0.71875 l 2.28125,-2.25 L 45.28125,765.75 C 45.070508,765.55537 44.97809,765.28075 45,765 Z"
         id="path15968"
         style="color:#bebebe;font-style:normal;font-variant:normal;font-weight:normal;font-stretch:normal;font-size:medium;line-height:normal;font-family:'Andale Mono';-inkscape-font-specification:'Andale Mono';text-indent:0;text-align:start;text-decoration:none;text-decoration-line:none;letter-spacing:normal;word-spacing:normal;text-transform:none;writing-mode:lr-tb;direction:ltr;text-anchor:start;display:inline;overflow:visible;visibility:visible;fill:#2e3436;fill-opacity:1;fill-rule:nonzero;stroke:none;stroke-width:1.78125;marker:none;enable-background:new" /></g><g
       id="g15982"
       transform="matrix(-1,0,0,1,249.99999,650.00002)"
       style="display:inline"><rect
         style="fill:#ebebeb;fill-opacity:1;stroke:#d2d2d2;stroke-width:0;stroke-opacity:1"
         id="rect15972"
         width="33.999992"
         height="33.999992"
         x="108"
         y="268.53333"
         rx="8.3186388"
         ry="8.3186388" /><g
         inkscape:label="go next following arrow right back"
         id="g15980"
         transform="matrix(0,1,1,0,-78.003178,114.39752)"><title
           id="title15974">go-next</title><path
           d="m 165.13672,199.00391 a 1,1 0 0 0 -0.70899,0.29296 1,1 0 0 0 0,1.41407 l 6,6 a 1.0001,1.0001 0 0 0 1.41602,0 l 6,-6 a 1,1 0 0 0 0,-1.41407 1,1 0 0 0 -1.41602,0 l -5.29101,5.29297 -5.29297,-5.29297 a 1,1 0 0 0 -0.70703,-0.29296 z"
           id="path15976"
           style="fill:#2e3436;fill-opacity:1" /><rect
           y="195.00317"
           x="163.1358"
           height="16"
           width="16"
           id="rect15978"
           style="fill:none;fill-opacity:1" /></g></g><g
       id="g15994"
       transform="translate(40,650.00002)"
       style="display:inline"><rect
         style="fill:#ebebeb;fill-opacity:1;stroke:#d2d2d2;stroke-width:0;stroke-opacity:1"
         id="rect15984"
         width="33.999992"
         height="33.999992"
         x="108"
         y="268.53333"
         rx="8.3186388"
         ry="8.3186388" /><g
         inkscape:label="go next following arrow right back"
         id="g15992"
         transform="matrix(0,1,1,0,-78.003178,114.39752)"><title
           id="title15986">go-next</title><path
           d="m 165.13672,199.00391 a 1,1 0 0 0 -0.70899,0.29296 1,1 0 0 0 0,1.41407 l 6,6 a 1.0001,1.0001 0 0 0 1.41602,0 l 6,-6 a 1,1 0 0 0 0,-1.41407 1,1 0 0 0 -1.41602,0 l -5.29101,5.29297 -5.29297,-5.29297 a 1,1 0 0 0 -0.70703,-0.29296 z"
           id="path15988"
           style="fill:#2e3436;fill-opacity:1" /><rect
           y="195.00317"
           x="163.1358"
           height="16"
           width="16"
           id="rect15990"
           style="fill:none;fill-opacity:1" /></g></g><rect
       style="display:inline;fill:#d8d8d8;fill-opacity:1;stroke:#62a0ea;stroke-width:2;stroke-dasharray:none;stroke-opacity:1"
       id="rect15996"
       width="504"
       height="33.999992"
       x="383"
       y="918.53333"
       rx="8.3186388"
       ry="8.3186388" /><g
       inkscape:label="edit clear delete remove backspace"
       id="g16004"
       transform="rotate(90,136.80283,901.20034)"><title
         id="title15998">edit-clear</title><path
         id="path16000"
         style="fill:#2e3436;fill-opacity:1"
         d="m 227,162 c -0.83333,0 -1.55807,0.34381 -2.29297,0.78125 -0.7349,0.43744 -1.46362,1.00262 -2.12695,1.59961 -0.66333,0.59699 -1.25599,1.22191 -1.70899,1.79687 -0.2265,0.28749 -0.41796,0.56013 -0.57031,0.83594 C 220.14843,167.28948 220,167.54167 220,168 c 0,0.45833 0.14843,0.71052 0.30078,0.98633 0.15235,0.27581 0.34381,0.54845 0.57031,0.83594 0.453,0.57496 1.04566,1.19988 1.70899,1.79687 0.66333,0.59699 1.39205,1.16217 2.12695,1.59961 C 225.44193,173.65619 226.16667,174 227,174 h 6 c 1.6447,0 3,-1.3553 3,-3 v -6 c 0,-1.6447 -1.3553,-3 -3,-3 z m 1,3 c 0.2652,4e-5 0.51953,0.10542 0.70703,0.29297 l 1.29297,1.29297 1.29297,-1.29297 C 231.48047,165.10542 231.7348,165.00004 232,165 c 0.2652,4e-5 0.51953,0.10542 0.70703,0.29297 0.39042,0.39051 0.39042,1.02355 0,1.41406 L 231.41406,168 l 1.29297,1.29297 c 0.39042,0.39051 0.39042,1.02355 0,1.41406 -0.39051,0.39042 -1.02355,0.39042 -1.41406,0 L 230,169.41406 l -1.29297,1.29297 c -0.39051,0.39042 -1.02355,0.39042 -1.41406,0 -0.39042,-0.39051 -0.39042,-1.02355 0,-1.41406 L 228.58594,168 l -1.29297,-1.29297 c -0.39042,-0.39051 -0.39042,-1.02355 0,-1.41406 C 227.48047,165.10542 227.7348,165.00004 228,165 Z"
         transform="rotate(-90,217.06949,213.93368)" /><rect
         y="195.00317"
         x="163.1358"
         height="16"
         width="16"
         id="rect16002"
         style="fill:none;fill-opacity:1" /></g><g
       id="g16012"
       inkscape:label="funnel filter category group tag"
       transform="matrix(1,0,0,-1,838.00025,1239.5333)"
       style="fill:#222222"><title
         id="title16006">funnel</title><rect
         y="296"
         x="19.99975"
         height="16"
         width="16"
         id="rect16008"
         style="fill:none" /><path
         id="path16010"
         d="m 19.99975,311 h 15 l -6,-7 v -6 l -3,-2 v 8 z"
         style="fill:#2e3436;fill-opacity:1" /></g><g
       id="g16018"
       transform="translate(90,660)"
       style="display:inline;fill:#ebebeb;fill-opacity:1"><g
         id="g16016"
         style="fill:#ebebeb;fill-opacity:1"><rect
           style="fill:#ebebeb;fill-opacity:1;stroke:#d2d2d2;stroke-width:0;stroke-opacity:1"
           id="rect16014"
           width="33.999992"
           height="33.999992"
           x="956.11023"
           y="258.53333"
           rx="8.3186388"
           ry="8.3186388" /></g></g><g
       inkscape:label="view list three lines dots squares"
       id="g16026"
       transform="rotate(90,250.85794,1015.2554)"><title
         id="title16020">view-list</title><path
         id="path16022"
         style="fill:#2e3436;fill-opacity:1;stroke-width:1.1547"
         d="m -209.00317,164.13581 c -0.554,0 -1,0.446 -1,1 v 2 c 0,0.554 0.446,1 1,1 h 2 c 0.554,0 1,-0.446 1,-1 v -2 c 0,-0.554 -0.446,-1 -1,-1 z m 5,1 v 2 h 8 v -2 z m -5,4.01562 c -0.554,0 -1,0.446 -1,1 v 1.97852 c 0,0.554 0.446,1 1,1 h 2 c 0.554,0 1,-0.446 1,-1 v -1.97852 c 0,-0.554 -0.446,-1 -1,-1 z m 5,0.98438 v 2 h 8 v -2 z m -5,4 c -0.554,0 -1,0.446 -1,1 v 1.97851 c 0,0.554 0.446,1 1,1 h 2 c 0.554,0 1,-0.446 1,-1 v -1.97851 c 0,-0.554 -0.446,-1 -1,-1 z m 5,0.98437 v 2 h 8 v -2 z"
         transform="rotate(-90)" /><rect
         y="195.00317"
         x="163.1358"
         height="16"
         width="16"
         id="rect16024"
         style="fill:none;fill-opacity:1" /></g><rect
       style="fill:#d8d8d8;fill-opacity:1;stroke:#d2d2d2;stroke-width:0;stroke-opacity:1"
       id="rect16028"
       width="33.999992"
       height="33.999992"
       x="894.11023"
       y="918.53333"
       rx="8.3186388"
       ry="8.3186388" /><g
       inkscape:label="edit find search loupe"
       id="g16036"
       transform="rotate(90,174.85792,939.25544)"><title
         id="title16030">edit-find</title><rect
         y="195.00317"
         x="163.1358"
         height="16"
         width="16"
         id="rect16032"
         style="fill:none;fill-opacity:1" /><path
         id="path16034"
         d="m 163.13581,204.50317 c 0,3.5779 2.9221,6.5 6.5,6.5 3.5779,0 6.49805,-2.9221 6.49805,-6.5 0,-1.42901 -0.46837,-2.75273 -1.25586,-3.82812 l 3.94531,-3.94532 c 0.93804,-0.95834 -0.49946,-2.36459 -1.4375,-1.40625 l -3.92969,3.92969 c -1.07377,-0.78482 -2.39435,-1.25 -3.82031,-1.25 -3.5779,0 -6.5,2.9221 -6.5,6.5 z m 2,0 c 0,-2.497 2.003,-4.5 4.5,-4.5 2.497,0 4.49805,2.003 4.49805,4.5 0,2.497 -2.00105,4.5 -4.49805,4.5 -2.497,0 -4.5,-2.003 -4.5,-4.5 z"
         style="fill:#2e3436;fill-opacity:1" /></g><g
       inkscape:label="edit find search loupe"
       id="g18281"
       transform="rotate(90,69.85792,534.25544)"
       style="opacity:0.5"><title
         id="title18275">edit-find</title><rect
         y="195.00317"
         x="163.1358"
         height="16"
         width="16"
         id="rect18277"
         style="fill:none;fill-opacity:1" /><path
         id="path18279"
         d="m 163.13581,204.50317 c 0,3.5779 2.9221,6.5 6.5,6.5 3.5779,0 6.49805,-2.9221 6.49805,-6.5 0,-1.42901 -0.46837,-2.75273 -1.25586,-3.82812 l 3.94531,-3.94532 c 0.93804,-0.95834 -0.49946,-2.36459 -1.4375,-1.40625 l -3.92969,3.92969 c -1.07377,-0.78482 -2.39435,-1.25 -3.82031,-1.25 -3.5779,0 -6.5,2.9221 -6.5,6.5 z m 2,0 c 0,-2.497 2.003,-4.5 4.5,-4.5 2.497,0 4.49805,2.003 4.49805,4.5 0,2.497 -2.00105,4.5 -4.49805,4.5 -2.497,0 -4.5,-2.003 -4.5,-4.5 z"
         style="fill:#2e3436;fill-opacity:1" /></g><g
       inkscape:label="process stop reload"
       id="g67751"
       transform="translate(340,339.53331)"><title
         id="title67741">process-stop</title><path
         id="path494733"
         style="fill:#2e3436;-inkscape-fill-opacity:1"
         d="m 55,590 a 1,1 0 0 0 -0.70703,0.29297 1,1 0 0 0 0,1.41406 L 58.58594,596 l -4.29297,4.29297 a 1,1 0 0 0 0,1.41406 1,1 0 0 0 1.41406,0 L 60,597.41406 l 4.29297,4.29297 a 1,1 0 0 0 1.41406,0 1,1 0 0 0 0,-1.41406 L 61.41406,596 l 4.29297,-4.29297 a 1,1 0 0 0 0,-1.41406 A 1,1 0 0 0 65,590 1,1 0 0 0 64.29297,590.29297 L 60,594.58594 55.70703,590.29297 A 1,1 0 0 0 55,590 Z" /><rect
         style="fill:none;fill-opacity:1"
         id="rect67743"
         y="588"
         x="52"
         height="16"
         width="16" /></g><path
       id="path33819"
       style="display:inline;fill:none;fill-opacity:1;stroke:#deddda;stroke-width:2;stroke-miterlimit:4;stroke-dasharray:none;stroke-opacity:1"
       d="m 1170,1058.5096 -219,0.01 c -4.9858,2e-4 -9,4.0166 -9,9.0039 v 19.0098"
       sodipodi:nodetypes="cssc" /><path
       id="path116625"
       style="display:inline;fill:#ffffff;fill-opacity:1;stroke:#f6f5f4;stroke-width:0;stroke-miterlimit:4;stroke-dasharray:none;stroke-opacity:1"
       d="m 1170,1058.5096 -219,0.01 c -4.9858,2e-4 -9,4.0166 -9,9.0039 v 19.0098 h 218 c 10,0 10,-10 10,-10 z"
       sodipodi:nodetypes="csscccc" /><g
       id="g35285"
       transform="translate(0,-10)"><rect
         style="opacity:1;fill:url(#linearGradient35277);fill-opacity:1;stroke:none;stroke-width:2;stroke-linecap:round;stroke-linejoin:round;stroke-dasharray:none;stroke-dashoffset:2"
         id="rect35275"
         width="41.230759"
         height="1135"
         x="-1023.5333"
         y="-1200"
         transform="matrix(0,-1,-1,0,0,0)" /><rect
         style="opacity:1;fill:url(#linearGradient35281);fill-opacity:1;stroke:none;stroke-width:2;stroke-linecap:round;stroke-linejoin:round;stroke-dasharray:none;stroke-dashoffset:2"
         id="rect35279"
         width="41.230759"
         height="1135"
         x="1023.5333"
         y="-1200"
         transform="rotate(90)" /></g><rect
       style="display:inline;fill:url(#linearGradient35334);fill-opacity:1;stroke:none;stroke-width:2;stroke-linecap:round;stroke-linejoin:round;stroke-dasharray:none;stroke-dashoffset:2"
       id="rect35332"
       width="41.230759"
       height="1135"
       x="-483.14868"
       y="-1202.5"
       transform="matrix(0,-1,-1,0,0,0)" /><text
       xml:space="preserve"
       style="font-style:normal;font-variant:normal;font-weight:normal;font-stretch:normal;font-size:14.6667px;line-height:0%;font-family:Cantarell;-inkscape-font-specification:'Cantarell, Normal';font-variant-ligatures:normal;font-variant-caps:normal;font-variant-numeric:normal;font-variant-east-asian:normal;text-align:start;letter-spacing:0px;word-spacing:0px;text-anchor:start;display:inline;fill:#2e3436;fill-opacity:1;stroke:none;stroke-width:0.999999"
       x="109.30124"
       y="497.43512"
       id="text169947"><tspan
         sodipodi:role="line"
         id="tspan169945"
         x="109.30124"
         y="497.43512"
         style="font-style:normal;font-variant:normal;font-weight:normal;font-stretch:normal;font-size:14.6667px;line-height:1.25;font-family:Cantarell;-inkscape-font-specification:Cantarell;font-variant-ligatures:normal;font-variant-caps:normal;font-variant-numeric:normal;font-variant-east-asian:normal;text-align:start;text-anchor:start;fill:#2e3436;fill-opacity:1;stroke-width:0.999999">Button to start a search is to the  left of the path bar.</tspan></text><text
       xml:space="preserve"
       style="font-style:normal;font-variant:normal;font-weight:normal;font-stretch:normal;font-size:14.6667px;line-height:0%;font-family:Cantarell;-inkscape-font-specification:'Cantarell, Normal';font-variant-ligatures:normal;font-variant-caps:normal;font-variant-numeric:normal;font-variant-east-asian:normal;text-align:start;letter-spacing:0px;word-spacing:0px;text-anchor:start;display:inline;fill:#2e3436;fill-opacity:1;stroke:none;stroke-width:0.999999"
       x="109.30124"
       y="737.43512"
       id="text36064"><tspan
         sodipodi:role="line"
         id="tspan36062"
         x="109.30124"
         y="737.43512"
         style="font-style:normal;font-variant:normal;font-weight:normal;font-stretch:normal;font-size:14.6667px;line-height:1.25;font-family:Cantarell;-inkscape-font-specification:Cantarell;font-variant-ligatures:normal;font-variant-caps:normal;font-variant-numeric:normal;font-variant-east-asian:normal;text-align:start;text-anchor:start;fill:#2e3436;fill-opacity:1;stroke-width:0.999999">Clicking the search button transforms the path bar into an active search entry, with clear and filter buttons on the right sides.</tspan></text><rect
       style="fill:#d8d8d8;fill-opacity:1;stroke:#d2d2d2;stroke-width:0;stroke-opacity:1"
       id="rect36066"
       width="33.999992"
       height="33.999992"
       x="1432.1102"
       y="618.53333"
       rx="8.3186388"
       ry="8.3186388" /><g
       id="g36074"
       inkscape:label="funnel filter category group tag"
       transform="matrix(1,0,0,-1,1422.0003,939.5333)"
       style="fill:#222222"><title
         id="title36068">funnel</title><rect
         y="296"
         x="19.99975"
         height="16"
         width="16"
         id="rect36070"
         style="fill:none" /><path
         id="path36072"
         d="m 19.99975,311 h 15 l -6,-7 v -6 l -3,-2 v 8 z"
         style="fill:#2e3436;fill-opacity:1" /></g><text
       xml:space="preserve"
       style="font-style:normal;font-variant:normal;font-weight:normal;font-stretch:normal;font-size:14.6667px;line-height:0%;font-family:Cantarell;-inkscape-font-specification:'Cantarell, Normal';font-variant-ligatures:normal;font-variant-caps:normal;font-variant-numeric:normal;font-variant-east-asian:normal;text-align:start;letter-spacing:0px;word-spacing:0px;text-anchor:start;display:inline;fill:#2e3436;fill-opacity:1;stroke:none;stroke-width:0.999999"
       x="109.30124"
       y="1137.4351"
       id="text37150"><tspan
         sodipodi:role="line"
         id="tspan37148"
         x="109.30124"
         y="1137.4351"
         style="font-style:normal;font-variant:normal;font-weight:normal;font-stretch:normal;font-size:14.6667px;line-height:1.25;font-family:Cantarell;-inkscape-font-specification:Cantarell;font-variant-ligatures:normal;font-variant-caps:normal;font-variant-numeric:normal;font-variant-east-asian:normal;text-align:start;text-anchor:start;fill:#2e3436;fill-opacity:1;stroke-width:0.999999">When typing into the search field searches happen automatically. While a search is active the search icon shows a stop icon instead, clicking it will cancel the current search.</tspan></text><path
       style="fill:none;stroke:#000000;stroke-width:1px;stroke-linecap:butt;stroke-linejoin:miter;stroke-opacity:1"
       d="m 416.5,623.53331 v 25"
       id="path37215" /><path
       style="fill:none;stroke:#000000;stroke-width:1px;stroke-linecap:butt;stroke-linejoin:miter;stroke-opacity:1"
       d="m 492.5,923.53331 v 25"
       id="path37217" /><text
       xml:space="preserve"
       style="font-style:normal;font-variant:normal;font-weight:normal;font-stretch:normal;font-size:14.6667px;line-height:0%;font-family:Cantarell;-inkscape-font-specification:'Cantarell, Normal';font-variant-ligatures:normal;font-variant-caps:normal;font-variant-numeric:normal;font-variant-east-asian:normal;text-align:start;letter-spacing:0px;word-spacing:0px;text-anchor:start;display:inline;fill:#2e3436;fill-opacity:1;stroke:none;stroke-width:0.999999"
       x="415.30124"
       y="941.43512"
       id="text37221"><tspan
         sodipodi:role="line"
         id="tspan37219"
         x="415.30124"
         y="941.43512"
         style="font-style:normal;font-variant:normal;font-weight:normal;font-stretch:normal;font-size:14.6667px;line-height:1.25;font-family:Cantarell;-inkscape-font-specification:Cantarell;font-variant-ligatures:normal;font-variant-caps:normal;font-variant-numeric:normal;font-variant-east-asian:normal;text-align:start;text-anchor:start;fill:#2e3436;fill-opacity:1;stroke-width:0.999999">search term</tspan></text><path
       style="display:inline;fill:#f6f5f4;fill-opacity:1;stroke:#deddda;stroke-width:0.999999;stroke-linecap:square;stroke-linejoin:miter;stroke-miterlimit:4;stroke-dasharray:none;stroke-opacity:1"
       d="m 1309.5,675.06069 h 125.492 l 14.1981,-14 14.1989,14 H 1590.5 c 4.986,0 9,4.014 9,9 v 226.9742 c 0,4.986 -4.014,9 -9,9 h -281 c -4.986,0 -9,-4.014 -9,-9 v -226.9742 c 0,-4.986 4.014,-9 9,-9 z"
       id="path43897-6-4-5"
       inkscape:connector-curvature="0"
       sodipodi:nodetypes="scccssssssss" /><rect
       style="display:inline;fill:#deddda;fill-opacity:1;stroke:#d2d2d2;stroke-width:0;stroke-opacity:1"
       id="rect6966-9"
       width="270"
       height="33.999992"
       x="1315"
       y="717.53333"
       rx="8.3186388"
       ry="8.3186388" /><text
       xml:space="preserve"
       style="font-style:normal;font-variant:normal;font-weight:normal;font-stretch:normal;font-size:14.6667px;line-height:0%;font-family:Cantarell;-inkscape-font-specification:'Cantarell, Normal';font-variant-ligatures:normal;font-variant-caps:normal;font-variant-numeric:normal;font-variant-east-asian:normal;text-align:start;letter-spacing:0px;word-spacing:0px;text-anchor:start;display:inline;fill:#2e3436;fill-opacity:1;stroke:none;stroke-width:0.999999"
       x="1317.4886"
       y="705.54932"
       id="text15224-5"><tspan
         sodipodi:role="line"
         id="tspan15222-62"
         x="1317.4886"
         y="705.54932"
         style="font-style:normal;font-variant:normal;font-weight:bold;font-stretch:normal;font-size:14.6667px;line-height:1.25;font-family:Cantarell;-inkscape-font-specification:Cantarell;font-variant-ligatures:normal;font-variant-caps:normal;font-variant-numeric:normal;font-variant-east-asian:normal;text-align:start;text-anchor:start;fill:#2e3436;fill-opacity:1;stroke-width:0.999999">When</tspan></text><text
       xml:space="preserve"
       style="font-style:normal;font-variant:normal;font-weight:normal;font-stretch:normal;font-size:14.6667px;line-height:0%;font-family:Cantarell;-inkscape-font-specification:'Cantarell, Normal';font-variant-ligatures:normal;font-variant-caps:normal;font-variant-numeric:normal;font-variant-east-asian:normal;text-align:start;letter-spacing:0px;word-spacing:0px;text-anchor:start;display:inline;fill:#2e3436;fill-opacity:1;stroke:none;stroke-width:0.999999"
       x="1317.4886"
       y="777.54932"
       id="text43836"><tspan
         sodipodi:role="line"
         id="tspan43834"
         x="1317.4886"
         y="777.54932"
         style="font-style:normal;font-variant:normal;font-weight:bold;font-stretch:normal;font-size:14.6667px;line-height:1.25;font-family:Cantarell;-inkscape-font-specification:Cantarell;font-variant-ligatures:normal;font-variant-caps:normal;font-variant-numeric:normal;font-variant-east-asian:normal;text-align:start;text-anchor:start;fill:#2e3436;fill-opacity:1;stroke-width:0.999999">What</tspan></text><text
       xml:space="preserve"
       style="font-style:normal;font-variant:normal;font-weight:normal;font-stretch:normal;font-size:14.6667px;line-height:0%;font-family:Cantarell;-inkscape-font-specification:'Cantarell, Normal';font-variant-ligatures:normal;font-variant-caps:normal;font-variant-numeric:normal;font-variant-east-asian:normal;text-align:start;letter-spacing:0px;word-spacing:0px;text-anchor:start;display:inline;fill:#2e3436;fill-opacity:1;stroke:none;stroke-width:0.999999"
       x="1319.4886"
       y="853.54932"
       id="text43840"><tspan
         sodipodi:role="line"
         id="tspan43838"
         x="1319.4886"
         y="853.54932"
         style="font-style:normal;font-variant:normal;font-weight:bold;font-stretch:normal;font-size:14.6667px;line-height:1.25;font-family:Cantarell;-inkscape-font-specification:Cantarell;font-variant-ligatures:normal;font-variant-caps:normal;font-variant-numeric:normal;font-variant-east-asian:normal;text-align:start;text-anchor:start;fill:#2e3436;fill-opacity:1;stroke-width:0.999999">Search</tspan></text><rect
       style="display:inline;fill:#deddda;fill-opacity:1;stroke:#d2d2d2;stroke-width:0;stroke-opacity:1"
       id="rect45666"
       width="270"
       height="33.999992"
       x="1315"
       y="789.53333"
       rx="8.3186388"
       ry="8.3186388" /><rect
       style="display:inline;fill:#c0bfbc;fill-opacity:1;stroke:#d2d2d2;stroke-width:0;stroke-opacity:1"
       id="rect45668"
       width="270"
       height="33.999992"
       x="1315"
       y="865.53333"
       rx="8.3186388"
       ry="8.3186388" /><text
       xml:space="preserve"
       style="font-style:normal;font-variant:normal;font-weight:normal;font-stretch:normal;font-size:14.6667px;line-height:0%;font-family:Cantarell;-inkscape-font-specification:'Cantarell, Normal';font-variant-ligatures:normal;font-variant-caps:normal;font-variant-numeric:normal;font-variant-east-asian:normal;text-align:start;letter-spacing:0px;word-spacing:0px;text-anchor:start;display:inline;fill:#2e3436;fill-opacity:1;stroke:none;stroke-width:0.999999"
       x="1323.4886"
       y="739.54932"
       id="text45672"><tspan
         sodipodi:role="line"
         id="tspan45670"
         x="1323.4886"
         y="739.54932"
         style="font-style:normal;font-variant:normal;font-weight:bold;font-stretch:normal;font-size:14.6667px;line-height:1.25;font-family:Cantarell;-inkscape-font-specification:Cantarell;font-variant-ligatures:normal;font-variant-caps:normal;font-variant-numeric:normal;font-variant-east-asian:normal;text-align:start;text-anchor:start;fill:#2e3436;fill-opacity:1;stroke-width:0.999999">Select Dates...</tspan></text><text
       xml:space="preserve"
       style="font-style:normal;font-variant:normal;font-weight:normal;font-stretch:normal;font-size:14.6667px;line-height:0%;font-family:Cantarell;-inkscape-font-specification:'Cantarell, Normal';font-variant-ligatures:normal;font-variant-caps:normal;font-variant-numeric:normal;font-variant-east-asian:normal;text-align:start;letter-spacing:0px;word-spacing:0px;text-anchor:start;display:inline;fill:#2e3436;fill-opacity:1;stroke:none;stroke-width:0.999999"
       x="1323.4886"
       y="811.54932"
       id="text45676"><tspan
         sodipodi:role="line"
         id="tspan45674"
         x="1323.4886"
         y="811.54932"
         style="font-style:normal;font-variant:normal;font-weight:bold;font-stretch:normal;font-size:14.6667px;line-height:1.25;font-family:Cantarell;-inkscape-font-specification:Cantarell;font-variant-ligatures:normal;font-variant-caps:normal;font-variant-numeric:normal;font-variant-east-asian:normal;text-align:start;text-anchor:start;fill:#2e3436;fill-opacity:1;stroke-width:0.999999">Anything</tspan></text><text
       xml:space="preserve"
       style="font-style:normal;font-variant:normal;font-weight:normal;font-stretch:normal;font-size:14.6667px;line-height:0%;font-family:Cantarell;-inkscape-font-specification:'Cantarell, Normal';font-variant-ligatures:normal;font-variant-caps:normal;font-variant-numeric:normal;font-variant-east-asian:normal;text-align:start;letter-spacing:0px;word-spacing:0px;text-anchor:start;display:inline;fill:#2e3436;fill-opacity:1;stroke:none;stroke-width:0.999999"
       x="1349.4886"
       y="888.54932"
       id="text45680"><tspan
         sodipodi:role="line"
         id="tspan45678"
         x="1349.4886"
         y="888.54932"
         style="font-style:normal;font-variant:normal;font-weight:bold;font-stretch:normal;font-size:14.6667px;line-height:1.25;font-family:Cantarell;-inkscape-font-specification:Cantarell;font-variant-ligatures:normal;font-variant-caps:normal;font-variant-numeric:normal;font-variant-east-asian:normal;text-align:start;text-anchor:start;fill:#2e3436;fill-opacity:1;stroke-width:0.999999">Full Text</tspan></text><path
       id="rect45682"
       style="display:inline;fill:#deddda;fill-opacity:1;stroke:#d2d2d2;stroke-width:0;stroke-opacity:1"
       d="m 1450,865.53331 v 34 h 126.6816 c 4.6086,0 8.3184,-3.70984 8.3184,-8.31836 v -17.36328 c 0,-4.60852 -3.7098,-8.31836 -8.3184,-8.31836 z" /><text
       xml:space="preserve"
       style="font-style:normal;font-variant:normal;font-weight:normal;font-stretch:normal;font-size:14.6667px;line-height:0%;font-family:Cantarell;-inkscape-font-specification:'Cantarell, Normal';font-variant-ligatures:normal;font-variant-caps:normal;font-variant-numeric:normal;font-variant-east-asian:normal;text-align:start;letter-spacing:0px;word-spacing:0px;text-anchor:start;display:inline;fill:#2e3436;fill-opacity:1;stroke:none;stroke-width:0.999999"
       x="1481.4886"
       y="888.54932"
       id="text45741"><tspan
         sodipodi:role="line"
         id="tspan45739"
         x="1481.4886"
         y="888.54932"
         style="font-style:normal;font-variant:normal;font-weight:bold;font-stretch:normal;font-size:14.6667px;line-height:1.25;font-family:Cantarell;-inkscape-font-specification:Cantarell;font-variant-ligatures:normal;font-variant-caps:normal;font-variant-numeric:normal;font-variant-east-asian:normal;text-align:start;text-anchor:start;fill:#2e3436;fill-opacity:1;stroke-width:0.999999">File Name</tspan></text><g
       transform="translate(851,788.53331)"
       inkscape:label="process working ongoing spinner"
       id="g9883"
       mask="none"
       style="display:inline"><title
         id="title9722">process-working</title><rect
         id="rect9885"
         y="277"
         x="101"
         height="16"
         width="16"
         style="fill:none" /><path
         d="m 108.97872,278.05469 a 1.4735761,1.4735761 0 0 0 -0.26954,0.0254 c -2.99944,0.15994 -5.62743,2.22182 -6.45117,5.1289 -0.76307,3.01803 0.56849,6.23299 3.24219,7.82813 2.71802,1.51837 6.16731,1.06453 8.40039,-1.10547 2.17036,-2.23271 2.62373,-5.68143 1.10547,-8.40039 1.50663,2.72567 1.03203,6.16264 -1.13477,8.37109 -2.2278,2.14744 -5.65405,2.57687 -8.33007,1.06446 -2.61805,-1.57534 -3.91436,-4.73063 -3.17969,-7.67188 -0.70834,2.94805 0.62215,6.07171 3.2207,7.60156 2.65396,1.4709 6.02541,1.00435 8.17383,-1.10937 2.09437,-2.16778 2.5138,-5.52851 1.03711,-8.13281 1.45299,2.61798 0.9914,5.9559 -1.0957,8.07422 -2.13767,2.06775 -5.46487,2.48416 -8.03321,1.02539 -2.51836,-1.5093 -3.77607,-4.57212 -3.06445,-7.39649 -0.6853,2.83118 0.60465,5.86236 3.10351,7.32617 2.54628,1.41726 5.82063,0.96373 7.87891,-1.07031 2.01468,-2.07765 2.42109,-5.33932 0.99805,-7.83594 1.39934,2.5103 0.95078,5.74917 -1.05664,7.77735 -2.04754,1.98806 -5.27569,2.39146 -7.73633,0.98633 -2.41867,-1.44326 -3.6378,-4.41555 -2.94922,-7.12305 -0.66225,2.7143 0.58911,5.65495 2.98828,7.05273 2.43858,1.36362 5.61388,0.92311 7.58203,-1.03125 1.935,-1.9875 2.32839,-5.15208 0.95899,-7.54101 1.3457,2.40261 0.91015,5.54437 -1.01758,7.48242 -1.9574,1.90838 -5.08845,2.29875 -7.44141,0.94726 -2.31898,-1.37722 -3.49756,-4.25703 -2.83203,-6.84765 -0.63921,2.59743 0.57356,5.44559 2.87305,6.77734 2.33089,1.30997 5.40714,0.88248 7.28515,-0.99219 1.85531,-1.89737 2.23569,-4.9629 0.91993,-7.24414 1.29205,2.29493 0.86953,5.33764 -0.97852,7.18555 -1.86726,1.8287 -4.89927,2.20605 -7.14453,0.9082 -2.21929,-1.31119 -3.36124,-4.10046 -2.71875,-6.57421 -0.61617,2.48055 0.55997,5.23819 2.75977,6.5039 2.2232,1.25633 5.2004,0.84185 6.98828,-0.95312 1.77562,-1.80724 2.14297,-4.77372 0.88086,-6.94727 1.23841,2.18723 0.8289,5.1309 -0.93946,6.88867 -1.77712,1.74901 -4.71007,2.11334 -6.84765,0.86914 -2.1196,-1.24516 -3.22296,-3.94194 -2.60352,-6.29882 -0.59312,2.36369 0.54442,5.02883 2.64453,6.22851 2.11552,1.20269 4.99366,0.80123 6.69141,-0.91406 1.69593,-1.7171 2.05027,-4.58453 0.8418,-6.65039 1.18477,2.07954 0.78828,4.92416 -0.9004,6.5918 -1.68699,1.66932 -4.52088,2.02063 -6.55078,0.83007 -2.01991,-1.17912 -3.08468,-3.78537 -2.48828,-6.02539 -0.57007,2.24683 0.52888,4.82143 2.5293,5.95508 2.00783,1.14904 4.78692,0.7606 6.39453,-0.875 1.61625,-1.62697 1.95756,-4.39534 0.80273,-6.35352 1.13113,1.97186 0.74766,4.71743 -0.86132,6.29493 -1.59686,1.58963 -4.33171,1.92792 -6.25391,0.79101 -1.92022,-1.11308 -2.9464,-3.62881 -2.37305,-5.75195 -0.54703,2.12995 0.51334,4.61403 2.41407,5.68164 1.90013,1.0954 4.58018,0.71998 6.09765,-0.83594 1.53656,-1.53682 1.86486,-4.20616 0.76367,-6.05664 1.07749,1.86416 0.70704,4.51068 -0.82226,5.99805 -1.50672,1.50995 -4.14252,1.83522 -5.95703,0.75195 -1.82054,-1.04705 -2.80813,-3.47029 -2.25782,-5.47656 -0.52398,2.01308 0.49779,4.40468 2.29883,5.40625 1.79245,1.04176 4.37344,0.67935 5.80078,-0.79688 1.45688,-1.44669 1.77216,-4.01697 0.72461,-5.75976 1.02384,1.75647 0.66641,4.30394 -0.7832,5.70117 -1.41659,1.43025 -3.95333,1.74252 -5.66016,0.71289 -1.72084,-0.98102 -2.67179,-3.31372 -2.14453,-5.20312 -0.50094,1.8962 0.4842,4.19726 2.18555,5.13281 1.68476,0.98811 4.1667,0.63872 5.50391,-0.75781 1.37718,-1.35656 1.67944,-3.82779 0.68554,-5.46289 0.9702,1.64878 0.62578,4.0972 -0.74414,5.40429 -1.32645,1.35057 -3.76414,1.64982 -5.36328,0.67383 -1.62116,-0.91498 -2.53352,-3.15521 -2.0293,-4.92773 -0.4779,1.77933 0.46865,3.98791 2.07032,4.85742 1.57707,0.93447 3.95996,0.5981 5.20703,-0.71875 1.2975,-1.26643 1.58674,-3.63859 0.64648,-5.16602 0.91656,1.54111 0.58516,3.89046 -0.70508,5.10742 -1.23631,1.27089 -3.57495,1.55711 -5.0664,0.63477 -1.52147,-0.84895 -2.39524,-2.99864 -1.91406,-4.6543 -0.45453,1.66254 0.45334,3.77913 1.95507,4.58203 1.46911,0.8803 3.75228,0.55705 4.90821,-0.67968 1.21689,-1.17577 1.49365,-3.44705 0.60742,-4.86524 0.87408,1.42521 0.57645,3.68552 -0.63672,4.83594 -1.15042,1.21317 -3.41073,1.5108 -4.83594,0.63672 -1.46958,-0.79722 -2.34261,-2.90494 -1.86719,-4.50781 0.38971,-1.62585 2.19784,-3.01315 3.86915,-2.96875 V 281 a 1.4735761,1.4735761 0 0 0 0.002,0 1.4735761,1.4735761 0 0 0 1.47265,-1.47266 1.4735761,1.4735761 0 0 0 -1.47265,-1.47265 1.4735761,1.4735761 0 0 0 -0.002,0 z"
         id="path9887"
         style="fill:#2e3436;fill-opacity:1" /></g><text
       xml:space="preserve"
       style="font-style:normal;font-variant:normal;font-weight:normal;font-stretch:normal;font-size:14.6667px;line-height:0%;font-family:Cantarell;-inkscape-font-specification:'Cantarell, Normal';font-variant-ligatures:normal;font-variant-caps:normal;font-variant-numeric:normal;font-variant-east-asian:normal;text-align:start;letter-spacing:0px;word-spacing:0px;text-anchor:start;display:inline;fill:#2e3436;fill-opacity:1;stroke:none;stroke-width:0.999999"
       x="975.48865"
       y="1077.5493"
       id="text15224-3"><tspan
         sodipodi:role="line"
         id="tspan15222-6"
         x="975.48865"
         y="1077.5493"
         style="font-style:normal;font-variant:normal;font-weight:normal;font-stretch:normal;font-size:14.6667px;line-height:1.25;font-family:Cantarell;-inkscape-font-specification:Cantarell;font-variant-ligatures:normal;font-variant-caps:normal;font-variant-numeric:normal;font-variant-east-asian:normal;text-align:start;text-anchor:start;fill:#2e3436;fill-opacity:1;stroke-width:0.999999">Searching &quot;Folder Name&quot;... </tspan></text></g></svg>
