<?xml version="1.0" encoding="UTF-8" standalone="no"?>
<!-- Created with Inkscape (http://www.inkscape.org/) -->

<svg
   width="800"
   height="800"
   viewBox="0 0 211.66666 211.66667"
   version="1.1"
   id="svg1"
   inkscape:version="1.3.2 (091e20ef0f, 2023-11-25)"
   sodipodi:docname="simple-save-experiment.svg"
   inkscape:export-filename="simple-save-experiment.png"
   inkscape:export-xdpi="90"
   inkscape:export-ydpi="90"
   xmlns:inkscape="http://www.inkscape.org/namespaces/inkscape"
   xmlns:sodipodi="http://sodipodi.sourceforge.net/DTD/sodipodi-0.dtd"
   xmlns="http://www.w3.org/2000/svg"
   xmlns:svg="http://www.w3.org/2000/svg">
  <sodipodi:namedview
     id="namedview1"
     pagecolor="#3e3e3e"
     bordercolor="#000000"
     borderopacity="0.25"
     inkscape:showpageshadow="2"
     inkscape:pageopacity="0.0"
     inkscape:pagecheckerboard="0"
     inkscape:deskcolor="#d1d1d1"
     inkscape:document-units="px"
     showgrid="false"
     inkscape:zoom="1.0538791"
     inkscape:cx="302.21684"
     inkscape:cy="396.15551"
     inkscape:window-width="2560"
     inkscape:window-height="1371"
     inkscape:window-x="0"
     inkscape:window-y="0"
     inkscape:window-maximized="1"
     inkscape:current-layer="layer1"
     inkscape:export-bgcolor="#3e3e3eff">
    <inkscape:grid
       id="grid1"
       units="px"
       originx="0"
       originy="0"
       spacingx="0.26458333"
       spacingy="0.26458334"
       empcolor="#0099e5"
       empopacity="0.30196078"
       color="#0099e5"
       opacity="0.14901961"
       empspacing="5"
       dotted="false"
       gridanglex="30"
       gridanglez="30"
       visible="false" />
  </sodipodi:namedview>
  <defs
     id="defs1">
    <inkscape:path-effect
       effect="fillet_chamfer"
       id="path-effect199"
       is_visible="true"
       lpeversion="1"
       nodesatellites_param="F,0,0,1,0,2,0,1 @ F,0,0,1,0,2,0,1 @ F,0,1,1,0,0.99999,0,1 @ F,0,1,1,0,0.99999,0,1 @ F,0,0,1,0,0.99999,0,1"
       unit="px"
       method="auto"
       mode="F"
       radius="2"
       chamfer_steps="1"
       flexible="false"
       use_knot_distance="true"
       apply_no_radius="true"
       apply_with_radius="true"
       only_selected="false"
       hide_knots="false" />
    <inkscape:path-effect
       effect="join_type"
       id="path-effect201"
       is_visible="true"
       lpeversion="1"
       linecap_type="butt"
       line_width="2"
       linejoin_type="extrp_arc"
       miter_limit="100"
       attempt_force_join="true" />
    <inkscape:path-effect
       effect="join_type"
       id="path-effect244"
       is_visible="true"
       lpeversion="1"
       linecap_type="round"
       line_width="2.00001"
       linejoin_type="round"
       miter_limit="100"
       attempt_force_join="true" />
  </defs>
  <g
     inkscape:label="Layer 1"
     inkscape:groupmode="layer"
     id="layer1">
    <rect
       inkscape:export-ydpi="90"
       inkscape:export-xdpi="90"
       style="display:inline;fill:#ffffff;fill-opacity:1;stroke:#fafafa;stroke-width:0;stroke-miterlimit:4;stroke-dasharray:none;stroke-opacity:1"
       id="rect4"
       width="153.45833"
       height="134.93752"
       x="21.166666"
       y="21.166666"
       rx="3.175"
       ry="3.175" />
    <g
       id="g32"
       transform="matrix(0.26458333,0,0,0.26458333,-1231.9366,-326.56232)">
      <text
         xml:space="preserve"
         style="font-style:normal;font-variant:normal;font-weight:bold;font-stretch:normal;font-size:14px;line-height:125%;font-family:Cantarell;-inkscape-font-specification:'Cantarell Bold';text-align:center;letter-spacing:0px;word-spacing:0px;text-anchor:middle;display:inline;fill:#2e3436;fill-opacity:1;stroke:none"
         x="5026.9521"
         y="1343.0359"
         id="text32"><tspan
           sodipodi:role="line"
           id="tspan32"
           x="5026.9521"
           y="1343.0359"
           style="font-style:normal;font-variant:normal;font-weight:bold;font-stretch:normal;font-family:Cantarell;-inkscape-font-specification:'Cantarell Bold';fill:#2e3436;fill-opacity:1">Save File</tspan></text>
    </g>
    <rect
       inkscape:export-ydpi="90"
       inkscape:export-xdpi="90"
       style="display:inline;fill:#000000;fill-opacity:0.08;stroke:#000000;stroke-width:0;stroke-miterlimit:4;stroke-dasharray:none;stroke-opacity:1"
       id="rect454"
       width="121.70832"
       height="15.875"
       x="37.197727"
       y="36.512436"
       rx="2.3397272"
       ry="2.3397272" />
    <rect
       inkscape:export-ydpi="90"
       inkscape:export-xdpi="90"
       style="display:inline;fill:#fcfdff;fill-opacity:1;stroke:#ececec;stroke-width:0;stroke-miterlimit:4;stroke-dasharray:none;stroke-opacity:1"
       id="rect455"
       width="121.17917"
       height="14.271831"
       x="37.462311"
       y="36.777149"
       rx="2.1883838"
       ry="2.1883833" />
    <text
       xml:space="preserve"
       style="font-style:normal;font-variant:normal;font-weight:normal;font-stretch:normal;font-size:3.175px;line-height:0%;font-family:Cantarell;-inkscape-font-specification:Cantarell;letter-spacing:0px;word-spacing:0px;display:inline;fill:#939799;fill-opacity:1;stroke:none;stroke-width:0.264583"
       x="41.960743"
       y="42.185478"
       id="text455"><tspan
         style="font-size:3.175px;line-height:1.25;fill:#939799;fill-opacity:1;stroke-width:0.264583"
         sodipodi:role="line"
         id="tspan455"
         x="41.960743"
         y="42.185478">File Name</tspan></text>
    <rect
       inkscape:export-ydpi="90"
       inkscape:export-xdpi="90"
       style="display:inline;fill:none;fill-opacity:1;stroke:#62a0ea;stroke-width:0.529167;stroke-miterlimit:4;stroke-dasharray:none;stroke-opacity:1"
       id="rect456"
       width="120.65"
       height="14.022788"
       x="37.726894"
       y="37.028038"
       rx="1.9430984"
       ry="1.9430984" />
    <path
       d="m 150.99805,42.165124 c -0.15296,0.0026 -0.30901,0.06099 -0.44752,0.199469 l -2.38125,2.38125 c -0.0992,0.09922 -0.15502,0.233601 -0.15502,0.374147 v 0.79375 h 0.79375 c 0.14058,0 0.27493,-0.0558 0.37415,-0.155019 l 2.38125,-2.38125 c 0.47334,-0.473366 0.0217,-1.161706 -0.50025,-1.209225 -0.0217,-0.0032 -0.0434,-0.0032 -0.0651,-0.0032 z m -0.47025,0.953955 0.28112,0.28112 -1.86862,1.86862 -0.28112,-0.28112 z m 0,0"
       fill="#2e3436"
       id="path456"
       style="stroke-width:0.264583" />
    <path
       style="display:inline;fill:none;stroke:#241f31;stroke-width:0.264583px;stroke-linecap:butt;stroke-linejoin:miter;stroke-opacity:1"
       d="M 42.092509,48.66964 V 44.436307"
       id="path457"
       inkscape:connector-curvature="0" />
    <text
       xml:space="preserve"
       style="font-style:normal;font-variant:normal;font-weight:normal;font-stretch:normal;font-size:3.88056px;line-height:0%;font-family:Cantarell;-inkscape-font-specification:Cantarell;letter-spacing:0px;word-spacing:0px;display:inline;fill:#2e3436;fill-opacity:1;stroke:none;stroke-width:0.264583"
       x="42.754494"
       y="47.940163"
       id="text102"><tspan
         style="font-size:3.88056px;line-height:1.25;fill:#2e3436;fill-opacity:1;stroke-width:0.264583"
         sodipodi:role="line"
         id="tspan102"
         x="42.754494"
         y="47.940163">.txt</tspan></text>
    <g
       id="g115"
       transform="matrix(0.26458333,0,0,0.26458333,-1284.8532,-294.28316)">
      <text
         xml:space="preserve"
         style="font-style:normal;font-variant:normal;font-weight:bold;font-stretch:normal;font-size:14px;line-height:125%;font-family:Cantarell;-inkscape-font-specification:'Cantarell Bold';text-align:start;letter-spacing:0px;word-spacing:0px;text-anchor:start;display:inline;fill:#2e3436;fill-opacity:1;stroke:none"
         x="4999.085"
         y="1343.0359"
         id="text103"><tspan
           sodipodi:role="line"
           id="tspan103"
           x="4999.085"
           y="1343.0359"
           style="font-style:normal;font-variant:normal;font-weight:bold;font-stretch:normal;font-family:Cantarell;-inkscape-font-specification:'Cantarell Bold';text-align:start;text-anchor:start;fill:#2e3436;fill-opacity:1">Location</tspan></text>
    </g>
    <rect
       inkscape:export-ydpi="90"
       inkscape:export-xdpi="90"
       y="65.890625"
       x="37.462311"
       height="11.1125"
       width="59.002083"
       id="rect209"
       style="display:inline;fill:#62a0ea;fill-opacity:1;stroke:none;stroke-width:0.264668;stroke-linecap:square;stroke-miterlimit:4;stroke-dasharray:none;stroke-dashoffset:0;stroke-opacity:1"
       rx="5.5562501"
       ry="5.5562501" />
    <g
       inkscape:label="select selected selection check approve done good small"
       id="g2"
       transform="matrix(0,0.26458333,-0.26458333,0,143.29648,26.167199)">
      <title
         id="title1">object-select</title>
      <path
         style="fill:#ffffff"
         d="m 167.79479,197.25019 a 1,1 0 0 0 -1.41211,0.0937 1,1 0 0 0 0.0937,1.41211 l 7.19532,6.29687 -2.24415,2.24414 a 1,1 0 0 0 0,1.41407 1,1 0 0 0 1.41602,0 l 3,-3 a 1.0001,1.0001 0 0 0 -0.0488,-1.46094 z"
         id="path2" />
      <rect
         y="195.00317"
         x="163.1358"
         height="16"
         width="16"
         id="rect2-2"
         style="fill:none;fill-opacity:1" />
    </g>
    <text
       xml:space="preserve"
       style="font-style:normal;font-variant:normal;font-weight:normal;font-stretch:normal;font-size:3.88056px;line-height:0%;font-family:Cantarell;-inkscape-font-specification:Cantarell;text-align:start;letter-spacing:0px;word-spacing:0px;text-anchor:start;display:inline;fill:#ffffff;fill-opacity:1;stroke:none;stroke-width:0.264583"
       x="47.9888"
       y="72.773987"
       id="text190"><tspan
         sodipodi:role="line"
         id="tspan190"
         x="47.9888"
         y="72.773987"
         style="font-weight:bold;font-size:3.88056px;line-height:1.25;text-align:start;text-anchor:start;fill:#ffffff;fill-opacity:1;stroke-width:0.264583">Home</tspan></text>
    <g
       transform="matrix(0.26458333,0,0,0.26458333,-289.1895,221.46495)"
       id="g193"
       inkscape:label="home directory personal">
      <title
         id="title192">user-home</title>
      <path
         style="fill:#ffffff;fill-rule:nonzero;stroke:none;stroke-width:2;stroke-linecap:round;stroke-linejoin:round;stroke-opacity:1"
         d="m 1264.9729,-558.99512 c 1.6619,0 3,-1.3381 3,-3 v -6.00001 c 0,-0.93091 -0.4129,-1.81244 -1.128,-2.40839 l -4.4636,-3.71964 c -0.8166,-0.6805 -2.0002,-0.6805 -2.8168,0 l -4.4636,3.71964 c -0.7151,0.59595 -1.128,1.47748 -1.128,2.40839 v 6.00001 c 0,1.6619 1.3381,3 3,3 z m -9,-3 v -6.00001 c 0,-0.33636 0.15,-0.65662 0.4084,-0.87195 l 4.4636,-3.71964 c 0.073,-0.0612 0.1826,-0.0612 0.256,0 l 4.4636,3.71964 c 0.2584,0.21533 0.4084,0.53559 0.4084,0.87195 v 6.00001 c 0,0.54724 -0.4528,1 -1,1 h -8 c -0.5472,0 -1,-0.45276 -1,-1 z"
         id="path192"
         sodipodi:nodetypes="cccccc"
         inkscape:original-d="m 1254.9729,-559.99512 h 12 v -9 l -6,-5 -6,5 z"
         inkscape:path-effect="#path-effect199;#path-effect201" />
      <rect
         style="fill:#ffffff;fill-opacity:1;stroke:none;stroke-width:1.99999;stroke-linecap:round;stroke-linejoin:round;stroke-opacity:0"
         id="rect192"
         width="4"
         height="6.9999995"
         x="1258.9729"
         y="-566.995"
         rx="1"
         ry="1" />
      <rect
         y="-575"
         x="1253.0002"
         height="16"
         width="16"
         id="rect193"
         style="fill:none" />
    </g>
    <rect
       inkscape:export-ydpi="90"
       inkscape:export-xdpi="90"
       y="65.890625"
       x="99.374809"
       height="11.1125"
       width="59.002083"
       id="rect210"
       style="display:inline;fill:#e6e6e6;fill-opacity:1;stroke:none;stroke-width:0.264668;stroke-linecap:square;stroke-miterlimit:4;stroke-dasharray:none;stroke-dashoffset:0;stroke-opacity:1"
       rx="5.5562501"
       ry="5.5562501" />
    <g
       id="g132"
       inkscape:label="folder files downloads"
       transform="matrix(0.26458333,0,0,0.26458333,-89.420728,72.503862)">
      <title
         id="title115">folder-download</title>
      <path
         id="path121"
         d="m 739.98435,-12 c -0.55228,0 -1,0.44772 -1,1 v 8.58594 l -2.29297,-2.29297 c -0.1875,-0.18755 -0.44183,-0.29293 -0.70703,-0.29297 -0.2652,4e-5 -0.51953,0.10542 -0.70703,0.29297 -0.39042,0.39051 -0.39042,1.02355 0,1.41406 l 4,4 c 0.39053,0.39037 1.02353,0.39037 1.41406,0 l 4,-4 c 0.39042,-0.39051 0.39042,-1.02355 0,-1.41406 -0.39051,-0.39042 -1.02355,-0.39042 -1.41406,0 l -2.29297,2.29297 V -11 c 0,-0.55228 -0.44772,-1 -1,-1 z m -6,14 v 2 h 12 V 2 Z"
         style="fill:#2e3436;fill-opacity:1" />
      <path
         id="path131"
         style="fill:none"
         transform="rotate(90)"
         d="M -12,-748 H 4 v 16 h -16 z" />
      <path
         id="path132"
         style="fill:none"
         transform="matrix(0,1,1,0,0,0)"
         d="M -11.989941,731.96869 H 4.0100594 v 16 H -11.989941 Z" />
    </g>
    <text
       xml:space="preserve"
       style="font-style:normal;font-variant:normal;font-weight:normal;font-stretch:normal;font-size:3.88056px;line-height:0%;font-family:Cantarell;-inkscape-font-specification:Cantarell;text-align:start;letter-spacing:0px;word-spacing:0px;text-anchor:start;display:inline;fill:#2e3436;fill-opacity:1;stroke:none;stroke-width:0.264583"
       x="109.90131"
       y="72.773987"
       id="text186"><tspan
         sodipodi:role="line"
         id="tspan186"
         x="109.90131"
         y="72.773987"
         style="font-weight:normal;font-size:3.88056px;line-height:1.25;text-align:start;text-anchor:start;fill:#2e3436;fill-opacity:1;stroke-width:0.264583">Downloads</tspan></text>
    <rect
       inkscape:export-ydpi="90"
       inkscape:export-xdpi="90"
       y="79.648956"
       x="37.462311"
       height="11.1125"
       width="59.002083"
       id="rect215"
       style="display:inline;fill:#e6e6e6;fill-opacity:1;stroke:none;stroke-width:0.264668;stroke-linecap:square;stroke-miterlimit:4;stroke-dasharray:none;stroke-dashoffset:0;stroke-opacity:1"
       rx="5.5562501"
       ry="5.5562501" />
    <text
       xml:space="preserve"
       style="font-style:normal;font-variant:normal;font-weight:normal;font-stretch:normal;font-size:3.88056px;line-height:0%;font-family:Cantarell;-inkscape-font-specification:Cantarell;text-align:start;letter-spacing:0px;word-spacing:0px;text-anchor:start;display:inline;fill:#2e3436;fill-opacity:1;stroke:none;stroke-width:0.264583"
       x="47.9888"
       y="86.532318"
       id="text215"><tspan
         sodipodi:role="line"
         id="tspan215"
         x="47.9888"
         y="86.532318"
         style="font-weight:normal;font-size:3.88056px;line-height:1.25;text-align:start;text-anchor:start;fill:#2e3436;fill-opacity:1;stroke-width:0.264583">Bookmark</tspan></text>
    <rect
       inkscape:export-ydpi="90"
       inkscape:export-xdpi="90"
       y="79.648956"
       x="99.374809"
       height="11.1125"
       width="59.002083"
       id="rect218"
       style="display:inline;fill:#e6e6e6;fill-opacity:1;stroke:none;stroke-width:0.264668;stroke-linecap:square;stroke-miterlimit:4;stroke-dasharray:none;stroke-dashoffset:0;stroke-opacity:1"
       rx="5.5562501"
       ry="5.5562501" />
    <text
       xml:space="preserve"
       style="font-style:normal;font-variant:normal;font-weight:normal;font-stretch:normal;font-size:3.88056px;line-height:0%;font-family:Cantarell;-inkscape-font-specification:Cantarell;text-align:start;letter-spacing:0px;word-spacing:0px;text-anchor:start;display:inline;fill:#2e3436;fill-opacity:1;stroke:none;stroke-width:0.264583"
       x="109.90131"
       y="86.532318"
       id="text220"><tspan
         sodipodi:role="line"
         id="tspan220"
         x="109.90131"
         y="86.532318"
         style="font-weight:normal;font-size:3.88056px;line-height:1.25;text-align:start;text-anchor:start;fill:#2e3436;fill-opacity:1;stroke-width:0.264583">Bookmark</tspan></text>
    <rect
       inkscape:export-ydpi="90"
       inkscape:export-xdpi="90"
       y="93.407288"
       x="37.462311"
       height="11.1125"
       width="59.002083"
       id="rect223"
       style="display:inline;fill:#e6e6e6;fill-opacity:1;stroke:none;stroke-width:0.264668;stroke-linecap:square;stroke-miterlimit:4;stroke-dasharray:none;stroke-dashoffset:0;stroke-opacity:1"
       rx="5.5562501"
       ry="5.5562501" />
    <text
       xml:space="preserve"
       style="font-style:normal;font-variant:normal;font-weight:normal;font-stretch:normal;font-size:3.88056px;line-height:0%;font-family:Cantarell;-inkscape-font-specification:Cantarell;text-align:start;letter-spacing:0px;word-spacing:0px;text-anchor:start;display:inline;fill:#2e3436;fill-opacity:1;stroke:none;stroke-width:0.264583"
       x="47.9888"
       y="100.29066"
       id="text223"><tspan
         sodipodi:role="line"
         id="tspan223"
         x="47.9888"
         y="100.29066"
         style="font-weight:normal;font-size:3.88056px;line-height:1.25;text-align:start;text-anchor:start;fill:#2e3436;fill-opacity:1;stroke-width:0.264583">Bookmark</tspan></text>
    <rect
       inkscape:export-ydpi="90"
       inkscape:export-xdpi="90"
       y="93.407288"
       x="99.374809"
       height="11.1125"
       width="59.002083"
       id="rect226"
       style="display:inline;fill:#e6e6e6;fill-opacity:1;stroke:none;stroke-width:0.264668;stroke-linecap:square;stroke-miterlimit:4;stroke-dasharray:none;stroke-dashoffset:0;stroke-opacity:1"
       rx="5.5562501"
       ry="5.5562501" />
    <text
       xml:space="preserve"
       style="font-style:normal;font-variant:normal;font-weight:normal;font-stretch:normal;font-size:3.88056px;line-height:0%;font-family:Cantarell;-inkscape-font-specification:Cantarell;text-align:start;letter-spacing:0px;word-spacing:0px;text-anchor:start;display:inline;fill:#2e3436;fill-opacity:1;stroke:none;stroke-width:0.264583"
       x="109.90131"
       y="100.29066"
       id="text228"><tspan
         sodipodi:role="line"
         id="tspan228"
         x="109.90131"
         y="100.29066"
         style="font-weight:normal;font-size:3.88056px;line-height:1.25;text-align:start;text-anchor:start;fill:#2e3436;fill-opacity:1;stroke-width:0.264583">SD Card</tspan></text>
    <g
       id="g232"
       inkscape:label="folder directory"
       transform="matrix(0.26406757,0,0,0.26406757,-82.298168,86.26148)"
       style="stroke-width:1.00195">
      <title
         id="title231">folder</title>
      <path
         d="m 472.9687,-7.99497 v 1 h 8 v -1 z"
         id="path231"
         style="fill:#2e3436;fill-opacity:1;stroke-width:1.00195" />
      <rect
         style="fill:none;stroke-width:0"
         id="rect231"
         width="16"
         height="16"
         x="472"
         y="-12.000004" />
      <path
         d="m 474.96875,-10.99414 c -1.64501,0 -3,1.354992 -3,3 v 8 c 0,1.6450079 1.35499,3 3,3 h 10 c 1.64501,0 3,-1.3549921 3,-3 v -6 c 0,-1.645008 -1.35499,-3 -3,-3 h -3.58594 l -1.70703,-1.707031 a 1.0001,1.0001 0 0 0 -0.70703,-0.292969 z m 0,2 h 3.58594 l 1.70703,1.707031 a 1.0001,1.0001 0 0 0 0.70703,0.292969 h 4 c 0.56413,0 1,0.435871 1,1 v 6 c 0,0.5641288 -0.43587,1 -1,1 h -10 c -0.56413,0 -1,-0.4358712 -1,-1 v -8 c 0,-0.564129 0.43587,-1 1,-1 z"
         id="path232"
         style="fill:#2e3436;fill-opacity:1;stroke-width:1.00195" />
    </g>
    <g
       id="g234"
       inkscape:label="folder directory"
       transform="matrix(0.26406757,0,0,0.26406757,-20.381515,86.26148)"
       style="stroke-width:1.00195">
      <title
         id="title232">folder</title>
      <path
         d="m 472.9687,-7.99497 v 1 h 8 v -1 z"
         id="path233"
         style="fill:#2e3436;fill-opacity:1;stroke-width:1.00195" />
      <rect
         style="fill:none;stroke-width:0"
         id="rect233"
         width="16"
         height="16"
         x="472"
         y="-12.000004" />
      <path
         d="m 474.96875,-10.99414 c -1.64501,0 -3,1.354992 -3,3 v 8 c 0,1.6450079 1.35499,3 3,3 h 10 c 1.64501,0 3,-1.3549921 3,-3 v -6 c 0,-1.645008 -1.35499,-3 -3,-3 h -3.58594 l -1.70703,-1.707031 a 1.0001,1.0001 0 0 0 -0.70703,-0.292969 z m 0,2 h 3.58594 l 1.70703,1.707031 a 1.0001,1.0001 0 0 0 0.70703,0.292969 h 4 c 0.56413,0 1,0.435871 1,1 v 6 c 0,0.5641288 -0.43587,1 -1,1 h -10 c -0.56413,0 -1,-0.4358712 -1,-1 v -8 c 0,-0.564129 0.43587,-1 1,-1 z"
         id="path234"
         style="fill:#2e3436;fill-opacity:1;stroke-width:1.00195" />
    </g>
    <g
       id="g236"
       inkscape:label="folder directory"
       transform="matrix(0.26406757,0,0,0.26406757,-82.298168,100.01982)"
       style="stroke-width:1.00195">
      <title
         id="title234">folder</title>
      <path
         d="m 472.9687,-7.99497 v 1 h 8 v -1 z"
         id="path235"
         style="fill:#2e3436;fill-opacity:1;stroke-width:1.00195" />
      <rect
         style="fill:none;stroke-width:0"
         id="rect235"
         width="16"
         height="16"
         x="472"
         y="-12.000004" />
      <path
         d="m 474.96875,-10.99414 c -1.64501,0 -3,1.354992 -3,3 v 8 c 0,1.6450079 1.35499,3 3,3 h 10 c 1.64501,0 3,-1.3549921 3,-3 v -6 c 0,-1.645008 -1.35499,-3 -3,-3 h -3.58594 l -1.70703,-1.707031 a 1.0001,1.0001 0 0 0 -0.70703,-0.292969 z m 0,2 h 3.58594 l 1.70703,1.707031 a 1.0001,1.0001 0 0 0 0.70703,0.292969 h 4 c 0.56413,0 1,0.435871 1,1 v 6 c 0,0.5641288 -0.43587,1 -1,1 h -10 c -0.56413,0 -1,-0.4358712 -1,-1 v -8 c 0,-0.564129 0.43587,-1 1,-1 z"
         id="path236"
         style="fill:#2e3436;fill-opacity:1;stroke-width:1.00195" />
    </g>
    <g
       id="g126-0"
       inkscape:label="data storage card flash sd sdhc"
       transform="matrix(0.26458333,0,0,0.26458333,51.333346,-24.861453)">
      <title
         id="title124-8">media-flash</title>
      <path
         id="path125-5"
         d="m 205,461 c -1.6447,0 -3,1.3553 -3,3 v 8 c 0,1.6447 1.3553,3 3,3 h 7 c 1.6447,0 3,-1.3553 3,-3 v -8 c -5e-5,-0.2652 -0.10543,-0.51952 -0.29297,-0.70703 l -2,-2 C 212.51952,461.10543 212.2652,461.00005 212,461 Z m 0,2 h 6.58594 L 213,464.41406 V 472 c 0,0.5713 -0.4287,1 -1,1 h -7 c -0.5713,0 -1,-0.4287 -1,-1 v -8 c 0,-0.5713 0.4287,-1 1,-1 z m 0.5,1 c -0.27614,0 -0.5,0.22386 -0.5,0.5 v 2.99609 1.00391 c 3e-5,0.27613 0.22387,0.49997 0.5,0.5 h 2 c 0.27613,-3e-5 0.49997,-0.22387 0.5,-0.5 V 465 h 1 v 3.5 c 3e-5,0.27613 0.22387,0.49997 0.5,0.5 h 2 c 0.27613,-3e-5 0.49997,-0.22387 0.5,-0.5 v -3 c 0,-0.27614 -0.22386,-0.5 -0.5,-0.5 -0.27614,0 -0.5,0.22386 -0.5,0.5 v 2.5 h -1 v -3.5 c -3e-5,-0.27613 -0.22387,-0.49997 -0.5,-0.5 h -2 c -0.27613,3e-5 -0.49997,0.22387 -0.5,0.5 v 3.5 h -1 V 467.49609 464.5 c 0,-0.27614 -0.22386,-0.5 -0.5,-0.5 z"
         style="fill:#2e3434;fill-opacity:1" />
      <path
         id="path126-0"
         style="fill:none"
         d="m 200.0004,460 h 16 v 16 h -16 z" />
    </g>
    <rect
       inkscape:export-ydpi="90"
       inkscape:export-xdpi="90"
       y="107.16562"
       x="37.462311"
       height="11.1125"
       width="59.002083"
       id="rect236"
       style="display:inline;fill:#e6e6e6;fill-opacity:1;stroke:none;stroke-width:0.264668;stroke-linecap:square;stroke-miterlimit:4;stroke-dasharray:none;stroke-dashoffset:0;stroke-opacity:1"
       rx="5.5562501"
       ry="5.5562501" />
    <text
       xml:space="preserve"
       style="font-style:normal;font-variant:normal;font-weight:normal;font-stretch:normal;font-size:3.88056px;line-height:0%;font-family:Cantarell;-inkscape-font-specification:Cantarell;text-align:start;letter-spacing:0px;word-spacing:0px;text-anchor:start;display:inline;fill:#2e3436;fill-opacity:1;stroke:none;stroke-width:0.264583"
       x="47.9888"
       y="114.04897"
       id="text236"><tspan
         sodipodi:role="line"
         id="tspan236"
         x="47.9888"
         y="114.04897"
         style="font-weight:normal;font-size:3.88056px;line-height:1.25;text-align:start;text-anchor:start;fill:#2e3436;fill-opacity:1;stroke-width:0.264583">USB Stick</tspan></text>
    <rect
       inkscape:export-ydpi="90"
       inkscape:export-xdpi="90"
       y="107.16562"
       x="99.374809"
       height="11.1125"
       width="59.002083"
       id="rect237"
       style="display:inline;fill:#e6e6e6;fill-opacity:1;stroke:none;stroke-width:0.264668;stroke-linecap:square;stroke-miterlimit:4;stroke-dasharray:none;stroke-dashoffset:0;stroke-opacity:1"
       rx="5.5562501"
       ry="5.5562501" />
    <text
       xml:space="preserve"
       style="font-style:normal;font-variant:normal;font-weight:normal;font-stretch:normal;font-size:3.88056px;line-height:0%;font-family:Cantarell;-inkscape-font-specification:Cantarell;text-align:start;letter-spacing:0px;word-spacing:0px;text-anchor:start;display:inline;fill:#2e3436;fill-opacity:1;stroke:none;stroke-width:0.264583"
       x="109.90131"
       y="114.04897"
       id="text237"><tspan
         sodipodi:role="line"
         id="tspan237"
         x="109.90131"
         y="114.04897"
         style="font-weight:normal;font-size:3.88056px;line-height:1.25;text-align:start;text-anchor:start;fill:#2e3436;fill-opacity:1;stroke-width:0.264583">NAS</tspan></text>
    <g
       style="display:inline;enable-background:new"
       transform="matrix(0.26458333,0,0,0.26458333,10.31883,-12.955204)"
       id="g124-0"
       inkscape:label="media removable thumb flash USB drive">
      <title
         id="title122-5">media-removable</title>
      <path
         id="path123-1"
         style="fill:none"
         d="m 121.0002,467 h 16 v 16 h -16 z" />
      <path
         id="path124-1"
         style="fill:#2e3436;fill-opacity:1;stroke:none"
         d="m 125,540 v 4 h 6 v -4 z m 1,1 h 1 v 1 h -1 z m 3,0 h 1 v 1 h -1 z m -5,4 c -0.554,0 -1,0.446 -1,1 v 7 c 0,1.662 1.338,3 3,3 h 4 c 1.662,0 3,-1.338 3,-3 v -7 c 0,-0.554 -0.446,-1 -1,-1 z"
         transform="translate(0.9998,-73)" />
    </g>
    <g
       id="g243"
       inkscape:label="server remote samba ftp"
       transform="matrix(0.26458333,0,0,0.26458333,77.795542,-71.425924)"
       style="fill:#222222">
      <title
         id="title240">network-server</title>
      <rect
         y="687.98578"
         x="99.985779"
         height="16"
         width="16"
         id="rect240"
         style="fill:none;stroke-width:3" />
      <path
         id="path240"
         style="color:#000000;fill:#2e3436;fill-opacity:1;stroke-linecap:round"
         d="m 107.97992,699.98578 a 2.0056458,2.0056458 0 0 0 -1.71484,0.97266 h -3.28516 a 1,1 0 0 0 -1,1 1,1 0 0 0 1,1 h 3.24805 a 2.0056458,2.0056458 0 0 0 1.75195,1.03906 2.0056458,2.0056458 0 0 0 1.75195,-1.03906 h 3.25977 a 1,1 0 0 0 1,-1 1,1 0 0 0 -1,-1 h -3.29297 a 2.0056458,2.0056458 0 0 0 -1.71875,-0.97266 z m 0,1 a 1.0056458,1.0056458 0 0 1 1.00586,1.00586 1.0056458,1.0056458 0 0 1 -1.00586,1.00586 1.0056458,1.0056458 0 0 1 -1.00586,-1.00586 1.0056458,1.0056458 0 0 1 1.00586,-1.00586 z" />
      <g
         id="g240"
         style="fill:#222222"
         transform="translate(-100.01422,411.98578)" />
      <g
         id="g241"
         style="fill:#222222"
         transform="translate(-100.01422,411.98578)" />
      <rect
         style="fill:#2e3436;fill-opacity:1;stroke:none;stroke-width:2;stroke-linecap:round;stroke-dasharray:none;stroke-opacity:1;stop-color:#000000"
         id="rect241"
         width="2.0095074"
         height="3.0000002"
         x="106.97627"
         y="697.98578"
         rx="0"
         ry="0" />
      <path
         style="fill:#2e3436;fill-opacity:1;fill-rule:nonzero;stroke:none;stroke-width:2.00001;stroke-linecap:round;stroke-dasharray:none;stroke-opacity:1;stop-color:#000000"
         id="path241"
         width="13.999995"
         height="8.9848566"
         x="100.98579"
         y="688.98578"
         rx="3.0059485"
         ry="3.0059485"
         inkscape:path-effect="#path-effect244"
         d="m 111.97983,689.98578 c 1.11182,0 2.00595,0.89413 2.00595,2.00595 v 2.97296 c 0,1.11181 -0.89413,2.00594 -2.00595,2.00594 h -7.9881 c -1.11181,0 -2.00594,-0.89413 -2.00594,-2.00594 v -2.97296 c 0,-1.11182 0.89413,-2.00595 2.00594,-2.00595 z m -11.994049,2.00595 v 2.97296 c 0,2.21877 1.787179,4.00595 4.005949,4.00595 h 7.9881 c 2.21878,0 4.00596,-1.78718 4.00596,-4.00595 v -2.97296 c 0,-2.21878 -1.78718,-4.00596 -4.00596,-4.00596 h -7.9881 c -2.21877,0 -4.005949,1.78718 -4.005949,4.00596 z"
         sodipodi:type="rect" />
      <rect
         style="fill:#2e3436;fill-opacity:1;stroke:none;stroke-width:2;stroke-linecap:round;stroke-dasharray:none;stroke-opacity:1;stop-color:#000000"
         id="rect242"
         width="2.0000012"
         height="2.0000012"
         x="103.98578"
         y="691.98578"
         rx="2.0118778"
         ry="2.0118778" />
      <rect
         style="fill:#2e3436;fill-opacity:1;stroke:none;stroke-width:2;stroke-linecap:round;stroke-dasharray:none;stroke-opacity:1;stop-color:#000000"
         id="rect243"
         width="2.0000012"
         height="2.0000012"
         x="106.98578"
         y="691.98578"
         rx="2.0118778"
         ry="2.0118778" />
    </g>
    <g
       id="g244"
       transform="matrix(0.26458333,0,0,0.26458333,-1514.3862,-788.52439)">
      <rect
         style="fill:#e6e6e6;fill-opacity:0.402048;stroke:none;stroke-width:2.00001;stroke-opacity:1"
         id="rect17"
         width="139.99947"
         height="44"
         x="6100.2544"
         y="3508.2468"
         rx="22"
         ry="22" />
      <text
         xml:space="preserve"
         style="font-style:normal;font-variant:normal;font-weight:bold;font-stretch:normal;font-size:14.6667px;line-height:0%;font-family:Cantarell;-inkscape-font-specification:'Cantarell Bold';text-align:center;letter-spacing:0px;word-spacing:0px;text-anchor:middle;display:inline;fill:#000000;fill-opacity:0.320903;stroke:none;stroke-width:1"
         x="6170.3423"
         y="3536.0208"
         id="text17"><tspan
           style="font-style:normal;font-variant:normal;font-weight:bold;font-stretch:normal;font-size:14.6667px;line-height:1.25;font-family:Cantarell;-inkscape-font-specification:'Cantarell Bold';text-align:center;text-anchor:middle;fill:#000000;fill-opacity:0.320903;stroke-width:1"
           sodipodi:role="line"
           id="tspan17"
           x="6170.3423"
           y="3536.0208">Save</tspan></text>
      <rect
         style="fill:#e6e6e6;fill-opacity:1;stroke:none;stroke-width:2.00001;stroke-opacity:1"
         id="rect244"
         width="139.99947"
         height="44"
         x="5948.2544"
         y="3508.2468"
         rx="22"
         ry="22" />
      <text
         xml:space="preserve"
         style="font-style:normal;font-variant:normal;font-weight:bold;font-stretch:normal;font-size:14.6667px;line-height:0%;font-family:Cantarell;-inkscape-font-specification:'Cantarell Bold';text-align:center;letter-spacing:0px;word-spacing:0px;text-anchor:middle;display:inline;fill:#2e3436;fill-opacity:1;stroke:none;stroke-width:1"
         x="6018.3423"
         y="3536.0208"
         id="text244"><tspan
           style="font-style:normal;font-variant:normal;font-weight:bold;font-stretch:normal;font-size:14.6667px;line-height:1.25;font-family:Cantarell;-inkscape-font-specification:'Cantarell Bold';text-align:center;text-anchor:middle;fill:#2e3436;fill-opacity:1;stroke-width:1"
           sodipodi:role="line"
           id="tspan244"
           x="6018.3423"
           y="3536.0208">Cancel</tspan></text>
    </g>
    <g
       id="g245"
       transform="matrix(0.26458333,0,0,0.26458333,-1232.1704,-226.02066)">
      <text
         xml:space="preserve"
         style="font-style:normal;font-variant:normal;font-weight:bold;font-stretch:normal;font-size:14px;line-height:125%;font-family:Cantarell;-inkscape-font-specification:'Cantarell Bold';text-align:center;letter-spacing:0px;word-spacing:0px;text-anchor:middle;display:inline;fill:#2e3436;fill-opacity:1;stroke:none"
         x="5026.9521"
         y="1343.0359"
         id="text245"><tspan
           sodipodi:role="line"
           id="tspan245"
           x="5026.9521"
           y="1343.0359"
           style="font-style:normal;font-variant:normal;font-weight:bold;font-stretch:normal;font-family:Cantarell;-inkscape-font-specification:'Cantarell Bold';fill:#2e3436;fill-opacity:1">Other Locations</tspan></text>
    </g>
    <g
       inkscape:label="go next following arrow right back"
       id="g246"
       transform="matrix(0,0.26458333,0.26458333,0,60.33471,82.778665)">
      <title
         id="title245">go-next</title>
      <path
         d="m 165.13672,199.00391 a 1,1 0 0 0 -0.70899,0.29296 1,1 0 0 0 0,1.41407 l 6,6 a 1.0001,1.0001 0 0 0 1.41602,0 l 6,-6 a 1,1 0 0 0 0,-1.41407 1,1 0 0 0 -1.41602,0 l -5.29101,5.29297 -5.29297,-5.29297 a 1,1 0 0 0 -0.70703,-0.29296 z"
         id="path245"
         style="fill:#2e3436;fill-opacity:1" />
      <rect
         y="195.00317"
         x="163.1358"
         height="16"
         width="16"
         id="rect245"
         style="fill:none;fill-opacity:1" />
    </g>
  </g>
</svg>
