<?xml version="1.0" encoding="UTF-8" standalone="no"?>
<svg
   inkscape:version="1.1 (c68e22c387, 2021-05-23)"
   id="svg8"
   version="1.1"
   viewBox="0 0 230 140"
   height="140"
   width="230"
   sodipodi:docname="guidelines-appname.svg"
   xmlns:inkscape="http://www.inkscape.org/namespaces/inkscape"
   xmlns:sodipodi="http://sodipodi.sourceforge.net/DTD/sodipodi-0.dtd"
   xmlns="http://www.w3.org/2000/svg"
   xmlns:svg="http://www.w3.org/2000/svg"
   xmlns:rdf="http://www.w3.org/1999/02/22-rdf-syntax-ns#">
  <defs
     id="defs2">
    <clipPath
       clipPathUnits="userSpaceOnUse"
       id="clipPath28924">
      <rect
         style="fill:#99c1f1;stroke:none;stroke-width:4.7625;stroke-linecap:round;stroke-dashoffset:26.4"
         id="rect28926"
         width="60.854164"
         height="37.041683"
         x="223.57289"
         y="113.77081"
         ry="2.1166666"
         rx="2.1166666" />
    </clipPath>
    <inkscape:path-effect
       effect="fillet_chamfer"
       id="path-effect51438"
       is_visible="true"
       lpeversion="1"
       satellites_param="F,0,0,1,0,0,0,1 @ F,0,0,1,0,0,0,1 @ F,0,0,1,0,0,0,1 @ F,0,0,1,0,2,0,1"
       unit="px"
       method="auto"
       mode="F"
       radius="8"
       chamfer_steps="1"
       flexible="false"
       use_knot_distance="true"
       apply_no_radius="true"
       apply_with_radius="true"
       only_selected="false"
       hide_knots="false" />
    <clipPath
       clipPathUnits="userSpaceOnUse"
       id="clipPath40461">
      <rect
         style="fill:#99c1f1;stroke:none;stroke-width:4.7625;stroke-linecap:round;stroke-dashoffset:26.4"
         id="rect40463"
         width="60.854164"
         height="37.041683"
         x="223.57289"
         y="163.24783"
         ry="2.1166666"
         rx="2.1166666" />
    </clipPath>
  </defs>
  <sodipodi:namedview
     units="px"
     borderlayer="true"
     inkscape:showpageshadow="false"
     showgrid="false"
     inkscape:document-rotation="0"
     inkscape:current-layer="layer1"
     inkscape:document-units="px"
     inkscape:cy="560"
     inkscape:cx="400"
     inkscape:zoom="0.35"
     inkscape:pageshadow="2"
     inkscape:pageopacity="0"
     borderopacity="1"
     bordercolor="#383838"
     pagecolor="#1f1f1f"
     id="base"
     inkscape:pagecheckerboard="1"
     width="230px">
    <inkscape:grid
       type="xygrid"
       id="grid1900" />
  </sodipodi:namedview>
  <metadata
     id="metadata5">
    <rdf:RDF />
  </metadata>
  <g
     id="layer1"
     inkscape:groupmode="layer"
     inkscape:label="Layer 1">
    <rect
       style="fill:#99c1f1;stroke:none;stroke-width:18;stroke-linecap:round;stroke-dashoffset:26.4"
       id="rect1098"
       width="229.99998"
       height="140.00005"
       x="0.0010986328"
       y="-5.7220459e-05"
       ry="7.999999"
       rx="7.999999" />
    <g
       id="g5388"
       transform="matrix(3.7795272,0,0,3.7795272,-615,-427.5)">
      <rect
         style="fill:#b3d0f4;fill-opacity:1;stroke:none;stroke-width:2.04409;stroke-linecap:round;stroke-dashoffset:26.4"
         id="rect4152-0"
         width="31.75001"
         height="19.3146"
         x="174.62502"
         y="122.2375" />
      <text
         xml:space="preserve"
         style="font-style:normal;font-variant:normal;font-weight:800;font-stretch:normal;font-size:16.4792px;line-height:1.25;font-family:Cantarell;-inkscape-font-specification:'Cantarell, Ultra-Bold';font-variant-ligatures:normal;font-variant-caps:normal;font-variant-numeric:normal;font-variant-east-asian:normal;text-align:start;letter-spacing:0px;word-spacing:0px;text-anchor:start;fill:#ffffff;fill-opacity:1;stroke-width:0.264583"
         x="175.92145"
         y="136.15211"
         id="text86121-6"><tspan
           sodipodi:role="line"
           id="tspan86119-2"
           style="font-style:normal;font-variant:normal;font-weight:800;font-stretch:normal;font-size:16.4792px;font-family:Cantarell;-inkscape-font-specification:'Cantarell, Ultra-Bold';font-variant-ligatures:normal;font-variant-caps:normal;font-variant-numeric:normal;font-variant-east-asian:normal;text-align:start;text-anchor:start;fill:#ffffff;fill-opacity:1;stroke-width:0.264583"
           x="175.92145"
           y="136.15211">App</tspan></text>
      <rect
         style="fill:#ffffff;stroke-width:0.529167;stop-color:#000000"
         id="rect2019"
         width="1.3229167"
         height="19.843752"
         x="209.02084"
         y="121.70834" />
      <rect
         style="fill:#ffffff;stroke-width:0.529167;stop-color:#000000"
         id="rect3352"
         width="3.9687505"
         height="1.3229167"
         x="207.69794"
         y="120.38543"
         rx="0"
         ry="0" />
      <rect
         style="fill:#ffffff;stroke-width:0.529167;stop-color:#000000"
         id="rect3434"
         width="3.9687505"
         height="1.3229167"
         x="207.69794"
         y="141.55209"
         rx="0"
         ry="0" />
    </g>
  </g>
</svg>
