<?xml version="1.0" encoding="UTF-8" standalone="no"?>
<!-- Created with Inkscape (http://www.inkscape.org/) -->

<svg
   width="210"
   height="200"
   viewBox="0 0 210 200"
   version="1.1"
   id="svg5"
   inkscape:version="1.3 (0e150ed6c4, 2023-07-21)"
   sodipodi:docname="rubber-duck.svg"
   xmlns:inkscape="http://www.inkscape.org/namespaces/inkscape"
   xmlns:sodipodi="http://sodipodi.sourceforge.net/DTD/sodipodi-0.dtd"
   xmlns:xlink="http://www.w3.org/1999/xlink"
   xmlns="http://www.w3.org/2000/svg"
   xmlns:svg="http://www.w3.org/2000/svg">
  <sodipodi:namedview
     id="namedview7"
     pagecolor="#ffffff"
     bordercolor="#000000"
     borderopacity="0.25"
     inkscape:showpageshadow="true"
     inkscape:pageopacity="0.0"
     inkscape:pagecheckerboard="false"
     inkscape:deskcolor="#181818"
     inkscape:document-units="px"
     showgrid="true"
     inkscape:zoom="2"
     inkscape:cx="-110.75"
     inkscape:cy="156.25"
     inkscape:current-layer="g38">
    <inkscape:grid
       id="grid1"
       units="px"
       originx="0"
       originy="0"
       spacingx="1"
       spacingy="1"
       empcolor="#0099e5"
       empopacity="0.30196078"
       color="#0099e5"
       opacity="0.14901961"
       empspacing="4"
       dotted="false"
       gridanglex="30"
       gridanglez="30"
       visible="true" />
    <inkscape:page
       x="0"
       y="0"
       width="210"
       height="200"
       id="page12"
       margin="0"
       bleed="0"
       inkscape:export-filename="../../../../Pictures/duck.png"
       inkscape:export-xdpi="518.40002"
       inkscape:export-ydpi="518.40002" />
    <inkscape:page
       x="340"
       y="220"
       width="0"
       height="0.055860002"
       id="page13"
       margin="0"
       bleed="0" />
  </sodipodi:namedview>
  <defs
     id="defs2">
    <inkscape:path-effect
       effect="fillet_chamfer"
       id="path-effect44"
       is_visible="true"
       lpeversion="1"
       nodesatellites_param="F,0,0,1,0,16.28144,0,1 @ F,0,0,1,0,0,0,1 @ F,0,0,1,0,0,0,1 @ F,0,0,1,0,0,0,1 @ F,0,0,1,0,0,0,1 @ F,0,0,1,0,0,0,1"
       radius="0"
       unit="px"
       method="auto"
       mode="F"
       chamfer_steps="1"
       flexible="false"
       use_knot_distance="true"
       apply_no_radius="true"
       apply_with_radius="true"
       only_selected="false"
       hide_knots="false" />
    <inkscape:path-effect
       effect="fillet_chamfer"
       id="path-effect35"
       is_visible="true"
       lpeversion="1"
       nodesatellites_param="F,0,0,1,0,16.28144,0,1 @ F,0,0,1,0,0,0,1 @ F,0,0,1,0,0,0,1 @ F,0,0,1,0,0,0,1 @ F,0,0,1,0,0,0,1 @ F,0,0,1,0,0,0,1"
       radius="0"
       unit="px"
       method="auto"
       mode="F"
       chamfer_steps="1"
       flexible="false"
       use_knot_distance="true"
       apply_no_radius="true"
       apply_with_radius="true"
       only_selected="false"
       hide_knots="false" />
    <inkscape:path-effect
       effect="fillet_chamfer"
       id="path-effect28"
       is_visible="true"
       lpeversion="1"
       nodesatellites_param="F,0,0,1,0,0,0,1 @ F,0,0,1,0,0,0,1 @ F,0,0,1,0,12.441003,0,1 @ F,0,0,1,0,0,0,1 @ F,0,0,1,0,0,0,1 @ F,0,0,1,0,0,0,1 @ F,0,0,1,0,0,0,1 @ F,0,0,1,0,0,0,1 @ F,0,0,1,0,0,0,1 @ F,0,0,1,0,0,0,1 @ F,0,0,1,0,0,0,1 @ F,0,0,1,0,0,0,1"
       radius="0"
       unit="px"
       method="auto"
       mode="F"
       chamfer_steps="1"
       flexible="false"
       use_knot_distance="true"
       apply_no_radius="true"
       apply_with_radius="true"
       only_selected="false"
       hide_knots="false" />
    <linearGradient
       id="linearGradient25"
       inkscape:collect="always">
      <stop
         style="stop-color:#f7de64;stop-opacity:1;"
         offset="0"
         id="stop25" />
      <stop
         style="stop-color:#f6d32d;stop-opacity:1;"
         offset="1"
         id="stop26" />
    </linearGradient>
    <linearGradient
       id="linearGradient18"
       inkscape:collect="always">
      <stop
         style="stop-color:#b54d00;stop-opacity:1;"
         offset="0"
         id="stop19" />
      <stop
         style="stop-color:#e66100;stop-opacity:1;"
         offset="1"
         id="stop20" />
    </linearGradient>
    <linearGradient
       id="linearGradient16"
       inkscape:collect="always">
      <stop
         style="stop-color:#ffb96c;stop-opacity:1;"
         offset="0"
         id="stop17" />
      <stop
         style="stop-color:#ff7800;stop-opacity:1;"
         offset="1"
         id="stop18" />
    </linearGradient>
    <linearGradient
       id="linearGradient14"
       inkscape:collect="always">
      <stop
         style="stop-color:#e5a50a;stop-opacity:0.29547277;"
         offset="0"
         id="stop14" />
      <stop
         style="stop-color:#e5a50a;stop-opacity:0.09539381;"
         offset="0.48834902"
         id="stop16" />
      <stop
         style="stop-color:#e5a50a;stop-opacity:0.2953608;"
         offset="1"
         id="stop15" />
    </linearGradient>
    <inkscape:path-effect
       effect="fillet_chamfer"
       id="path-effect12"
       is_visible="true"
       lpeversion="1"
       nodesatellites_param="F,0,0,1,0,16.28144,0,1 @ F,0,0,1,0,0,0,1 @ F,0,0,1,0,0,0,1 @ F,0,0,1,0,0,0,1 @ F,0,0,1,0,0,0,1 @ F,0,0,1,0,0,0,1"
       radius="0"
       unit="px"
       method="auto"
       mode="F"
       chamfer_steps="1"
       flexible="false"
       use_knot_distance="true"
       apply_no_radius="true"
       apply_with_radius="true"
       only_selected="false"
       hide_knots="false" />
    <inkscape:path-effect
       effect="fillet_chamfer"
       id="path-effect10"
       is_visible="true"
       lpeversion="1"
       nodesatellites_param="F,0,0,1,0,0,0,1 @ F,0,0,1,0,0,0,1 @ F,0,0,1,0,0,0,1 @ F,0,0,1,0,16.552137,0,1 @ F,0,0,1,0,0,0,1 @ F,0,0,1,0,0,0,1"
       radius="0"
       unit="px"
       method="auto"
       mode="F"
       chamfer_steps="1"
       flexible="false"
       use_knot_distance="true"
       apply_no_radius="true"
       apply_with_radius="true"
       only_selected="false"
       hide_knots="false" />
    <inkscape:path-effect
       effect="fillet_chamfer"
       id="path-effect79"
       is_visible="true"
       lpeversion="1"
       nodesatellites_param="F,0,1,1,0,8,0,1 @ F,0,0,1,0,8,0,1 @ F,0,0,1,0,0,0,1 @ F,0,0,1,0,7.9909668,0,1 @ F,0,0,1,0,7.9909668,0,1 @ F,0,0,1,0,0,0,1 @ F,0,0,1,0,0,0,1 @ F,0,0,1,0,8.001001,0,1 @ F,0,0,1,0,8.001001,0,1 @ F,0,0,1,0,0,0,1 @ F,0,0,1,0,0,0,1 @ F,0,0,1,0,8.001001,0,1 @ F,0,0,1,0,8.001001,0,1 @ F,0,0,1,0,0,0,1 @ F,0,0,1,0,8,0,1 @ F,0,0,1,0,0,0,1 @ F,0,0,1,0,8,0,1 @ F,0,0,1,0,8,0,1"
       radius="0"
       unit="px"
       method="auto"
       mode="F"
       chamfer_steps="1"
       flexible="false"
       use_knot_distance="true"
       apply_no_radius="true"
       apply_with_radius="true"
       only_selected="false"
       hide_knots="false" />
    <inkscape:path-effect
       effect="fillet_chamfer"
       id="path-effect70"
       is_visible="true"
       lpeversion="1"
       nodesatellites_param="F,0,1,1,0,8,0,1 @ F,0,0,1,0,8,0,1 @ F,0,0,1,0,0,0,1 @ F,0,0,1,0,7.9909668,0,1 @ F,0,0,1,0,7.9909668,0,1 @ F,0,0,1,0,0,0,1 @ F,0,0,1,0,0,0,1 @ F,0,0,1,0,8.001001,0,1 @ F,0,0,1,0,8.001001,0,1 @ F,0,0,1,0,0,0,1 @ F,0,0,1,0,0,0,1 @ F,0,0,1,0,8.001001,0,1 @ F,0,0,1,0,8.001001,0,1 @ F,0,0,1,0,0,0,1 @ F,0,0,1,0,8,0,1 @ F,0,0,1,0,0,0,1 @ F,0,0,1,0,8,0,1 @ F,0,0,1,0,8,0,1"
       radius="0"
       unit="px"
       method="auto"
       mode="F"
       chamfer_steps="1"
       flexible="false"
       use_knot_distance="true"
       apply_no_radius="true"
       apply_with_radius="true"
       only_selected="false"
       hide_knots="false" />
    <inkscape:path-effect
       effect="fillet_chamfer"
       id="path-effect68"
       is_visible="true"
       lpeversion="1"
       nodesatellites_param="F,0,1,1,0,8,0,1 @ F,0,0,1,0,8,0,1 @ F,0,0,1,0,0,0,1 @ F,0,0,1,0,7.9909668,0,1 @ F,0,0,1,0,7.9909668,0,1 @ F,0,0,1,0,0,0,1 @ F,0,0,1,0,0,0,1 @ F,0,0,1,0,8.001001,0,1 @ F,0,0,1,0,8.001001,0,1 @ F,0,0,1,0,0,0,1 @ F,0,0,1,0,0,0,1 @ F,0,0,1,0,8.001001,0,1 @ F,0,0,1,0,8.001001,0,1 @ F,0,0,1,0,0,0,1 @ F,0,0,1,0,8,0,1 @ F,0,0,1,0,0,0,1 @ F,0,0,1,0,8,0,1 @ F,0,0,1,0,8,0,1"
       radius="0"
       unit="px"
       method="auto"
       mode="F"
       chamfer_steps="1"
       flexible="false"
       use_knot_distance="true"
       apply_no_radius="true"
       apply_with_radius="true"
       only_selected="false"
       hide_knots="false" />
    <inkscape:path-effect
       effect="fillet_chamfer"
       id="path-effect66"
       is_visible="true"
       lpeversion="1"
       nodesatellites_param="F,0,1,1,0,8,0,1 @ F,0,0,1,0,8,0,1 @ F,0,0,1,0,0,0,1 @ F,0,0,1,0,7.9909668,0,1 @ F,0,0,1,0,7.9909668,0,1 @ F,0,0,1,0,0,0,1 @ F,0,0,1,0,0,0,1 @ F,0,0,1,0,8.001001,0,1 @ F,0,0,1,0,8.001001,0,1 @ F,0,0,1,0,0,0,1 @ F,0,0,1,0,0,0,1 @ F,0,0,1,0,8.001001,0,1 @ F,0,0,1,0,8.001001,0,1 @ F,0,0,1,0,0,0,1 @ F,0,0,1,0,8,0,1 @ F,0,0,1,0,0,0,1 @ F,0,0,1,0,8,0,1 @ F,0,0,1,0,8,0,1"
       radius="0"
       unit="px"
       method="auto"
       mode="F"
       chamfer_steps="1"
       flexible="false"
       use_knot_distance="true"
       apply_no_radius="true"
       apply_with_radius="true"
       only_selected="false"
       hide_knots="false" />
    <inkscape:path-effect
       effect="fillet_chamfer"
       id="path-effect64"
       is_visible="true"
       lpeversion="1"
       nodesatellites_param="F,0,1,1,0,8,0,1 @ F,0,0,1,0,8,0,1 @ F,0,0,1,0,0,0,1 @ F,0,0,1,0,7.9909668,0,1 @ F,0,0,1,0,7.9909668,0,1 @ F,0,0,1,0,0,0,1 @ F,0,0,1,0,0,0,1 @ F,0,0,1,0,8.001001,0,1 @ F,0,0,1,0,8.001001,0,1 @ F,0,0,1,0,0,0,1 @ F,0,0,1,0,0,0,1 @ F,0,0,1,0,8.001001,0,1 @ F,0,0,1,0,8.001001,0,1 @ F,0,0,1,0,0,0,1 @ F,0,0,1,0,8,0,1 @ F,0,0,1,0,0,0,1 @ F,0,0,1,0,8,0,1 @ F,0,0,1,0,8,0,1"
       radius="0"
       unit="px"
       method="auto"
       mode="F"
       chamfer_steps="1"
       flexible="false"
       use_knot_distance="true"
       apply_no_radius="true"
       apply_with_radius="true"
       only_selected="false"
       hide_knots="false" />
    <inkscape:path-effect
       effect="fillet_chamfer"
       id="path-effect40"
       is_visible="true"
       lpeversion="1"
       nodesatellites_param="F,0,1,1,0,8,0,1 @ F,0,0,1,0,8,0,1 @ F,0,0,1,0,0,0,1 @ F,0,0,1,0,7.9909668,0,1 @ F,0,0,1,0,7.9909668,0,1 @ F,0,0,1,0,0,0,1 @ F,0,0,1,0,0,0,1 @ F,0,0,1,0,8.001001,0,1 @ F,0,0,1,0,8.001001,0,1 @ F,0,0,1,0,0,0,1 @ F,0,0,1,0,0,0,1 @ F,0,0,1,0,8.001001,0,1 @ F,0,0,1,0,8.001001,0,1 @ F,0,0,1,0,0,0,1 @ F,0,0,1,0,8,0,1 @ F,0,0,1,0,0,0,1 @ F,0,0,1,0,8,0,1 @ F,0,0,1,0,8,0,1"
       radius="0"
       unit="px"
       method="auto"
       mode="F"
       chamfer_steps="1"
       flexible="false"
       use_knot_distance="true"
       apply_no_radius="true"
       apply_with_radius="true"
       only_selected="false"
       hide_knots="false" />
    <inkscape:path-effect
       effect="fillet_chamfer"
       id="path-effect38"
       is_visible="true"
       lpeversion="1"
       nodesatellites_param="F,0,1,1,0,8,0,1 @ F,0,0,1,0,8,0,1 @ F,0,0,1,0,0,0,1 @ F,0,0,1,0,7.9909668,0,1 @ F,0,0,1,0,7.9909668,0,1 @ F,0,0,1,0,0,0,1 @ F,0,0,1,0,0,0,1 @ F,0,0,1,0,8.001001,0,1 @ F,0,0,1,0,8.001001,0,1 @ F,0,0,1,0,0,0,1 @ F,0,0,1,0,0,0,1 @ F,0,0,1,0,8.001001,0,1 @ F,0,0,1,0,8.001001,0,1 @ F,0,0,1,0,0,0,1 @ F,0,0,1,0,8,0,1 @ F,0,0,1,0,0,0,1 @ F,0,0,1,0,8,0,1 @ F,0,0,1,0,8,0,1"
       radius="0"
       unit="px"
       method="auto"
       mode="F"
       chamfer_steps="1"
       flexible="false"
       use_knot_distance="true"
       apply_no_radius="true"
       apply_with_radius="true"
       only_selected="false"
       hide_knots="false" />
    <inkscape:path-effect
       effect="fillet_chamfer"
       id="path-effect36"
       is_visible="true"
       lpeversion="1"
       nodesatellites_param="F,0,1,1,0,8,0,1 @ F,0,0,1,0,8,0,1 @ F,0,0,1,0,0,0,1 @ F,0,0,1,0,7.9909668,0,1 @ F,0,0,1,0,7.9909668,0,1 @ F,0,0,1,0,0,0,1 @ F,0,0,1,0,0,0,1 @ F,0,0,1,0,8.001001,0,1 @ F,0,0,1,0,8.001001,0,1 @ F,0,0,1,0,0,0,1 @ F,0,0,1,0,0,0,1 @ F,0,0,1,0,8.001001,0,1 @ F,0,0,1,0,8.001001,0,1 @ F,0,0,1,0,0,0,1 @ F,0,0,1,0,8,0,1 @ F,0,0,1,0,0,0,1 @ F,0,0,1,0,8,0,1 @ F,0,0,1,0,8,0,1"
       radius="0"
       unit="px"
       method="auto"
       mode="F"
       chamfer_steps="1"
       flexible="false"
       use_knot_distance="true"
       apply_no_radius="true"
       apply_with_radius="true"
       only_selected="false"
       hide_knots="false" />
    <inkscape:path-effect
       effect="fillet_chamfer"
       id="path-effect34"
       is_visible="true"
       lpeversion="1"
       nodesatellites_param="F,0,1,1,0,8,0,1 @ F,0,0,1,0,8,0,1 @ F,0,0,1,0,0,0,1 @ F,0,0,1,0,7.9909668,0,1 @ F,0,0,1,0,7.9909668,0,1 @ F,0,0,1,0,0,0,1 @ F,0,0,1,0,0,0,1 @ F,0,0,1,0,8.001001,0,1 @ F,0,0,1,0,8.001001,0,1 @ F,0,0,1,0,0,0,1 @ F,0,0,1,0,0,0,1 @ F,0,0,1,0,8.001001,0,1 @ F,0,0,1,0,8.001001,0,1 @ F,0,0,1,0,0,0,1 @ F,0,0,1,0,8,0,1 @ F,0,0,1,0,0,0,1 @ F,0,0,1,0,8,0,1 @ F,0,0,1,0,8,0,1"
       radius="0"
       unit="px"
       method="auto"
       mode="F"
       chamfer_steps="1"
       flexible="false"
       use_knot_distance="true"
       apply_no_radius="true"
       apply_with_radius="true"
       only_selected="false"
       hide_knots="false" />
    <inkscape:path-effect
       effect="fillet_chamfer"
       id="path-effect27"
       is_visible="true"
       lpeversion="1"
       nodesatellites_param="F,0,1,1,0,8,0,1 @ F,0,0,1,0,8,0,1 @ F,0,0,1,0,0,0,1 @ F,0,0,1,0,7.9909668,0,1 @ F,0,0,1,0,7.9909668,0,1 @ F,0,0,1,0,0,0,1 @ F,0,0,1,0,0,0,1 @ F,0,0,1,0,8.001001,0,1 @ F,0,0,1,0,8.001001,0,1 @ F,0,0,1,0,0,0,1 @ F,0,0,1,0,0,0,1 @ F,0,0,1,0,8.001001,0,1 @ F,0,0,1,0,8.001001,0,1 @ F,0,0,1,0,0,0,1 @ F,0,0,1,0,8,0,1 @ F,0,0,1,0,0,0,1 @ F,0,0,1,0,8,0,1 @ F,0,0,1,0,8,0,1"
       radius="0"
       unit="px"
       method="auto"
       mode="F"
       chamfer_steps="1"
       flexible="false"
       use_knot_distance="true"
       apply_no_radius="true"
       apply_with_radius="true"
       only_selected="false"
       hide_knots="false" />
    <inkscape:path-effect
       effect="bend_path"
       id="path-effect26"
       is_visible="true"
       lpeversion="1"
       bendpath="m 164,77.999996 h 28"
       prop_scale="1"
       scale_y_rel="false"
       vertical="false"
       hide_knot="false" />
    <inkscape:path-effect
       effect="envelope"
       id="path-effect25"
       is_visible="true"
       lpeversion="1"
       yy="true"
       xx="true"
       bendpath1="m 164,47.999996 h 28"
       bendpath2="M 192,47.999996 V 108"
       bendpath3="m 164,108 h 28"
       bendpath4="M 164,47.999996 V 108" />
    <clipPath
       clipPathUnits="userSpaceOnUse"
       id="clipPath26">
      <rect
         style="fill:#9a9996;stroke:none;stroke-width:2.52728;stroke-linejoin:round"
         id="rect26"
         width="19.008688"
         height="44.353603"
         x="167.62822"
         y="51.685085"
         ry="6"
         rx="6" />
    </clipPath>
    <clipPath
       clipPathUnits="userSpaceOnUse"
       id="clipPath25">
      <rect
         style="fill:#9141ac;stroke:none;stroke-width:2.50714;stroke-linejoin:round"
         id="rect25"
         width="20"
         height="44"
         x="88"
         y="40.000015"
         ry="4"
         rx="4" />
    </clipPath>
    <clipPath
       clipPathUnits="userSpaceOnUse"
       id="clipPath7">
      <path
         style="fill:#deddda;stroke-width:3.77744;stroke-linecap:round"
         d="M 11.989211,286 63.99973,182 116.01025,286 Z"
         id="path8"
         sodipodi:nodetypes="cccc" />
    </clipPath>
    <clipPath
       clipPathUnits="userSpaceOnUse"
       id="clipPath16">
      <path
         style="fill:#f6f5f4;stroke-width:3.77744;stroke-linecap:round"
         d="M 11.989211,286 63.99973,182 116.01025,286 Z"
         id="path17"
         sodipodi:nodetypes="cccc" />
    </clipPath>
    <clipPath
       clipPathUnits="userSpaceOnUse"
       id="clipPath44">
      <path
         id="path45"
         style="fill:#99c1f1;fill-opacity:0.980881;stroke:none;stroke-width:1.56097;stroke-linejoin:round"
         d="M 186.5,8 A 42.5,42.5 0 0 0 147.58594,33.912109 16,16 0 0 0 140,32 16,16 0 0 0 128.27344,37.15625 64,64 0 0 0 95.515625,28 a 64,64 0 0 0 -64,64 64,64 0 0 0 64,64 64,64 0 0 0 23.478515,-4.62305 A 54,54 0 0 0 170,188 54,54 0 0 0 204.91406,175.14648 54,54 0 0 0 214,176 54,54 0 0 0 252.77148,159.40234 54,54 0 0 0 282,168 54,54 0 0 0 336,114 54,54 0 0 0 287.36719,60.269531 42.5,42.5 0 0 0 246.12109,28 42.5,42.5 0 0 0 225.43555,33.494141 42.5,42.5 0 0 0 186.5,8 Z" />
    </clipPath>
    <clipPath
       clipPathUnits="userSpaceOnUse"
       id="clipPath87">
      <g
         id="g88">
        <path
           style="fill:#deddda;stroke-width:3.77744;stroke-linecap:round"
           d="M 207.98921,172 259.99973,68 312.01025,172 Z"
           id="path88"
           sodipodi:nodetypes="cccc" />
      </g>
    </clipPath>
    <clipPath
       clipPathUnits="userSpaceOnUse"
       id="clipPath88">
      <g
         id="g89">
        <path
           style="fill:#deddda;stroke-width:3.77744;stroke-linecap:round"
           d="M 207.98921,172 259.99973,68 312.01025,172 Z"
           id="path89"
           sodipodi:nodetypes="cccc" />
      </g>
    </clipPath>
    <clipPath
       clipPathUnits="userSpaceOnUse"
       id="clipPath89">
      <g
         id="g90">
        <path
           style="fill:#deddda;stroke-width:3.77744;stroke-linecap:round"
           d="M 207.98921,172 259.99973,68 312.01025,172 Z"
           id="path90"
           sodipodi:nodetypes="cccc" />
      </g>
    </clipPath>
    <clipPath
       clipPathUnits="userSpaceOnUse"
       id="clipPath90">
      <g
         id="g91">
        <path
           style="fill:#deddda;stroke-width:3.77744;stroke-linecap:round"
           d="M 207.98921,172 259.99973,68 312.01025,172 Z"
           id="path91"
           sodipodi:nodetypes="cccc" />
      </g>
    </clipPath>
    <clipPath
       clipPathUnits="userSpaceOnUse"
       id="clipPath91">
      <g
         id="g92">
        <path
           style="fill:#deddda;stroke-width:3.77744;stroke-linecap:round"
           d="M 207.98921,172 259.99973,68 312.01025,172 Z"
           id="path92"
           sodipodi:nodetypes="cccc" />
      </g>
    </clipPath>
    <clipPath
       clipPathUnits="userSpaceOnUse"
       id="clipPath101">
      <g
         id="g102">
        <path
           style="fill:#deddda;stroke-width:3.77744;stroke-linecap:round"
           d="M 207.98921,172 259.99973,68 312.01025,172 Z"
           id="path102"
           sodipodi:nodetypes="cccc" />
      </g>
    </clipPath>
    <clipPath
       clipPathUnits="userSpaceOnUse"
       id="clipPath102">
      <g
         id="g103">
        <path
           style="fill:#deddda;stroke-width:3.77744;stroke-linecap:round"
           d="M 207.98921,172 259.99973,68 312.01025,172 Z"
           id="path103"
           sodipodi:nodetypes="cccc" />
      </g>
    </clipPath>
    <clipPath
       clipPathUnits="userSpaceOnUse"
       id="clipPath103">
      <g
         id="g104">
        <path
           style="fill:#deddda;stroke-width:3.77744;stroke-linecap:round"
           d="M 207.98921,172 259.99973,68 312.01025,172 Z"
           id="path104"
           sodipodi:nodetypes="cccc" />
      </g>
    </clipPath>
    <clipPath
       clipPathUnits="userSpaceOnUse"
       id="clipPath104">
      <g
         id="g105">
        <path
           style="fill:#deddda;stroke-width:3.77744;stroke-linecap:round"
           d="M 207.98921,172 259.99973,68 312.01025,172 Z"
           id="path105"
           sodipodi:nodetypes="cccc" />
      </g>
    </clipPath>
    <clipPath
       clipPathUnits="userSpaceOnUse"
       id="clipPath105">
      <g
         id="g106">
        <path
           style="fill:#deddda;stroke-width:3.77744;stroke-linecap:round"
           d="M 207.98921,172 259.99973,68 312.01025,172 Z"
           id="path106"
           sodipodi:nodetypes="cccc" />
      </g>
    </clipPath>
    <linearGradient
       inkscape:collect="always"
       xlink:href="#linearGradient14"
       id="linearGradient35"
       gradientUnits="userSpaceOnUse"
       x1="96"
       y1="163.94043"
       x2="248"
       y2="163.94043"
       gradientTransform="matrix(-1,0,0,1,366.31053,-222)" />
    <radialGradient
       inkscape:collect="always"
       xlink:href="#linearGradient25"
       id="radialGradient35"
       gradientUnits="userSpaceOnUse"
       gradientTransform="matrix(1,0,0,0.65789474,-366.31053,-173.42105)"
       cx="143.82668"
       cy="78.58152"
       fx="143.82668"
       fy="78.58152"
       r="76" />
    <radialGradient
       inkscape:collect="always"
       xlink:href="#linearGradient25"
       id="radialGradient36"
       gradientUnits="userSpaceOnUse"
       cx="204"
       cy="24"
       fx="204"
       fy="24"
       r="38"
       gradientTransform="translate(-375.99998,-222)" />
    <radialGradient
       inkscape:collect="always"
       xlink:href="#linearGradient16"
       id="radialGradient37"
       gradientUnits="userSpaceOnUse"
       gradientTransform="matrix(-1,0,0,0.64761467,375.99998,-201.85574)"
       cx="272.44836"
       cy="32.636341"
       fx="272.44836"
       fy="32.636341"
       r="18.290152" />
    <radialGradient
       inkscape:collect="always"
       xlink:href="#linearGradient18"
       id="radialGradient38"
       gradientUnits="userSpaceOnUse"
       gradientTransform="matrix(-1,0,0,0.43739383,375.99998,-188.80624)"
       cx="264.97961"
       cy="77.290154"
       fx="264.97961"
       fy="77.290154"
       r="18.290154" />
  </defs>
  <g
     inkscape:label="Layer 1"
     inkscape:groupmode="layer"
     id="layer1">
    <g
       id="g38"
       transform="translate(-79.999985,222)">
      <path
         id="path29"
         style="fill:#f5c211;fill-opacity:1;stroke-width:2;stroke-linejoin:round"
         d="m 191.78221,-180.0625 c -20.61594,37.9641 6.90461,58.98221 40.02831,59.0625 9.41887,-0.0397 18.65085,-2.20641 27.03008,-6.27382 6.17102,-2.99552 12.97674,-1.43259 14.76783,5.19329 1.76534,6.53062 2.67823,13.28033 2.7021,20.08053 -0.0501,14.74258 -4.27719,29.169119 -12.19142,41.607419 l -65.80859,-1.126949 v -44.36328 l -69.24609,0.28906 -0.006,-0.0684 c 4.64295,-4.97964 12.60328,-10.39686 12.63222,-20.85088 -0.0276,-8.50396 -2.18497,-13.98491 -9.00769,-19.06119 l -0.008,-0.0937 z"
         sodipodi:nodetypes="ccsscccccccccc" />
      <path
         id="path30"
         style="fill:url(#radialGradient38);fill-opacity:1;stroke-width:2;stroke-linejoin:round"
         d="m 129.31053,-155 v -14.82226 c -3.28282,-0.74209 -6.6346,-1.13684 -10,-1.17774 -8.42945,0.0302 -16.03437,2.37707 -21.903563,5.32992 -7.957905,4.00371 -5.16922,7.36386 3.910313,6.76972 0.95852,-0.0627 1.95655,-0.098 2.99325,-0.0996 6.44116,0.0101 12.80839,1.37287 18.68945,4 z"
         sodipodi:nodetypes="ccccccc" />
      <path
         id="path31"
         style="fill:url(#radialGradient37);fill-opacity:1;stroke-width:2;stroke-linejoin:round"
         d="m 123.99998,-182 v 14.82226 c -3.28282,0.74209 -6.6346,1.13684 -10,1.17774 -8.42945,-0.0302 -16.034373,-2.37707 -21.903563,-5.32992 -7.957905,-4.00371 -5.169215,-7.36386 3.91031,-6.76972 0.95852,0.0627 1.95655,0.098 2.993255,0.0996 6.441158,-0.0101 12.808388,-1.37287 18.689448,-4 z"
         sodipodi:nodetypes="ccccccc" />
      <circle
         style="fill:url(#radialGradient36);fill-opacity:1;stroke-width:2;stroke-linejoin:round"
         id="circle31"
         cx="-153.99998"
         cy="-176"
         r="38"
         transform="scale(-1,1)" />
      <circle
         style="fill:#000000;fill-opacity:1;stroke-width:2;stroke-linejoin:round"
         id="circle32"
         cx="-137.99998"
         cy="-184"
         r="10"
         transform="scale(-1,1)" />
      <ellipse
         style="fill:url(#radialGradient35);stroke-width:2;stroke-linejoin:round"
         id="ellipse32"
         cx="-194.31052"
         cy="-80"
         rx="76"
         ry="50"
         transform="scale(-1,1)" />
      <path
         id="path32"
         style="fill:#f5c211;fill-opacity:1;stroke-width:2;stroke-linejoin:round"
         d="m 116.36848,127.83901 c 11.54181,26.41691 37.80882,44.27425 67.63152,44.34497 15.46397,0 28,-12.53603 28,-28 0,-15.46397 -12.53603,-28 -28,-28 -2.68191,8e-4 -5.34979,0.3869 -7.92188,1.14648 -7.89913,1.8197 -15.97247,2.77648 -24.07812,2.85352 -8.4165,-0.0572 -16.78217,-1.06278 -24.94086,-2.9864 -8.74432,-2.06169 -14.28349,2.41814 -10.69066,10.64143 z"
         inkscape:path-effect="#path-effect35"
         inkscape:original-d="M 111.53906,112.3246 A 74,74 0 0 0 184,172.18398 a 28,28 0 0 0 28,-28 28,28 0 0 0 -28,-28 28,28 0 0 0 -7.92188,1.14648 A 112,112 0 0 1 152,120.18398 112,112 0 0 1 111.53906,112.3246 Z"
         transform="matrix(-1,0,0,1,362.31053,-228.18398)" />
      <path
         id="path33"
         style="fill:url(#linearGradient35);fill-opacity:0.5;stroke-width:2;stroke-linejoin:round"
         d="M 118.89646,-86.11914 A 76,50 0 0 0 194.31052,-42 a 76,50 0 0 0 75.40234,-44 76,50 0 0 1 0.59766,6 76,50 0 0 1 -76,50 76,50 0 0 1 -76,-50 76,50 0 0 1 0.58594,-6.11914 z" />
      <circle
         style="fill:#ffffff;fill-opacity:1;stroke-width:2;stroke-linejoin:round"
         id="circle33"
         cx="-135.49998"
         cy="-187.5"
         r="2.5000005"
         transform="scale(-1,1)" />
    </g>
  </g>
</svg>
