<?xml version="1.0" encoding="UTF-8" standalone="no"?>
<svg
   inkscape:version="1.1 (c68e22c387, 2021-05-23)"
   id="svg8"
   version="1.1"
   viewBox="0 0 230 140"
   height="140"
   width="230"
   sodipodi:docname="containers-utilitypanes.svg"
   xmlns:inkscape="http://www.inkscape.org/namespaces/inkscape"
   xmlns:sodipodi="http://sodipodi.sourceforge.net/DTD/sodipodi-0.dtd"
   xmlns="http://www.w3.org/2000/svg"
   xmlns:svg="http://www.w3.org/2000/svg"
   xmlns:rdf="http://www.w3.org/1999/02/22-rdf-syntax-ns#">
  <defs
     id="defs2">
    <clipPath
       clipPathUnits="userSpaceOnUse"
       id="clipPath28924">
      <rect
         style="fill:#99c1f1;stroke:none;stroke-width:4.7625;stroke-linecap:round;stroke-dashoffset:26.4"
         id="rect28926"
         width="60.854164"
         height="37.041683"
         x="223.57289"
         y="113.77081"
         ry="2.1166666"
         rx="2.1166666" />
    </clipPath>
    <inkscape:path-effect
       effect="fillet_chamfer"
       id="path-effect51438"
       is_visible="true"
       lpeversion="1"
       satellites_param="F,0,0,1,0,0,0,1 @ F,0,0,1,0,0,0,1 @ F,0,0,1,0,0,0,1 @ F,0,0,1,0,2,0,1"
       unit="px"
       method="auto"
       mode="F"
       radius="8"
       chamfer_steps="1"
       flexible="false"
       use_knot_distance="true"
       apply_no_radius="true"
       apply_with_radius="true"
       only_selected="false"
       hide_knots="false" />
  </defs>
  <sodipodi:namedview
     units="px"
     borderlayer="true"
     inkscape:showpageshadow="false"
     showgrid="true"
     inkscape:document-rotation="0"
     inkscape:current-layer="layer1"
     inkscape:document-units="px"
     inkscape:cy="560"
     inkscape:cx="400"
     inkscape:zoom="0.35"
     inkscape:pageshadow="2"
     inkscape:pageopacity="0"
     borderopacity="1"
     bordercolor="#383838"
     pagecolor="#1f1f1f"
     id="base"
     inkscape:pagecheckerboard="1"
     width="230px">
    <inkscape:grid
       type="xygrid"
       id="grid1900" />
  </sodipodi:namedview>
  <metadata
     id="metadata5">
    <rdf:RDF />
  </metadata>
  <g
     id="layer1"
     inkscape:groupmode="layer"
     inkscape:label="Layer 1">
    <rect
       style="fill:#99c1f1;stroke:none;stroke-width:18;stroke-linecap:round;stroke-dashoffset:26.4"
       id="rect1098"
       width="229.99998"
       height="140.00005"
       x="0.0010986328"
       y="-5.7220459e-05"
       ry="7.999999"
       rx="7.999999" />
    <g
       id="g3933"
       transform="matrix(3.7795273,0,0,3.7795273,-1469.9993,-619.99995)">
      <g
         id="g50641"
         transform="translate(230.18734,7.6293945e-5)">
        <rect
           style="fill:#d1e3f9;fill-opacity:1;stroke:none;stroke-width:4.7625;stroke-linecap:round;stroke-dashoffset:26.4"
           id="rect50632"
           width="34.395828"
           height="23.8125"
           x="171.97917"
           y="170.65617"
           ry="2.1166668"
           rx="2.1166666" />
        <path
           d="m 203.465,172.24376 h 0.13638 c 0.0338,0.002 0.0675,0.017 0.091,0.0414 l 0.30174,0.30148 0.30585,-0.30161 c 0.0352,-0.0305 0.0591,-0.0405 0.091,-0.0414 h 0.13228 v 0.13228 c 0,0.0378 -0.005,0.0728 -0.0331,0.0992 l -0.30174,0.30187 0.29764,0.29764 c 0.0248,0.0249 0.0371,0.0601 0.0371,0.0951 v 0.13228 h -0.13228 c -0.0351,0 -0.0701,-0.0123 -0.0951,-0.0371 l -0.30175,-0.30174 -0.30174,0.30161 a 0.1342696,0.1342696 0 0 1 -0.0951,0.0373 h -0.13228 v -0.13228 c 0,-0.0351 0.0123,-0.0701 0.0371,-0.0951 l 0.30174,-0.29764 -0.30161,-0.30174 a 0.12024736,0.12024736 0 0 1 -0.0373,-0.0992 z"
           style="line-height:normal;-inkscape-font-specification:'Andale Mono';text-indent:0;text-align:start;text-decoration-line:none;text-transform:none;fill:#99c1f1;fill-opacity:1;stroke:none;stroke-width:0.264583;marker:none"
           color="#bebebe"
           font-weight="400"
           font-family="'Andale Mono'"
           overflow="visible"
           fill="#2e3436"
           id="path50634" />
        <path
           style="fill:none;stroke:#99c1f1;stroke-width:0.264583;stroke-linecap:butt;stroke-linejoin:miter;stroke-opacity:1"
           d="M 171.97917,174.75723 H 206.375"
           id="path50636" />
        <path
           style="fill:#ffffff;fill-opacity:1;stroke:none;stroke-width:4.7625;stroke-linecap:round;stroke-dashoffset:26.4"
           id="rect50781"
           width="14.552079"
           height="19.579163"
           x="171.97917"
           y="174.88951"
           inkscape:path-effect="#path-effect51438"
           sodipodi:type="rect"
           d="m 171.97917,174.88951 h 14.55208 v 19.57916 h -12.55208 a 2,2 45 0 1 -2,-2 z" />
      </g>
      <rect
         width="8.2314978"
         height="0.52917123"
         x="406.1358"
         y="177.27083"
         fill="#99c1f1"
         id="rect40103-5"
         style="fill:#d1e3f9;fill-opacity:1;stroke-width:0.264583" />
      <rect
         width="9.2604303"
         height="0.52916104"
         x="406.1358"
         y="179.91667"
         fill="#99c1f1"
         id="rect53226"
         style="fill:#d1e3f9;fill-opacity:1;stroke-width:0.264583" />
      <rect
         width="5.1446853"
         height="0.5291661"
         x="406.1358"
         y="182.5625"
         fill="#99c1f1"
         id="rect53228"
         style="fill:#d1e3f9;fill-opacity:1;stroke-width:0.264583" />
      <rect
         width="9.2604303"
         height="0.52917123"
         x="406.1358"
         y="186.26666"
         fill="#99c1f1"
         id="rect53649"
         style="fill:#d1e3f9;fill-opacity:1;stroke-width:0.264583" />
      <rect
         width="9.2604303"
         height="0.52916104"
         x="406.1358"
         y="188.91251"
         fill="#99c1f1"
         id="rect53651"
         style="fill:#d1e3f9;fill-opacity:1;stroke-width:0.264583" />
      <rect
         width="7.2025681"
         height="0.5291661"
         x="406.13577"
         y="191.55833"
         fill="#99c1f1"
         id="rect53653"
         style="fill:#d1e3f9;fill-opacity:1;stroke-width:0.264583" />
      <circle
         style="fill:#d1e3f9;fill-opacity:1;stroke:none;stroke-width:0.264583;stroke-linecap:round;stroke-dashoffset:26.4;stroke-opacity:1"
         id="path54010"
         cx="404.15143"
         cy="177.53542"
         r="0.66145474" />
      <circle
         style="fill:#d1e3f9;fill-opacity:1;stroke:none;stroke-width:0.264583;stroke-linecap:round;stroke-dashoffset:26.4;stroke-opacity:1"
         id="circle54114"
         cx="404.15143"
         cy="180.18124"
         r="0.66145474" />
      <circle
         style="fill:#d1e3f9;fill-opacity:1;stroke:none;stroke-width:0.264583;stroke-linecap:round;stroke-dashoffset:26.4;stroke-opacity:1"
         id="circle54116"
         cx="404.15143"
         cy="182.82709"
         r="0.66145474" />
      <circle
         style="fill:#d1e3f9;fill-opacity:1;stroke:none;stroke-width:0.264583;stroke-linecap:round;stroke-dashoffset:26.4;stroke-opacity:1"
         id="circle54118"
         cx="404.15143"
         cy="186.53125"
         r="0.66145474" />
      <circle
         style="fill:#d1e3f9;fill-opacity:1;stroke:none;stroke-width:0.264583;stroke-linecap:round;stroke-dashoffset:26.4;stroke-opacity:1"
         id="circle54120"
         cx="404.15143"
         cy="189.17708"
         r="0.66145474" />
      <circle
         style="fill:#d1e3f9;fill-opacity:1;stroke:none;stroke-width:0.264583;stroke-linecap:round;stroke-dashoffset:26.4;stroke-opacity:1"
         id="circle54122"
         cx="404.15143"
         cy="191.82292"
         r="0.66145474" />
    </g>
  </g>
</svg>
