<?xml version="1.0" encoding="UTF-8" standalone="no"?>
<svg
   xmlns:dc="http://purl.org/dc/elements/1.1/"
   xmlns:cc="http://creativecommons.org/ns#"
   xmlns:rdf="http://www.w3.org/1999/02/22-rdf-syntax-ns#"
   xmlns:svg="http://www.w3.org/2000/svg"
   xmlns="http://www.w3.org/2000/svg"
   xmlns:xlink="http://www.w3.org/1999/xlink"
   xmlns:sodipodi="http://sodipodi.sourceforge.net/DTD/sodipodi-0.dtd"
   xmlns:inkscape="http://www.inkscape.org/namespaces/inkscape"
   inkscape:version="1.0.2 (e86c870879, 2021-01-15)"
   inkscape:export-ydpi="96"
   inkscape:export-xdpi="96"
   inkscape:export-filename="/var/home/jimmac/SparkleShare/app-illustrations/assets/initial-setup/initial-setup-welcome.png"
   sodipodi:docname="initial-setup-welcome.svg"
   id="svg313"
   version="1.1"
   height="754"
   width="1920">
  <metadata
     id="metadata317">
    <rdf:RDF>
      <cc:Work
         rdf:about="">
        <dc:format>image/svg+xml</dc:format>
        <dc:type
           rdf:resource="http://purl.org/dc/dcmitype/StillImage" />
      </cc:Work>
    </rdf:RDF>
  </metadata>
  <sodipodi:namedview
     inkscape:current-layer="svg313"
     inkscape:window-maximized="0"
     inkscape:window-y="23"
     inkscape:window-x="26"
     inkscape:cy="377"
     inkscape:cx="960"
     inkscape:zoom="0.690625"
     showgrid="false"
     id="namedview315"
     inkscape:window-height="1376"
     inkscape:window-width="2560"
     inkscape:pageshadow="2"
     inkscape:pageopacity="0"
     guidetolerance="10"
     gridtolerance="10"
     objecttolerance="10"
     borderopacity="1"
     bordercolor="#666666"
     pagecolor="#ffffff"
     inkscape:document-rotation="0">
    <inkscape:grid
       type="xygrid"
       id="grid1070" />
  </sodipodi:namedview>
  <defs
     id="defs28">
    <linearGradient
       y2="250"
       x2="64"
       y1="180"
       x1="64"
       gradientTransform="matrix(1.3 0 0 .83333 -19.2 34)"
       gradientUnits="userSpaceOnUse"
       id="m"
       xlink:href="#c" />
    <linearGradient
       xlink:href="#c"
       id="k"
       gradientUnits="userSpaceOnUse"
       gradientTransform="matrix(1.3 0 0 .83333 -19.2 34)"
       x1="64"
       y1="180"
       x2="64"
       y2="250" />
    <linearGradient
       id="a">
      <stop
         id="stop4"
         stop-color="#d0bb8e"
         offset="0" />
      <stop
         id="stop6"
         stop-color="#fff"
         offset="1" />
    </linearGradient>
    <linearGradient
       y2="292"
       x2="64"
       y1="254"
       x1="64"
       gradientTransform="matrix(1.3 0 0 1 -19.2 16.87)"
       gradientUnits="userSpaceOnUse"
       id="g"
       xlink:href="#b" />
    <linearGradient
       id="b">
      <stop
         id="stop10"
         stop-color="#cdab8f"
         offset="0" />
      <stop
         id="stop12"
         stop-color="#d3b69d"
         offset="1" />
    </linearGradient>
    <linearGradient
       y2="292"
       x2="64"
       y1="254"
       x1="64"
       gradientTransform="matrix(1.3,0,0,1,-19.2,-4)"
       gradientUnits="userSpaceOnUse"
       id="l"
       xlink:href="#b" />
    <linearGradient
       gradientTransform="matrix(-.03667 .05186 .03667 .05186 180.124 169.116)"
       y2="-127.399"
       x2="158.518"
       y1="-97.698"
       x1="128.817"
       gradientUnits="userSpaceOnUse"
       id="e"
       xlink:href="#a" />
    <linearGradient
       id="c">
      <stop
         id="stop17"
         stop-color="#e3cfbf"
         offset="0" />
      <stop
         id="stop19"
         stop-color="#e7d5c7"
         offset="1" />
    </linearGradient>
    <linearGradient
       xlink:href="#b"
       id="h"
       gradientUnits="userSpaceOnUse"
       gradientTransform="matrix(1.3 0 0 1 -19.2 -4)"
       x1="64"
       y1="254"
       x2="64"
       y2="292" />
    <linearGradient
       xlink:href="#c"
       id="i"
       gradientUnits="userSpaceOnUse"
       gradientTransform="matrix(1.3 0 0 .83333 -19.2 34)"
       x1="64"
       y1="180"
       x2="64"
       y2="250" />
    <linearGradient
       xlink:href="#b"
       id="j"
       gradientUnits="userSpaceOnUse"
       gradientTransform="matrix(1.3 0 0 1 -19.2 -4)"
       x1="64"
       y1="254"
       x2="64"
       y2="292" />
    <clipPath
       id="d"
       clipPathUnits="userSpaceOnUse">
      <path
         id="path25"
         stroke-width="1.357"
         fill="#4a86cf"
         overflow="visible"
         color="#000"
         style="marker:none"
         d="M2330.729-970.526h1007.5V-1366.5h-1007.5z" />
    </clipPath>
    <clipPath
       id="clipPath11679"
       clipPathUnits="userSpaceOnUse">
      <circle
         style="opacity:1;vector-effect:none;fill:#9141ac;fill-opacity:1;stroke:none;stroke-width:0.529167;stroke-linecap:round;stroke-linejoin:miter;stroke-miterlimit:4;stroke-dasharray:none;stroke-dashoffset:0;stroke-opacity:1;marker:none;marker-start:none;marker-mid:none;marker-end:none;paint-order:normal"
         id="circle11681"
         cx="239.05104"
         cy="77.263527"
         r="19.711458" />
    </clipPath>
    <linearGradient
       y2="250"
       x2="63.999992"
       y1="180"
       x1="63.999992"
       gradientTransform="matrix(1.3,0,0,0.83333333,-19.2,34)"
       gradientUnits="userSpaceOnUse"
       id="linearGradient2324"
       xlink:href="#c"
       inkscape:collect="always" />
    <linearGradient
       inkscape:collect="always"
       xlink:href="#b"
       id="linearGradient1442"
       gradientUnits="userSpaceOnUse"
       gradientTransform="matrix(1.3,0,0,1,-19.2,-4)"
       x1="64"
       y1="254"
       x2="64"
       y2="292" />
    <linearGradient
       inkscape:collect="always"
       xlink:href="#c"
       id="linearGradient1444"
       gradientUnits="userSpaceOnUse"
       gradientTransform="matrix(1.3,0,0,0.83333333,-19.2,34)"
       x1="63.999992"
       y1="180"
       x2="63.999992"
       y2="250" />
    <linearGradient
       inkscape:collect="always"
       xlink:href="#b"
       id="linearGradient1446"
       gradientUnits="userSpaceOnUse"
       gradientTransform="matrix(1.3,0,0,1,-19.2,-4)"
       x1="64"
       y1="254"
       x2="64"
       y2="292" />
    <linearGradient
       inkscape:collect="always"
       xlink:href="#c"
       id="linearGradient1448"
       gradientUnits="userSpaceOnUse"
       gradientTransform="matrix(1.3,0,0,0.83333333,-19.2,34)"
       x1="63.999992"
       y1="180"
       x2="63.999992"
       y2="250" />
    <clipPath
       clipPathUnits="userSpaceOnUse"
       id="clipPath984">
      <circle
         style="font-variation-settings:normal;display:none;opacity:1;vector-effect:none;fill:#77767b;fill-opacity:1;stroke:none;stroke-width:5.04302;stroke-linecap:round;stroke-linejoin:miter;stroke-miterlimit:4;stroke-dasharray:none;stroke-dashoffset:0;stroke-opacity:1;marker:none;marker-start:none;marker-mid:none;marker-end:none;paint-order:normal;stop-color:#000000;stop-opacity:1"
         id="circle986"
         cx="541.88373"
         cy="647.72638"
         r="73.975525" />
      <path
         id="lpe_path-effect988"
         style="font-variation-settings:normal;display:block;opacity:1;vector-effect:none;fill:#77767b;fill-opacity:1;stroke:none;stroke-width:5.04302;stroke-linecap:round;stroke-linejoin:miter;stroke-miterlimit:4;stroke-dasharray:none;stroke-dashoffset:0;stroke-opacity:1;marker:none;marker-start:none;marker-mid:none;marker-end:none;paint-order:normal;stop-color:#000000;stop-opacity:1"
         class="powerclip"
         d="m 399.30566,389.6405 h 285.1561 v 408.04123 h -285.1561 z m 216.55359,258.08588 a 73.975525,73.975525 0 0 0 -73.97552,-73.97553 73.975525,73.975525 0 0 0 -73.97553,73.97553 73.975525,73.975525 0 0 0 73.97553,73.97552 73.975525,73.975525 0 0 0 73.97552,-73.97552 z" />
    </clipPath>
    <inkscape:path-effect
       effect="powerclip"
       id="path-effect988"
       is_visible="true"
       lpeversion="1"
       inverse="true"
       flatten="false"
       hide_clip="false"
       message="Use fill-rule evenodd on &lt;b&gt;fill and stroke&lt;/b&gt; dialog if no flatten result after convert clip to paths." />
    <inkscape:path-effect
       effect="fillet_chamfer"
       id="path-effect259"
       is_visible="true"
       lpeversion="1"
       satellites_param="F,0,0,1,0,8,0,1 @ F,0,0,1,0,8,0,1 @ F,0,0,1,0,8,0,1 @ F,0,0,1,0,8,0,1"
       unit="px"
       method="auto"
       mode="F"
       radius="8"
       chamfer_steps="1"
       flexible="false"
       use_knot_distance="true"
       apply_no_radius="true"
       apply_with_radius="true"
       only_selected="false"
       hide_knots="false" />
  </defs>
  <path
     id="path30"
     fill="#1c71d8"
     overflow="visible"
     color="#000"
     style="marker:none;fill:#62a0ea"
     d="M0 754h1920V0H0z" />
  <g
     id="g311"
     transform="translate(-4440.203 2603.279) scale(1.90507)"
     clip-path="url(#d)">
    <path
       id="rect217"
       style="font-variation-settings:normal;opacity:1;vector-effect:none;fill:#000000;fill-opacity:0.102;stroke:none;stroke-width:2.19794;stroke-linecap:butt;stroke-linejoin:miter;stroke-miterlimit:4;stroke-dasharray:none;stroke-dashoffset:0;stroke-opacity:1;marker:none;stop-color:#000000;stop-opacity:1"
       d="m 3156.883,-1044.317 h 87.6343 c 2.0229,0 4.8481,3.6513 4.8481,3.6513 v 1.1893 c 0,0 -2.8252,3.6513 -4.8481,3.6513 h -87.6343 c -2.0228,0 -3.6513,-1.6285 -3.6513,-3.6513 v -1.1893 c 0,-2.0228 1.6285,-3.6513 3.6513,-3.6513 z"
       sodipodi:nodetypes="ssccsssss" />
    <g
       id="g50"
       transform="matrix(0 2.88666 -2.88666 0 3741.302 -1534.524)">
      <path
         id="path32"
         fill="url(#e)"
         d="M170.003 170.124l-1.993 1.993h3.986z"
         style="marker:none" />
      <path
         id="path34"
         fill="#424048"
         style="marker:none"
         d="M170.003 170.124l-.797.797h1.595z" />
      <path
         id="path36"
         fill="#f6d32d"
         d="M171.598 172.117h-3.189v27.633h3.189z" />
      <path
         id="path38"
         fill="#f9f06b"
         d="M169.184 172.117h-1.174v27.643l1.174-.01z" />
      <path
         id="path40"
         fill="#e5a50a"
         d="M170.823 172.117h1.173v27.643l-1.173-.01z" />
      <rect
         id="rect42"
         fill="#f66151"
         style="marker:none"
         width="3.969"
         height="3.969"
         x="168.01"
         y="199.76"
         rx="1.554"
         ry="1.554" />
      <path
         id="path44"
         fill="#ed333b"
         d="M169.565 199.76c-.056 0-.111.003-.166.01a1.55 1.55 0 011.39 1.545v.86a1.55 1.55 0 01-1.39 1.545c.055.006.11.01.166.01h.86c.86 0 1.554-.694 1.554-1.555v-.86c0-.861-.693-1.555-1.554-1.555z"
         style="marker:none" />
      <rect
         id="rect46"
         fill="#f6f5f4"
         ry="0"
         rx="0"
         y="199.76"
         x="168.01"
         height="1.323"
         width="3.969"
         style="marker:none" />
      <rect
         id="rect48"
         fill="#deddda"
         style="marker:none"
         width="1.191"
         height="1.323"
         x="170.789"
         y="199.76"
         rx="0"
         ry="0" />
    </g>
    <g
       id="g257"
       transform="matrix(.93209 0 0 .93209 -1000.99 4648.193)">
      <path
         id="path241"
         transform="translate(3662.15 -6599.407) scale(1.38952)"
         d="M12 232.87h104v76H12z"
         fill="url(#g)" />
      <path
         id="path243"
         d="M3678.824-6343.47h144.51v93.972h-144.51z"
         fill="#ac815b" />
      <path
         id="path245"
         d="M3678.824-6249.498h144.51v2.779h-144.51z"
         fill="#fff"
         opacity=".211"
         style="marker:none" />
      <path
         id="path247"
         fill="#e7d5c7"
         d="M3823.141-6248.491v-95.055l35.515 20.505v92.076z" />
      <path
         id="path249"
         d="M3678.868-6342.373h144.07v53.989h-144.07z"
         fill="#7d5738"
         style="marker:none" />
      <path
         id="path251"
         fill="#e7d5c7"
         d="M3678.859-6248.491v-95.055l-35.515 20.505v92.076z" />
      <rect
         id="rect253"
         fill="#e7d5c7"
         style="marker:none"
         width="144.375"
         height="1.25"
         x="3678.625"
         y="-6343.605"
         rx="0"
         ry="0" />
      <path
         id="path255"
         fill="#e7d5c7"
         style="marker:none"
         d="M3679-6249.48h145v39h-145z" />
    </g>
    <g
       id="g1787"
       style="opacity:1"
       transform="matrix(0.37916081,0,0,0.37916081,2110.3185,1312.8592)">
      <g
         transform="matrix(2.7996499,0,0,2.7996499,1838.4885,-6822.6518)"
         id="g11671"
         style="display:inline">
        <rect
           ry="7.6729164"
           rx="7.6729164"
           y="152.88948"
           x="254.983"
           height="26.458334"
           width="27.358967"
           id="rect11609"
           style="opacity:1;vector-effect:none;fill:none;fill-opacity:1;stroke:#ffffff;stroke-width:4.23333;stroke-linecap:round;stroke-linejoin:miter;stroke-miterlimit:4;stroke-dasharray:none;stroke-dashoffset:0;stroke-opacity:1;marker:none;marker-start:none;marker-mid:none;marker-end:none;paint-order:normal" />
        <circle
           style="opacity:1;vector-effect:none;fill:#ffffff;fill-opacity:1;stroke:none;stroke-width:0.571784;stroke-linecap:round;stroke-linejoin:miter;stroke-miterlimit:4;stroke-dasharray:none;stroke-dashoffset:0;stroke-opacity:1;marker:none;marker-start:none;marker-mid:none;marker-end:none;paint-order:normal"
           id="circle11603"
           cx="251.48645"
           cy="152.00313"
           r="21.298958" />
        <path
           inkscape:connector-curvature="0"
           id="path11601-8"
           transform="matrix(0.35718752,0,0,0.35718752,-3.4131368,-17.171471)"
           d="m 713.30078,498.81445 a 61.145336,61.145336 0 0 0 -61.14453,61.14649 61.145336,61.145336 0 0 0 61.14453,61.14453 61.145336,61.145336 0 0 0 59.9668,-49.25781 h 15.50976 c 3.72151,0 6.71875,-2.99725 6.71875,-6.71875 0,-3.72151 -2.99724,-6.7168 -6.71875,-6.7168 h -14.38476 a 61.145336,61.145336 0 0 0 -61.0918,-59.59766 z"
           style="opacity:1;vector-effect:none;fill:#000000;fill-opacity:0.102362;stroke:none;stroke-width:7.31037;stroke-linecap:round;stroke-linejoin:miter;stroke-miterlimit:4;stroke-dasharray:none;stroke-dashoffset:0;stroke-opacity:1;marker:none;marker-start:none;marker-mid:none;marker-end:none;paint-order:normal" />
        <rect
           y="148.96042"
           x="230.18748"
           height="32.014584"
           width="42.333332"
           id="rect11607"
           style="opacity:1;vector-effect:none;fill:#ffffff;fill-opacity:1;stroke:none;stroke-width:0.473693;stroke-linecap:round;stroke-linejoin:miter;stroke-miterlimit:4;stroke-dasharray:none;stroke-dashoffset:0;stroke-opacity:1;marker:none;marker-start:none;marker-mid:none;marker-end:none;paint-order:normal" />
        <circle
           r="21.298958"
           cy="180.8427"
           cx="251.48645"
           id="circle11605"
           style="opacity:1;vector-effect:none;fill:#ffffff;fill-opacity:1;stroke:none;stroke-width:0.571784;stroke-linecap:round;stroke-linejoin:miter;stroke-miterlimit:4;stroke-dasharray:none;stroke-dashoffset:0;stroke-opacity:1;marker:none;marker-start:none;marker-mid:none;marker-end:none;paint-order:normal" />
        <g
           clip-path="url(#clipPath11679)"
           id="g11615"
           transform="matrix(0.90939595,0,0,0.90939595,34.094406,81.739982)">
          <circle
             style="opacity:1;vector-effect:none;fill:#deddda;fill-opacity:1;stroke:none;stroke-width:0.529167;stroke-linecap:round;stroke-linejoin:miter;stroke-miterlimit:4;stroke-dasharray:none;stroke-dashoffset:0;stroke-opacity:1;marker:none;marker-start:none;marker-mid:none;marker-end:none;paint-order:normal"
             id="path11601"
             cx="239.05104"
             cy="77.263527"
             r="19.711458" />
          <circle
             r="19.711458"
             cy="85.201027"
             cx="239.05104"
             id="circle11611"
             style="opacity:1;vector-effect:none;fill:#241f31;fill-opacity:1;stroke:none;stroke-width:0.529167;stroke-linecap:round;stroke-linejoin:miter;stroke-miterlimit:4;stroke-dasharray:none;stroke-dashoffset:0;stroke-opacity:1;marker:none;marker-start:none;marker-mid:none;marker-end:none;paint-order:normal" />
        </g>
      </g>
      <g
         style="display:inline;opacity:0.42"
         transform="matrix(10.299419,0,0,10.299419,83.733823,-9338.9238)"
         id="g29431">
        <path
           style="fill:none;stroke:#ffffff;stroke-width:1.32292;stroke-linecap:round;stroke-linejoin:miter;stroke-miterlimit:4;stroke-dasharray:none;stroke-opacity:1"
           d="m 232.83807,277.18248 h 13.2478"
           id="path29396"
           inkscape:connector-curvature="0"
           sodipodi:nodetypes="cc" />
        <path
           inkscape:connector-curvature="0"
           id="path29398"
           d="m 232.83807,274.49308 h 8.73428"
           style="fill:none;stroke:#ffffff;stroke-width:1.32292;stroke-linecap:round;stroke-linejoin:miter;stroke-miterlimit:4;stroke-dasharray:none;stroke-opacity:1"
           sodipodi:nodetypes="cc" />
        <path
           style="fill:none;stroke:#ffffff;stroke-width:1.32292;stroke-linecap:round;stroke-linejoin:miter;stroke-miterlimit:4;stroke-dasharray:none;stroke-opacity:1"
           d="m 233.34564,271.89722 h 8.03962"
           id="path29400"
           inkscape:connector-curvature="0"
           sodipodi:nodetypes="cc" />
        <path
           sodipodi:nodetypes="cccc"
           style="opacity:1;vector-effect:none;fill:none;fill-opacity:1;stroke:#ffffff;stroke-width:1.32292;stroke-linecap:round;stroke-linejoin:miter;stroke-miterlimit:4;stroke-dasharray:none;stroke-dashoffset:0;stroke-opacity:1"
           d="m 240.97259,284.75595 v -4.00755 c 0,-0.56131 0.34232,-0.89811 0.99815,-0.89811 h 4.02893"
           id="path29402"
           inkscape:connector-curvature="0" />
        <path
           style="opacity:1;vector-effect:none;fill:none;fill-opacity:1;stroke:#ffffff;stroke-width:1.32292;stroke-linecap:round;stroke-linejoin:miter;stroke-miterlimit:4;stroke-dasharray:none;stroke-dashoffset:0;stroke-opacity:1;marker:none;marker-start:none;marker-mid:none;marker-end:none;paint-order:normal"
           id="path29418"
           sodipodi:type="arc"
           sodipodi:cx="232.82478"
           sodipodi:cy="275.83527"
           sodipodi:rx="1.3229166"
           sodipodi:ry="1.3229166"
           sodipodi:start="1.5707963"
           sodipodi:end="4.712389"
           d="m 232.82478,277.15818 a 1.3229166,1.3229166 0 0 1 -1.14568,-0.66146 1.3229166,1.3229166 0 0 1 0,-1.32291 1.3229166,1.3229166 0 0 1 1.14568,-0.66146"
           sodipodi:open="true"
           sodipodi:arc-type="arc" />
        <path
           d="m -246.08887,279.84846 a 1.3229166,1.3229166 0 0 1 -1.14568,-0.66146 1.3229166,1.3229166 0 0 1 0,-1.32292 1.3229166,1.3229166 0 0 1 1.14568,-0.66145"
           sodipodi:end="4.712389"
           sodipodi:start="1.5707963"
           sodipodi:ry="1.3229166"
           sodipodi:rx="1.3229166"
           sodipodi:cy="278.52554"
           sodipodi:cx="-246.08887"
           sodipodi:type="arc"
           id="path29420"
           style="opacity:1;vector-effect:none;fill:none;fill-opacity:1;stroke:#ffffff;stroke-width:1.32292;stroke-linecap:round;stroke-linejoin:miter;stroke-miterlimit:4;stroke-dasharray:none;stroke-dashoffset:0;stroke-opacity:1;marker:none;marker-start:none;marker-mid:none;marker-end:none;paint-order:normal"
           transform="scale(-1,1)"
           sodipodi:open="true"
           sodipodi:arc-type="arc" />
        <path
           transform="scale(-1,1)"
           style="opacity:1;vector-effect:none;fill:none;fill-opacity:1;stroke:#ffffff;stroke-width:1.32292;stroke-linecap:round;stroke-linejoin:miter;stroke-miterlimit:4;stroke-dasharray:none;stroke-dashoffset:0;stroke-opacity:1;marker:none;marker-start:none;marker-mid:none;marker-end:none;paint-order:normal"
           id="path29422"
           sodipodi:type="arc"
           sodipodi:cx="-241.22456"
           sodipodi:cy="273.19351"
           sodipodi:rx="1.3229166"
           sodipodi:ry="1.3229166"
           sodipodi:start="1.5707963"
           sodipodi:end="4.712389"
           d="m -241.22456,274.51643 a 1.3229166,1.3229166 0 0 1 -1.14568,-0.66146 1.3229166,1.3229166 0 0 1 0,-1.32292 1.3229166,1.3229166 0 0 1 1.14568,-0.66145"
           sodipodi:open="true"
           sodipodi:arc-type="arc" />
        <path
           d="m 233.04327,271.86665 a 1.3229166,1.3229166 0 0 1 -0.93544,-0.38748 1.3229166,1.3229166 0 0 1 -0.38747,-0.93544"
           sodipodi:end="3.1415927"
           sodipodi:start="1.5707963"
           sodipodi:ry="1.3229166"
           sodipodi:rx="1.3229166"
           sodipodi:cy="270.54373"
           sodipodi:cx="233.04327"
           sodipodi:type="arc"
           id="path29433"
           style="opacity:1;vector-effect:none;fill:none;fill-opacity:1;stroke:#ffffff;stroke-width:1.32292;stroke-linecap:round;stroke-linejoin:miter;stroke-miterlimit:4;stroke-dasharray:none;stroke-dashoffset:0;stroke-opacity:1;marker:none;marker-start:none;marker-mid:none;marker-end:none;paint-order:normal"
           sodipodi:open="true"
           sodipodi:arc-type="arc" />
        <path
           inkscape:connector-curvature="0"
           id="path29435"
           d="m 231.70312,270.37868 v -3.51962"
           style="opacity:1;vector-effect:none;fill:none;fill-opacity:1;stroke:#ffffff;stroke-width:1.32292;stroke-linecap:round;stroke-linejoin:miter;stroke-miterlimit:4;stroke-dasharray:none;stroke-dashoffset:0;stroke-opacity:1" />
      </g>
    </g>
    <g
       style="opacity:1"
       transform="matrix(1.8039526,0,0,1.8039526,-3702.07,10774.894)"
       id="g2363">
      <rect
         style="display:inline;opacity:1;vector-effect:none;fill:#000000;fill-opacity:0.102362;stroke:none;stroke-width:1.69395;stroke-linecap:round;stroke-linejoin:miter;stroke-miterlimit:4;stroke-dasharray:none;stroke-dashoffset:0;stroke-opacity:1;marker:none;marker-start:none;marker-mid:none;marker-end:none;paint-order:normal;enable-background:new"
         id="rect1196-4"
         width="63.696285"
         height="41.647572"
         x="3291.1577"
         y="-6573.8052" />
      <g
         id="g9560"
         transform="matrix(0.61246427,0,0,0.61246427,3283.8081,-6710.9976)">
        <rect
           y="212"
           x="12"
           height="76"
           width="104"
           id="rect1194"
           style="display:inline;opacity:1;fill:url(#linearGradient1442);fill-opacity:1;stroke:none;stroke-width:32;stroke-linejoin:round;stroke-miterlimit:4;stroke-dasharray:4, 2;stroke-dashoffset:0;stroke-opacity:1;enable-background:new" />
        <rect
           y="184"
           x="12"
           height="68"
           width="104"
           id="rect1196"
           style="display:inline;opacity:1;fill:url(#linearGradient1444);fill-opacity:1;stroke:none;stroke-width:32;stroke-linejoin:round;stroke-miterlimit:4;stroke-dasharray:4, 2;stroke-dashoffset:0;stroke-opacity:1;enable-background:new" />
        <rect
           style="display:inline;opacity:0.05;vector-effect:none;fill:#000000;fill-opacity:1;stroke:none;stroke-width:2;stroke-linecap:butt;stroke-linejoin:miter;stroke-miterlimit:4;stroke-dasharray:none;stroke-dashoffset:0;stroke-opacity:1;marker:none;marker-start:none;marker-mid:none;marker-end:none;paint-order:normal;enable-background:new"
           id="rect1198"
           width="104"
           height="2"
           x="12"
           y="252" />
        <rect
           style="opacity:0.2;vector-effect:none;fill:#ffffff;fill-opacity:1;stroke:none;stroke-width:2;stroke-linecap:butt;stroke-linejoin:miter;stroke-miterlimit:4;stroke-dasharray:none;stroke-dashoffset:0;stroke-opacity:1;marker:none;marker-start:none;marker-mid:none;marker-end:none;paint-order:normal"
           id="rect1229"
           width="2"
           height="68"
           x="14"
           y="184" />
        <rect
           style="display:inline;opacity:0.2;vector-effect:none;fill:#ffffff;fill-opacity:1;stroke:none;stroke-width:2;stroke-linecap:butt;stroke-linejoin:miter;stroke-miterlimit:4;stroke-dasharray:none;stroke-dashoffset:0;stroke-opacity:1;marker:none;marker-start:none;marker-mid:none;marker-end:none;paint-order:normal;enable-background:new"
           id="rect1231"
           width="2"
           height="68"
           x="112"
           y="184" />
      </g>
      <rect
         y="-6573.8052"
         x="3358.5288"
         height="41.647572"
         width="63.696285"
         id="rect9719"
         style="display:inline;opacity:1;vector-effect:none;fill:#000000;fill-opacity:0.102362;stroke:none;stroke-width:1.69395;stroke-linecap:round;stroke-linejoin:miter;stroke-miterlimit:4;stroke-dasharray:none;stroke-dashoffset:0;stroke-opacity:1;marker:none;marker-start:none;marker-mid:none;marker-end:none;paint-order:normal;enable-background:new" />
      <g
         id="g9572"
         transform="matrix(0.61246427,0,0,0.61246427,3351.1792,-6710.9976)">
        <rect
           style="display:inline;opacity:1;fill:url(#linearGradient1446);fill-opacity:1;stroke:none;stroke-width:32;stroke-linejoin:round;stroke-miterlimit:4;stroke-dasharray:4, 2;stroke-dashoffset:0;stroke-opacity:1;enable-background:new"
           id="rect9562"
           width="104"
           height="76"
           x="12"
           y="212" />
        <rect
           style="display:inline;opacity:1;fill:url(#linearGradient1448);fill-opacity:1;stroke:none;stroke-width:32;stroke-linejoin:round;stroke-miterlimit:4;stroke-dasharray:4, 2;stroke-dashoffset:0;stroke-opacity:1;enable-background:new"
           id="rect9564"
           width="104"
           height="68"
           x="12"
           y="184" />
        <rect
           y="252"
           x="12"
           height="2"
           width="104"
           id="rect9566"
           style="display:inline;opacity:0.05;vector-effect:none;fill:#000000;fill-opacity:1;stroke:none;stroke-width:2;stroke-linecap:butt;stroke-linejoin:miter;stroke-miterlimit:4;stroke-dasharray:none;stroke-dashoffset:0;stroke-opacity:1;marker:none;marker-start:none;marker-mid:none;marker-end:none;paint-order:normal;enable-background:new" />
        <rect
           y="184"
           x="14"
           height="68"
           width="2"
           id="rect9568"
           style="opacity:0.2;vector-effect:none;fill:#ffffff;fill-opacity:1;stroke:none;stroke-width:2;stroke-linecap:butt;stroke-linejoin:miter;stroke-miterlimit:4;stroke-dasharray:none;stroke-dashoffset:0;stroke-opacity:1;marker:none;marker-start:none;marker-mid:none;marker-end:none;paint-order:normal" />
        <rect
           y="184"
           x="112"
           height="68"
           width="2"
           id="rect9570"
           style="display:inline;opacity:0.2;vector-effect:none;fill:#ffffff;fill-opacity:1;stroke:none;stroke-width:2;stroke-linecap:butt;stroke-linejoin:miter;stroke-miterlimit:4;stroke-dasharray:none;stroke-dashoffset:0;stroke-opacity:1;marker:none;marker-start:none;marker-mid:none;marker-end:none;paint-order:normal;enable-background:new" />
      </g>
      <path
         sodipodi:nodetypes="cccccc"
         inkscape:connector-curvature="0"
         id="rect9721"
         d="m 3314.1377,-6598.4834 h 40.7893 v 41.808 h -37.9635 l -2.8258,-2.4178 z"
         style="display:inline;opacity:1;vector-effect:none;fill:#000000;fill-opacity:0.102362;stroke:none;stroke-width:1.35816;stroke-linecap:round;stroke-linejoin:miter;stroke-miterlimit:4;stroke-dasharray:none;stroke-dashoffset:0;stroke-opacity:1;marker:none;marker-start:none;marker-mid:none;marker-end:none;paint-order:normal;enable-background:new" />
      <rect
         style="opacity:1;vector-effect:none;fill:#9a9996;fill-opacity:1;stroke:none;stroke-width:8.09748;stroke-linecap:round;stroke-linejoin:miter;stroke-miterlimit:4;stroke-dasharray:none;stroke-dashoffset:0;stroke-opacity:1;marker:none;marker-start:none;marker-mid:none;marker-end:none;paint-order:normal"
         id="rect11917"
         width="4"
         height="63.696281"
         x="-6581.1548"
         y="-3354.854"
         transform="rotate(90)" />
      <rect
         style="opacity:1;vector-effect:none;fill:#9a9996;fill-opacity:1;stroke:none;stroke-width:6.54322;stroke-linecap:round;stroke-linejoin:miter;stroke-miterlimit:4;stroke-dasharray:none;stroke-dashoffset:0;stroke-opacity:1;marker:none;marker-start:none;marker-mid:none;marker-end:none;paint-order:normal"
         id="rect11909"
         width="4"
         height="41.590794"
         x="-6576.4805"
         y="-3393.9822"
         transform="rotate(90)" />
      <rect
         style="opacity:1;vector-effect:none;fill:#77767b;fill-opacity:1;stroke:none;stroke-width:4.75888;stroke-linecap:round;stroke-linejoin:miter;stroke-miterlimit:4;stroke-dasharray:none;stroke-dashoffset:0;stroke-opacity:1;marker:none;marker-start:none;marker-mid:none;marker-end:none;paint-order:normal"
         id="rect11919"
         width="4"
         height="22"
         x="3321.0059"
         y="-6556.6562" />
      <path
         sodipodi:nodetypes="cccccc"
         inkscape:connector-curvature="0"
         id="rect9723"
         d="m 3358.6159,-6598.4834 h 19.7708 l 11.9891,13.0634 v 28.7446 h -31.7599 z"
         style="display:inline;opacity:1;vector-effect:none;fill:#000000;fill-opacity:0.102362;stroke:none;stroke-width:1.19844;stroke-linecap:round;stroke-linejoin:miter;stroke-miterlimit:4;stroke-dasharray:none;stroke-dashoffset:0;stroke-opacity:1;marker:none;marker-start:none;marker-mid:none;marker-end:none;paint-order:normal;enable-background:new" />
      <rect
         y="-6598.2471"
         x="3321.0059"
         height="41.590794"
         width="4"
         id="rect11921"
         style="opacity:1;vector-effect:none;fill:#9a9996;fill-opacity:1;stroke:none;stroke-width:6.54322;stroke-linecap:round;stroke-linejoin:miter;stroke-miterlimit:4;stroke-dasharray:none;stroke-dashoffset:0;stroke-opacity:1;marker:none;marker-start:none;marker-mid:none;marker-end:none;paint-order:normal" />
      <g
         transform="matrix(0.61246427,0,0,0.61246427,3306.8716,-6735.4962)"
         id="g9588">
        <rect
           style="display:inline;opacity:1;fill:url(#l);fill-opacity:1;stroke:none;stroke-width:32;stroke-linejoin:round;stroke-miterlimit:4;stroke-dasharray:4, 2;stroke-dashoffset:0;stroke-opacity:1;enable-background:new"
           id="rect9578"
           width="104"
           height="76"
           x="12"
           y="212" />
        <rect
           style="display:inline;opacity:1;fill:url(#linearGradient2324);fill-opacity:1;stroke:none;stroke-width:32;stroke-linejoin:round;stroke-miterlimit:4;stroke-dasharray:4, 2;stroke-dashoffset:0;stroke-opacity:1;enable-background:new"
           id="rect9580"
           width="104"
           height="68"
           x="12"
           y="184" />
        <rect
           y="252"
           x="12"
           height="2"
           width="104"
           id="rect9582"
           style="display:inline;opacity:0.05;vector-effect:none;fill:#000000;fill-opacity:1;stroke:none;stroke-width:2;stroke-linecap:butt;stroke-linejoin:miter;stroke-miterlimit:4;stroke-dasharray:none;stroke-dashoffset:0;stroke-opacity:1;marker:none;marker-start:none;marker-mid:none;marker-end:none;paint-order:normal;enable-background:new" />
        <rect
           y="184"
           x="14"
           height="68"
           width="2"
           id="rect9584"
           style="opacity:0.2;vector-effect:none;fill:#ffffff;fill-opacity:1;stroke:none;stroke-width:2;stroke-linecap:butt;stroke-linejoin:miter;stroke-miterlimit:4;stroke-dasharray:none;stroke-dashoffset:0;stroke-opacity:1;marker:none;marker-start:none;marker-mid:none;marker-end:none;paint-order:normal" />
        <rect
           y="184"
           x="112"
           height="68"
           width="2"
           id="rect9586"
           style="display:inline;opacity:0.2;vector-effect:none;fill:#ffffff;fill-opacity:1;stroke:none;stroke-width:2;stroke-linecap:butt;stroke-linejoin:miter;stroke-miterlimit:4;stroke-dasharray:none;stroke-dashoffset:0;stroke-opacity:1;marker:none;marker-start:none;marker-mid:none;marker-end:none;paint-order:normal;enable-background:new" />
      </g>
      <rect
         style="opacity:1;vector-effect:none;fill:#77767b;fill-opacity:1;stroke:none;stroke-width:4.75888;stroke-linecap:round;stroke-linejoin:miter;stroke-miterlimit:4;stroke-dasharray:none;stroke-dashoffset:0;stroke-opacity:1;marker:none;marker-start:none;marker-mid:none;marker-end:none;paint-order:normal"
         id="rect11899"
         width="4"
         height="22"
         x="3385.1868"
         y="-6556.7134" />
      <rect
         y="-6598.3037"
         x="3385.1868"
         height="41.590794"
         width="4"
         id="rect11901"
         style="opacity:1;vector-effect:none;fill:#9a9996;fill-opacity:1;stroke:none;stroke-width:6.54322;stroke-linecap:round;stroke-linejoin:miter;stroke-miterlimit:4;stroke-dasharray:none;stroke-dashoffset:0;stroke-opacity:1;marker:none;marker-start:none;marker-mid:none;marker-end:none;paint-order:normal" />
      <rect
         style="opacity:0.136;vector-effect:none;fill:#000000;fill-opacity:1;stroke:none;stroke-width:4;stroke-linecap:round;stroke-linejoin:miter;stroke-miterlimit:4;stroke-dasharray:none;stroke-dashoffset:0;stroke-opacity:1;marker:none;marker-start:none;marker-mid:none;marker-end:none;paint-order:normal"
         id="rect11907"
         width="23.864855"
         height="3.800699"
         x="3398.4976"
         y="-6576.4263" />
      <rect
         style="opacity:1;vector-effect:none;fill:#9a9996;fill-opacity:1;stroke:none;stroke-width:6.70328;stroke-linecap:round;stroke-linejoin:miter;stroke-miterlimit:4;stroke-dasharray:none;stroke-dashoffset:0;stroke-opacity:1;marker:none;marker-start:none;marker-mid:none;marker-end:none;paint-order:normal"
         id="rect11903"
         width="4"
         height="25.251793"
         x="-7666.957"
         y="-3591.6646"
         transform="matrix(0,1,-0.95281607,-0.30354826,0,0)" />
      <rect
         transform="rotate(90)"
         y="-3377.9175"
         x="-6605.6533"
         height="63.696281"
         width="4"
         id="rect11911"
         style="opacity:1;vector-effect:none;fill:#9a9996;fill-opacity:1;stroke:none;stroke-width:8.09748;stroke-linecap:round;stroke-linejoin:miter;stroke-miterlimit:4;stroke-dasharray:none;stroke-dashoffset:0;stroke-opacity:1;marker:none;marker-start:none;marker-mid:none;marker-end:none;paint-order:normal" />
      <rect
         y="-6581.1548"
         x="3344.0693"
         height="22"
         width="4"
         id="rect11913"
         style="opacity:1;vector-effect:none;fill:#77767b;fill-opacity:1;stroke:none;stroke-width:4.75888;stroke-linecap:round;stroke-linejoin:miter;stroke-miterlimit:4;stroke-dasharray:none;stroke-dashoffset:0;stroke-opacity:1;marker:none;marker-start:none;marker-mid:none;marker-end:none;paint-order:normal" />
      <rect
         style="opacity:1;vector-effect:none;fill:#9a9996;fill-opacity:1;stroke:none;stroke-width:6.54322;stroke-linecap:round;stroke-linejoin:miter;stroke-miterlimit:4;stroke-dasharray:none;stroke-dashoffset:0;stroke-opacity:1;marker:none;marker-start:none;marker-mid:none;marker-end:none;paint-order:normal"
         id="rect11915"
         width="4"
         height="41.590794"
         x="3344.0693"
         y="-6622.7456" />
    </g>
    <g
       transform="matrix(0.46440138,0.46440138,-0.46440138,0.46440138,2629.8959,-1194.9471)"
       id="g1179"
       style="display:inline;opacity:1;enable-background:new">
      <path
         inkscape:connector-curvature="0"
         id="path15618"
         d="m 69.202403,198.09172 c -2.25097,2.1168 -4.369863,6.10177 -4.369831,13.60191 l -0.0149,34.49994 -10.178493,10.17849 c -0.400227,-0.0954 -0.858822,-0.0856 -1.343179,0.1576 l -12.124649,6.0886 c -4.633632,-2.88859 -10.848475,-2.32767 -14.864321,1.68818 -4.671489,4.67149 -4.672268,12.32091 -7.83e-4,16.99239 4.671483,4.67149 12.321684,4.67149 16.993171,0 0.01446,-0.0145 0.02797,-0.0294 0.04234,-0.0439 l 0.0055,0.0447 15.555904,-15.5559 0.01725,0.0173 5.891781,-5.89649 -0.0039,7.82931 0.02431,-7.8e-4 7.83e-4,21.9997 0.0345,-0.0282 c -1e-4,0.0205 -8.31e-4,0.0399 -7.83e-4,0.0604 0,6.60649 5.409965,12.01645 12.016442,12.01644 6.606478,1e-5 12.014086,-5.40917 12.01409,-12.01565 -4e-6,-5.67926 -3.997747,-10.47123 -9.316761,-11.70515 l -4.268686,-12.87818 c -0.170506,-0.51448 -0.487762,-0.84533 -0.838215,-1.0609 l 4e-6,-13.88811 24.027397,-24.04778 c 11.313716,-11.31372 4.496076,-18.13169 4.496076,-18.13169 l -28.523473,28.52346 7.83e-4,-40.84492 c 0,0 -2.72124,3.3e-4 -5.272336,2.39936 z m -39.359831,69.75026 c 2.760744,-2.76075 7.160569,-2.76152 9.921308,-7.8e-4 2.760744,2.76073 2.760744,7.16134 0,9.92209 -2.760739,2.76074 -7.161351,2.76074 -9.922091,0 -2.760743,-2.76074 -2.759957,-7.16057 7.83e-4,-9.92131 z m 42.068136,16.91084 c 1.265961,-1.26596 3.019884,-2.04417 4.972022,-2.04417 3.904278,1e-5 7.015419,3.1127 7.015411,7.01698 0,3.90426 -3.111125,7.01542 -7.015407,7.01541 -3.904279,10e-6 -7.016191,-3.11193 -7.016195,-7.0162 4e-6,-1.95214 0.778212,-3.70606 2.044169,-4.97202 z"
         style="opacity:1;vector-effect:none;fill:#000000;fill-opacity:0.102362;fill-rule:evenodd;stroke:none;stroke-width:4.15049;stroke-linecap:round;stroke-linejoin:miter;stroke-miterlimit:4;stroke-dasharray:none;stroke-dashoffset:0;stroke-opacity:1;marker:none;marker-start:none;marker-mid:none;marker-end:none;paint-order:normal" />
      <g
         style="display:inline;enable-background:new"
         transform="translate(7.9947119,-21.03751)"
         inkscape:transform-center-y="10.156852"
         inkscape:transform-center-x="-0.96446621"
         id="g1200">
        <path
           style="fill:#9a9996;fill-rule:evenodd;stroke:none;stroke-width:1px;stroke-linecap:butt;stroke-linejoin:miter;stroke-opacity:1"
           d="m 58,290 h 6 v -72 l -1.414214,-1.41421 C 62.585786,216.58579 56,221.64656 56,234 l 0.0053,27.18969 0.09677,2.72237 L 58,266 Z"
           id="path1186"
           inkscape:connector-curvature="0"
           sodipodi:nodetypes="ccccscccc" />
        <g
           id="g1194"
           transform="translate(2)" />
      </g>
      <use
         style="display:inline;enable-background:new"
         x="0"
         y="0"
         xlink:href="#g1059"
         inkscape:transform-center-x="0.30594236"
         inkscape:transform-center-y="-8.6421382"
         id="use1074"
         transform="matrix(-0.70710678,-0.70710678,-0.70710678,0.70710678,292.42443,120.74209)"
         width="100%"
         height="100%" />
      <g
         style="display:inline;enable-background:new"
         transform="matrix(-0.70710678,-0.70710678,-0.70710678,0.70710678,302.73447,101.58204)"
         inkscape:transform-center-y="-7.5"
         inkscape:transform-center-x="-6.5"
         id="g1180">
        <g
           id="g1174"
           transform="translate(2)" />
      </g>
      <g
         style="display:inline;enable-background:new"
         id="g1059"
         inkscape:transform-center-x="-6.5"
         inkscape:transform-center-y="-7.5"
         transform="matrix(-0.70710678,-0.70710678,-0.70710678,0.70710678,302.75946,99.477469)">
        <path
           sodipodi:nodetypes="ccccc"
           inkscape:connector-curvature="0"
           id="path1039-3"
           d="m 55.975259,290 h 9.666423 v -72 c 0,0 -9.641682,-1e-5 -9.641682,16 z"
           style="fill:#ffffff;fill-rule:evenodd;stroke:none;stroke-width:1px;stroke-linecap:butt;stroke-linejoin:miter;stroke-opacity:1" />
        <g
           transform="translate(2)"
           id="g1052">
          <path
             style="fill:#ed333b;fill-opacity:1;fill-rule:evenodd;stroke:none;stroke-width:1px;stroke-linecap:butt;stroke-linejoin:miter;stroke-opacity:1"
             d="m 54,312 v -24 c 0,-2 2,-2 2,-2 h 6.037213 c 0,0 1.917797,-0.13576 2.443399,1.45023 l 4.397602,13.26955 z"
             id="path1047"
             inkscape:connector-curvature="0"
             sodipodi:nodetypes="ccccccc" />
          <circle
             r="9.515707"
             cy="312.03348"
             cx="-66.049789"
             id="circle1045"
             style="opacity:1;fill:none;fill-opacity:1;stroke:#ed333b;stroke-width:5;stroke-linecap:round;stroke-linejoin:round;stroke-miterlimit:4;stroke-dasharray:none;stroke-dashoffset:0;stroke-opacity:1"
             transform="scale(-1,1)" />
          <circle
             style="opacity:1;fill:none;fill-opacity:1;stroke:#e01b24;stroke-width:2;stroke-linecap:round;stroke-linejoin:round;stroke-miterlimit:4;stroke-dasharray:none;stroke-dashoffset:0;stroke-opacity:1"
             id="path1043-6"
             cx="-66"
             cy="312"
             r="7"
             transform="scale(-1,1)" />
        </g>
      </g>
      <circle
         transform="matrix(-0.70710678,-0.70710678,-0.70710678,0.70710678,0,0)"
         style="display:inline;opacity:1;fill:#3d3846;fill-opacity:1;stroke:none;stroke-width:2;stroke-linecap:round;stroke-linejoin:round;stroke-miterlimit:4;stroke-dasharray:none;stroke-dashoffset:0;stroke-opacity:1;enable-background:new"
         id="circle1204"
         cx="-223.44576"
         cy="125.86499"
         r="2" />
    </g>
    <g
       transform="matrix(2.0154593,0,0,2.0154593,3309.2187,-1511.0314)"
       id="g11745"
       style="display:inline;opacity:1">
      <g
         transform="matrix(0.52689953,0,0,0.52689953,161.92977,58.874103)"
         id="g1559"
         style="display:inline;enable-background:new">
        <rect
           ry="8"
           rx="7.999999"
           y="190.00861"
           x="-347.99994"
           height="104"
           width="87.999878"
           id="rect15542"
           style="display:inline;opacity:1;vector-effect:none;fill:#000000;fill-opacity:0.102362;stroke:none;stroke-width:3.67091;stroke-linecap:round;stroke-linejoin:miter;stroke-miterlimit:4;stroke-dasharray:none;stroke-dashoffset:0;stroke-opacity:1;marker:none;marker-start:none;marker-mid:none;marker-end:none;paint-order:normal;enable-background:new" />
        <rect
           style="display:inline;opacity:1;vector-effect:none;fill:#1e737e;fill-opacity:1;stroke:none;stroke-width:0.25;stroke-linecap:butt;stroke-linejoin:miter;stroke-miterlimit:4;stroke-dasharray:none;stroke-dashoffset:0;stroke-opacity:1;marker:none;marker-start:none;marker-mid:none;marker-end:none;paint-order:normal;enable-background:new"
           id="rect1551"
           width="87.999878"
           height="104"
           x="-347.99994"
           y="188"
           rx="7.999999"
           ry="8" />
        <rect
           ry="8"
           rx="7.999999"
           y="188"
           x="-347.99994"
           height="102"
           width="87.999878"
           id="rect1553"
           style="display:inline;opacity:1;vector-effect:none;fill:#f6f5f4;fill-opacity:1;stroke:none;stroke-width:0.25;stroke-linecap:butt;stroke-linejoin:miter;stroke-miterlimit:4;stroke-dasharray:none;stroke-dashoffset:0;stroke-opacity:1;marker:none;marker-start:none;marker-mid:none;marker-end:none;paint-order:normal;enable-background:new" />
        <path
           sodipodi:nodetypes="ssccssss"
           inkscape:connector-curvature="0"
           id="rect17331"
           d="m -340.17747,188 h 64.72086 c 4.33364,0 7.82246,3.48882 7.82246,7.82246 L -267.73603,290 h -72.44144 c -4.33365,0 -7.82247,-3.48882 -7.82247,-7.82246 v -86.35508 c 0,-4.33364 3.48882,-7.82246 7.82247,-7.82246 z"
           style="display:inline;opacity:1;vector-effect:none;fill:#ffffff;fill-opacity:1;stroke:none;stroke-width:0.25;stroke-linecap:butt;stroke-linejoin:miter;stroke-miterlimit:4;stroke-dasharray:none;stroke-dashoffset:0;stroke-opacity:1;marker:none;marker-start:none;marker-mid:none;marker-end:none;paint-order:normal;enable-background:new" />
        <rect
           ry="7.9999995"
           rx="7.9999967"
           y="180"
           x="-347.99997"
           height="100"
           width="88"
           id="rect1555"
           style="display:inline;opacity:1;vector-effect:none;fill:#1e737e;fill-opacity:1;stroke:none;stroke-width:0.25;stroke-linecap:butt;stroke-linejoin:miter;stroke-miterlimit:4;stroke-dasharray:none;stroke-dashoffset:0;stroke-opacity:1;marker:none;marker-start:none;marker-mid:none;marker-end:none;paint-order:normal;enable-background:new" />
        <rect
           style="display:inline;opacity:1;vector-effect:none;fill:#27a0a4;fill-opacity:1;stroke:none;stroke-width:0.25;stroke-linecap:butt;stroke-linejoin:miter;stroke-miterlimit:4;stroke-dasharray:none;stroke-dashoffset:0;stroke-opacity:1;marker:none;marker-start:none;marker-mid:none;marker-end:none;paint-order:normal;enable-background:new"
           id="rect1557"
           width="88"
           height="98"
           x="-347.99997"
           y="180"
           rx="7.9999967"
           ry="8" />
      </g>
      <g
         style="display:inline;fill:#3d3846;stroke:#241f31;stroke-width:2;stroke-opacity:1;enable-background:new"
         transform="matrix(0.52689953,0,0,0.52689953,-31.969289,60.4548)"
         id="g679">
        <circle
           style="opacity:1;fill:#3d3846;fill-opacity:1;stroke:#241f31;stroke-width:2;stroke-opacity:1"
           id="path632"
           cx="32"
           cy="187"
           r="3" />
        <circle
           r="3"
           cy="187"
           cx="95.999992"
           id="circle634"
           style="opacity:1;fill:#3d3846;fill-opacity:1;stroke:#241f31;stroke-width:2;stroke-opacity:1" />
        <circle
           style="opacity:1;fill:#3d3846;fill-opacity:1;stroke:#241f31;stroke-width:2;stroke-opacity:1"
           id="circle636"
           cx="48"
           cy="187"
           r="3" />
        <circle
           style="opacity:1;fill:#3d3846;fill-opacity:1;stroke:#241f31;stroke-width:2;stroke-opacity:1"
           id="circle642"
           cx="64"
           cy="187"
           r="3" />
        <circle
           r="3"
           cy="187"
           cx="80"
           id="circle646"
           style="opacity:1;fill:#3d3846;fill-opacity:1;stroke:#241f31;stroke-width:2;stroke-opacity:1" />
      </g>
      <path
         inkscape:connector-curvature="0"
         id="use1471"
         d="m -15.125,149.48633 a 1.0539044,1.0539044 0 0 0 -1.037109,1.06836 v 8.42969 a 1.0539044,1.0539044 0 1 0 2.107421,0 v -8.42969 A 1.0539044,1.0539044 0 0 0 -15.125,149.48633 Z m 8.4316406,0 a 1.0539044,1.0539044 0 0 0 -1.0390625,1.06836 v 8.42969 a 1.0539044,1.0539044 0 1 0 2.1074219,0 v -8.42969 a 1.0539044,1.0539044 0 0 0 -1.0683594,-1.06836 z m 8.4296875,0 a 1.0539044,1.0539044 0 0 0 -1.03710935,1.06836 v 8.42969 a 1.0539044,1.0539044 0 1 0 2.10742185,0 v -8.42969 a 1.0539044,1.0539044 0 0 0 -1.0703125,-1.06836 z m 8.4296879,0 a 1.0539044,1.0539044 0 0 0 -1.0371098,1.06836 v 8.42969 a 1.0539044,1.0539044 0 1 0 2.1074218,0 v -8.42969 a 1.0539044,1.0539044 0 0 0 -1.070312,-1.06836 z m 8.43164,0 a 1.0539044,1.0539044 0 0 0 -1.039062,1.06836 v 8.42969 a 1.0539044,1.0539044 0 1 0 2.107422,0 v -8.42969 a 1.0539044,1.0539044 0 0 0 -1.06836,-1.06836 z"
         style="color:#000000;font-style:normal;font-variant:normal;font-weight:normal;font-stretch:normal;font-size:medium;line-height:normal;font-family:sans-serif;font-variant-ligatures:normal;font-variant-position:normal;font-variant-caps:normal;font-variant-numeric:normal;font-variant-alternates:normal;font-feature-settings:normal;text-indent:0;text-align:start;text-decoration:none;text-decoration-line:none;text-decoration-style:solid;text-decoration-color:#000000;letter-spacing:normal;word-spacing:normal;text-transform:none;writing-mode:lr-tb;direction:ltr;text-orientation:mixed;dominant-baseline:auto;baseline-shift:baseline;text-anchor:start;white-space:normal;shape-padding:0;clip-rule:nonzero;display:inline;overflow:visible;visibility:visible;opacity:1;isolation:auto;mix-blend-mode:normal;color-interpolation:sRGB;color-interpolation-filters:linearRGB;solid-color:#000000;solid-opacity:1;vector-effect:none;fill:#deddda;fill-opacity:1;fill-rule:nonzero;stroke:none;stroke-width:2.1076;stroke-linecap:round;stroke-linejoin:miter;stroke-miterlimit:4;stroke-dasharray:none;stroke-dashoffset:0;stroke-opacity:1;color-rendering:auto;image-rendering:auto;shape-rendering:auto;text-rendering:auto;enable-background:accumulate" />
      <circle
         r="1.0583333"
         cy="151.64197"
         cx="-15.08125"
         id="path17421"
         style="opacity:1;vector-effect:none;fill:#ffffff;fill-opacity:1;stroke:none;stroke-width:1.5875;stroke-linecap:round;stroke-linejoin:miter;stroke-miterlimit:4;stroke-dasharray:none;stroke-dashoffset:0;stroke-opacity:1;marker:none;marker-start:none;marker-mid:none;marker-end:none;paint-order:normal" />
      <circle
         style="opacity:1;vector-effect:none;fill:#ffffff;fill-opacity:1;stroke:none;stroke-width:1.5875;stroke-linecap:round;stroke-linejoin:miter;stroke-miterlimit:4;stroke-dasharray:none;stroke-dashoffset:0;stroke-opacity:1;marker:none;marker-start:none;marker-mid:none;marker-end:none;paint-order:normal"
         id="circle17423"
         cx="-6.6388741"
         cy="151.64197"
         r="1.0583333" />
      <circle
         r="1.0583333"
         cy="151.64197"
         cx="1.75673"
         id="circle17425"
         style="opacity:1;vector-effect:none;fill:#ffffff;fill-opacity:1;stroke:none;stroke-width:1.5875;stroke-linecap:round;stroke-linejoin:miter;stroke-miterlimit:4;stroke-dasharray:none;stroke-dashoffset:0;stroke-opacity:1;marker:none;marker-start:none;marker-mid:none;marker-end:none;paint-order:normal" />
      <circle
         style="opacity:1;vector-effect:none;fill:#ffffff;fill-opacity:1;stroke:none;stroke-width:1.5875;stroke-linecap:round;stroke-linejoin:miter;stroke-miterlimit:4;stroke-dasharray:none;stroke-dashoffset:0;stroke-opacity:1;marker:none;marker-start:none;marker-mid:none;marker-end:none;paint-order:normal"
         id="circle17427"
         cx="10.199106"
         cy="151.64197"
         r="1.0583333" />
      <circle
         r="1.0583333"
         cy="151.64197"
         cx="18.664869"
         id="circle17429"
         style="opacity:1;vector-effect:none;fill:#ffffff;fill-opacity:1;stroke:none;stroke-width:1.5875;stroke-linecap:round;stroke-linejoin:miter;stroke-miterlimit:4;stroke-dasharray:none;stroke-dashoffset:0;stroke-opacity:1;marker:none;marker-start:none;marker-mid:none;marker-end:none;paint-order:normal" />
    </g>
    <g
       transform="matrix(0,2.5917956,2.5917956,0,2806.0162,-1463.8615)"
       id="g11597"
       style="display:inline;opacity:1">
      <path
         id="rect217-1"
         style="font-variation-settings:normal;opacity:1;vector-effect:none;fill:#000000;fill-opacity:0.102;stroke:none;stroke-width:0.848038;stroke-linecap:butt;stroke-linejoin:miter;stroke-miterlimit:4;stroke-dasharray:none;stroke-dashoffset:0;stroke-opacity:1;marker:none;stop-color:#000000;stop-opacity:1"
         d="m 174.8876,199.15395 v -33.81219 c 0,-0.78051 1.40879,-7.94608 1.40879,-7.94608 h 0.45887 c 0,0 1.40879,7.16557 1.40879,7.94608 v 33.81219 c 0,0.78046 -0.62833,1.40879 -1.40879,1.40879 h -0.45887 c -0.78046,0 -1.40879,-0.62833 -1.40879,-1.40879 z"
         sodipodi:nodetypes="ssccsssss" />
      <rect
         style="opacity:1;vector-effect:none;fill:#1a5fb4;fill-opacity:1;stroke:none;stroke-width:0.529167;stroke-linecap:round;stroke-linejoin:miter;stroke-miterlimit:4;stroke-dasharray:none;stroke-dashoffset:0;stroke-opacity:1;marker:none;marker-start:none;marker-mid:none;marker-end:none;paint-order:normal"
         id="rect11580"
         width="3.4395833"
         height="2.1166666"
         x="173.56667"
         y="198.70209"
         rx="0.46772167"
         ry="0.46772167" />
      <path
         style="opacity:1;vector-effect:none;fill:#1a5fb4;fill-opacity:1;stroke:none;stroke-width:0.982083;stroke-linecap:round;stroke-linejoin:miter;stroke-miterlimit:4;stroke-dasharray:none;stroke-dashoffset:0;stroke-opacity:1;marker:none;marker-start:none;marker-mid:none;marker-end:none;paint-order:normal"
         d="m 174.8049,157.42708 h 0.96312 c 0.0997,0 0.16352,0.0833 0.1799,0.1836 l 1.05833,6.4828 c 0.0426,0.26086 -0.2086,0.47734 -0.46772,0.47734 h -2.50414 c -0.25912,0 -0.5103,-0.21648 -0.46772,-0.47734 l 1.05833,-6.4828 c 0.0164,-0.10032 0.0802,-0.1836 0.1799,-0.1836 z"
         id="rect11582"
         inkscape:connector-curvature="0"
         sodipodi:nodetypes="sssssssss" />
      <rect
         style="opacity:1;vector-effect:none;fill:#ffffff;fill-opacity:1;stroke:none;stroke-width:0.529167;stroke-linecap:round;stroke-linejoin:miter;stroke-miterlimit:4;stroke-dasharray:none;stroke-dashoffset:0;stroke-opacity:1;marker:none;marker-start:none;marker-mid:none;marker-end:none;paint-order:normal"
         id="rect11578"
         width="3.96875"
         height="35.71875"
         x="173.30208"
         y="164.04167" />
      <rect
         style="opacity:1;vector-effect:none;fill:#1a5fb4;fill-opacity:1;stroke:none;stroke-width:0.529167;stroke-linecap:round;stroke-linejoin:miter;stroke-miterlimit:4;stroke-dasharray:none;stroke-dashoffset:0;stroke-opacity:1;marker:none;marker-start:none;marker-mid:none;marker-end:none;paint-order:normal"
         id="rect11585"
         width="0.79374695"
         height="2.3812485"
         x="174.88959"
         y="155.83958"
         rx="0.39687347"
         ry="0.46772248" />
      <rect
         style="opacity:1;vector-effect:none;fill:#ffffff;fill-opacity:1;stroke:none;stroke-width:0.529167;stroke-linecap:round;stroke-linejoin:miter;stroke-miterlimit:4;stroke-dasharray:none;stroke-dashoffset:0;stroke-opacity:1;marker:none;marker-start:none;marker-mid:none;marker-end:none;paint-order:normal"
         id="rect11587"
         width="1.3229166"
         height="1.0583333"
         x="174.625"
         y="156.63333"
         rx="0"
         ry="0" />
      <rect
         y="164.04167"
         x="175.94792"
         height="35.71875"
         width="1.3229121"
         id="rect11589"
         style="opacity:1;vector-effect:none;fill:#f6f5f4;fill-opacity:1;stroke:none;stroke-width:0.305514;stroke-linecap:round;stroke-linejoin:miter;stroke-miterlimit:4;stroke-dasharray:none;stroke-dashoffset:0;stroke-opacity:1;marker:none;marker-start:none;marker-mid:none;marker-end:none;paint-order:normal" />
    </g>
    <g
       id="g824"
       transform="matrix(0.98018204,0,0,0.98018204,52.189334,-36.875255)"
       style="stroke-width:1.26428">
      <g
         id="g973"
         clip-path="url(#clipPath984)"
         inkscape:path-effect="#path-effect988"
         transform="matrix(0.36234062,0,0,0.36234062,2607.3521,-1374.2654)"
         style="stroke-width:0.986377">
        <path
           style="font-variation-settings:normal;opacity:1;vector-effect:none;fill:#000000;fill-opacity:0.102362;stroke:none;stroke-width:4.96026;stroke-linecap:round;stroke-linejoin:miter;stroke-miterlimit:4;stroke-dasharray:none;stroke-dashoffset:0;stroke-opacity:1;marker:none;marker-start:none;marker-mid:none;marker-end:none;paint-order:normal;stop-color:#000000;stop-opacity:1"
           id="rect926"
           width="275.1561"
           height="310.64557"
           x="404.30566"
           y="482.03616"
           rx="20.673309"
           ry="20.673309"
           sodipodi:type="rect"
           d="m 424.97897,482.03616 h 233.80948 c 11.45302,0 20.67331,9.2203 20.67331,20.67331 v 269.29895 c 0,11.45302 -9.22029,20.67331 -20.67331,20.67331 H 424.97897 c -11.45301,0 -20.67331,-9.22029 -20.67331,-20.67331 V 502.70947 c 0,-11.45301 9.2203,-20.67331 20.67331,-20.67331 z" />
        <path
           style="font-variation-settings:normal;opacity:1;vector-effect:none;fill:#5e5c64;fill-opacity:1;stroke:none;stroke-width:4.97431;stroke-linecap:round;stroke-linejoin:miter;stroke-miterlimit:4;stroke-dasharray:none;stroke-dashoffset:0;stroke-opacity:1;marker:none;marker-start:none;marker-mid:none;marker-end:none;paint-order:normal;stop-color:#000000;stop-opacity:1"
           id="rect257"
           width="275.1561"
           height="310.64557"
           x="404.30566"
           y="475.97519"
           rx="20.673309"
           ry="20.673309"
           sodipodi:type="rect"
           d="m 424.97897,475.97519 h 233.80948 c 11.45302,0 20.67331,9.2203 20.67331,20.67331 v 269.29895 c 0,11.45301 -9.22029,20.67331 -20.67331,20.67331 H 424.97897 c -11.45301,0 -20.67331,-9.2203 -20.67331,-20.67331 V 496.6485 c 0,-11.45301 9.2203,-20.67331 20.67331,-20.67331 z" />
        <path
           style="fill:#434348;fill-opacity:1;stroke-width:0.986377;stroke-linecap:round;stop-color:#000000"
           id="rect101"
           width="275.1561"
           height="310.64557"
           x="404.30566"
           y="394.6405"
           rx="0"
           ry="0"
           sodipodi:type="rect"
           d="m 404.30566,394.6405 h 275.1561 v 310.64557 h -275.1561 z" />
      </g>
      <g
         transform="matrix(0.6596291,0,0,0.6596291,2067.515,-1293.7082)"
         style="display:inline;stroke-width:0.959464;enable-background:new"
         id="g65">
        <path
           style="display:inline;opacity:1;vector-effect:none;fill:#000000;fill-opacity:1;stroke:none;stroke-width:0.0472534px;stroke-linecap:butt;stroke-linejoin:miter;stroke-miterlimit:4;stroke-dasharray:none;stroke-dashoffset:0;stroke-opacity:1;marker:none;marker-start:none;marker-mid:none;marker-end:none;paint-order:normal;enable-background:new"
           d="M 1367.7351,-75.863459 V 221.75228 a 8,8 135 0 1 -8,8 H 872.26485 a 8,8 45 0 1 -8,-8 V -75.863459 a 8,8 135 0 1 8,-8 h 487.47025 a 8,8 45 0 1 8,8 z"
           id="path63"
           inkscape:connector-curvature="0"
           sodipodi:nodetypes="ccccc"
           inkscape:path-effect="#path-effect259"
           inkscape:original-d="M 1367.7351,-83.863459 V 229.75228 H 864.26485 V -83.863459 Z" />
      </g>
      <rect
         style="fill:#1c71d8;fill-opacity:1;stroke:none;stroke-width:0.663638;stroke-linecap:round;stop-color:#000000"
         id="rect1457"
         width="318.54663"
         height="192.45515"
         x="2644.6841"
         y="-1342.3387" />
      <g
         id="g197-3-7"
         fill="#ffffff"
         stroke-width="1.12774"
         transform="matrix(2.43265,0,0,2.43265,2607.0264,-1508.2923)"
         style="display:inline;enable-background:new">
        <path
           id="path191-5-3"
           opacity="0.2"
           d="m 112.497,102.02 12.984,-12.984 v 12.985 z m 12.983,0.001 12.053,12.053 H 125.48 Z"
           style="stroke-width:1.42577" />
        <path
           id="path193-6-6"
           opacity="0.1"
           d="m 101.339,138.053 12.053,-12.062 h -12.053 z"
           style="stroke-width:1.42577" />
        <path
           id="path195-2-1"
           opacity="0.2"
           d="m 125.445,113.937 -12.053,12.053 h 12.053 z"
           style="stroke-width:1.42577" />
      </g>
    </g>
    <g
       transform="matrix(3.1439595,0,0,3.1439595,2519.3658,-1666.0542)"
       id="g29394"
       style="display:inline;stroke-width:1.04199">
      <rect
         style="display:inline;opacity:1;vector-effect:none;fill:#000000;fill-opacity:0.102362;stroke:none;stroke-width:1.037;stroke-linecap:round;stroke-linejoin:miter;stroke-miterlimit:4;stroke-dasharray:none;stroke-dashoffset:0;stroke-opacity:1;marker:none;marker-start:none;marker-mid:none;marker-end:none;paint-order:normal"
         id="rect29072"
         width="63.5"
         height="34.314987"
         x="57.957989"
         y="185.41743"
         rx="1.7714537"
         ry="1.7714537" />
      <rect
         ry="1.7714537"
         rx="1.7714537"
         y="183.89973"
         x="57.957989"
         height="34.509773"
         width="63.5"
         id="rect29074"
         style="display:inline;opacity:1;vector-effect:none;fill:#5e5c64;fill-opacity:1;stroke:none;stroke-width:1.03994;stroke-linecap:round;stroke-linejoin:miter;stroke-miterlimit:4;stroke-dasharray:none;stroke-dashoffset:0;stroke-opacity:1;marker:none;marker-start:none;marker-mid:none;marker-end:none;paint-order:normal" />
      <rect
         style="display:inline;opacity:1;vector-effect:none;fill:#9a9996;fill-opacity:1;stroke:none;stroke-width:1.037;stroke-linecap:round;stroke-linejoin:miter;stroke-miterlimit:4;stroke-dasharray:none;stroke-dashoffset:0;stroke-opacity:1;marker:none;marker-start:none;marker-mid:none;marker-end:none;paint-order:normal"
         id="rect29076"
         width="63.5"
         height="34.31498"
         x="57.957989"
         y="182.69067"
         rx="1.7714537"
         ry="1.7714537" />
      <path
         style="display:inline;opacity:1;vector-effect:none;fill:#000000;fill-opacity:1;stroke:none;stroke-width:1.65416;stroke-linecap:round;stroke-linejoin:miter;stroke-miterlimit:4;stroke-dasharray:none;stroke-dashoffset:0;stroke-opacity:1;marker:none;marker-start:none;marker-mid:none;marker-end:none;paint-order:normal"
         d="M 89.808486,207.03241 H 109.9383 c 0.56117,0 1.01293,0.45177 1.01293,1.01294 v 3.2658 c 0,0.56117 -0.45176,1.01294 -1.01293,1.01294 H 89.808486 c -0.56117,0 -1.01293,-0.45177 -1.01293,-1.01294 v -3.2658 c 0,-0.56117 0.45176,-1.01294 1.01293,-1.01294 z"
         id="path80"
         sodipodi:nodetypes="sssssssss" />
      <path
         style="display:inline;opacity:1;vector-effect:none;fill:#000000;fill-opacity:1;stroke:none;stroke-width:1.65416;stroke-linecap:round;stroke-linejoin:miter;stroke-miterlimit:4;stroke-dasharray:none;stroke-dashoffset:0;stroke-opacity:1;marker:none;marker-start:none;marker-mid:none;marker-end:none;paint-order:normal"
         d="m 113.21051,207.03241 h 4.58871 c 0.56117,0 1.01293,0.45177 1.01293,1.01294 v 3.2658 c 0,0.56116 -0.45176,1.01293 -1.01293,1.01293 h -4.58871 c -0.56116,0 -1.01293,-0.45177 -1.01293,-1.01293 v -3.2658 c 0,-0.56117 0.45177,-1.01294 1.01293,-1.01294 z"
         id="path76" />
      <path
         style="display:inline;opacity:1;vector-effect:none;fill:#000000;fill-opacity:1;stroke:none;stroke-width:1.65416;stroke-linecap:round;stroke-linejoin:miter;stroke-miterlimit:4;stroke-dasharray:none;stroke-dashoffset:0;stroke-opacity:1;marker:none;marker-start:none;marker-mid:none;marker-end:none;paint-order:normal"
         d="m 109.24176,200.41782 h 3.2658 c 0.56117,0 1.01294,0.45177 1.01294,1.01293 v 3.2658 c 0,0.56117 -0.45177,1.01294 -1.01294,1.01294 h -3.2658 c -0.56116,0 -1.01293,-0.45177 -1.01293,-1.01294 v -3.2658 c 0,-0.56116 0.45177,-1.01293 1.01293,-1.01293 z"
         id="path74" />
      <path
         style="display:inline;opacity:1;vector-effect:none;fill:#000000;fill-opacity:1;stroke:none;stroke-width:1.65416;stroke-linecap:round;stroke-linejoin:miter;stroke-miterlimit:4;stroke-dasharray:none;stroke-dashoffset:0;stroke-opacity:1;marker:none;marker-start:none;marker-mid:none;marker-end:none;paint-order:normal"
         d="m 101.30425,200.41782 h 4.58871 c 0.56116,0 1.01293,0.45177 1.01293,1.01293 v 3.2658 c 0,0.56117 -0.45177,1.01294 -1.01293,1.01294 h -4.58871 c -0.56117,0 -1.01293,-0.45177 -1.01293,-1.01294 v -3.2658 c 0,-0.56116 0.45176,-1.01293 1.01293,-1.01293 z"
         id="path72" />
      <path
         style="display:inline;opacity:1;vector-effect:none;fill:#000000;fill-opacity:1;stroke:none;stroke-width:1.65416;stroke-linecap:round;stroke-linejoin:miter;stroke-miterlimit:4;stroke-dasharray:none;stroke-dashoffset:0;stroke-opacity:1;marker:none;marker-start:none;marker-mid:none;marker-end:none;paint-order:normal"
         d="m 93.366753,200.41782 h 4.58871 c 0.56116,0 1.01293,0.45177 1.01293,1.01293 v 3.2658 c 0,0.56117 -0.45177,1.01294 -1.01293,1.01294 h -4.58871 c -0.56117,0 -1.01293,-0.45177 -1.01293,-1.01294 v -3.2658 c 0,-0.56116 0.45176,-1.01293 1.01293,-1.01293 z"
         id="path70" />
      <path
         style="display:inline;opacity:1;vector-effect:none;fill:#000000;fill-opacity:1;stroke:none;stroke-width:1.65416;stroke-linecap:round;stroke-linejoin:miter;stroke-miterlimit:4;stroke-dasharray:none;stroke-dashoffset:0;stroke-opacity:1;marker:none;marker-start:none;marker-mid:none;marker-end:none;paint-order:normal"
         d="m 85.429263,200.41782 h 4.58871 c 0.56117,0 1.01293,0.45177 1.01293,1.01293 v 3.2658 c 0,0.56117 -0.45176,1.01294 -1.01293,1.01294 h -4.58871 c -0.56116,0 -1.01293,-0.45177 -1.01293,-1.01294 v -3.2658 c 0,-0.56116 0.45177,-1.01293 1.01293,-1.01293 z"
         id="path68" />
      <path
         style="display:inline;opacity:1;vector-effect:none;fill:#000000;fill-opacity:1;stroke:none;stroke-width:1.65416;stroke-linecap:round;stroke-linejoin:miter;stroke-miterlimit:4;stroke-dasharray:none;stroke-dashoffset:0;stroke-opacity:1;marker:none;marker-start:none;marker-mid:none;marker-end:none;paint-order:normal"
         d="m 77.491742,200.41782 h 4.588711 c 0.56116,0 1.01294,0.45177 1.01294,1.01293 v 3.2658 c 0,0.56117 -0.45178,1.01294 -1.01294,1.01294 h -4.588711 c -0.56117,0 -1.01293,-0.45177 -1.01293,-1.01294 v -3.2658 c 0,-0.56116 0.45176,-1.01293 1.01293,-1.01293 z"
         id="path66" />
      <path
         style="display:inline;opacity:1;vector-effect:none;fill:#000000;fill-opacity:1;stroke:none;stroke-width:1.65416;stroke-linecap:round;stroke-linejoin:miter;stroke-miterlimit:4;stroke-dasharray:none;stroke-dashoffset:0;stroke-opacity:1;marker:none;marker-start:none;marker-mid:none;marker-end:none;paint-order:normal"
         d="m 69.554249,200.41782 h 4.588706 c 0.561165,0 1.012933,0.45177 1.012933,1.01293 v 3.2658 c 0,0.56117 -0.451768,1.01294 -1.012933,1.01294 h -4.588706 c -0.561165,0 -1.012933,-0.45177 -1.012933,-1.01294 v -3.2658 c 0,-0.56116 0.451768,-1.01293 1.012933,-1.01293 z"
         id="path64" />
      <path
         style="display:inline;opacity:1;vector-effect:none;fill:#000000;fill-opacity:1;stroke:none;stroke-width:1.65416;stroke-linecap:round;stroke-linejoin:miter;stroke-miterlimit:4;stroke-dasharray:none;stroke-dashoffset:0;stroke-opacity:1;marker:none;marker-start:none;marker-mid:none;marker-end:none;paint-order:normal"
         d="m 105.27303,193.80324 h 4.58871 c 0.56116,0 1.01293,0.45177 1.01293,1.01294 v 3.2658 c 0,0.56116 -0.45177,1.01293 -1.01293,1.01293 h -4.58871 c -0.56116,0 -1.01293,-0.45177 -1.01293,-1.01293 v -3.2658 c 0,-0.56117 0.45177,-1.01294 1.01293,-1.01294 z"
         id="path62" />
      <path
         style="display:inline;opacity:1;vector-effect:none;fill:#000000;fill-opacity:1;stroke:none;stroke-width:1.65416;stroke-linecap:round;stroke-linejoin:miter;stroke-miterlimit:4;stroke-dasharray:none;stroke-dashoffset:0;stroke-opacity:1;marker:none;marker-start:none;marker-mid:none;marker-end:none;paint-order:normal"
         d="m 97.335513,193.80324 h 4.588707 c 0.56117,0 1.01293,0.45177 1.01293,1.01294 v 3.2658 c 0,0.56116 -0.45176,1.01293 -1.01293,1.01293 h -4.588707 c -0.56116,0 -1.01293,-0.45177 -1.01293,-1.01293 v -3.2658 c 0,-0.56117 0.45177,-1.01294 1.01293,-1.01294 z"
         id="path60" />
      <path
         style="display:inline;opacity:1;vector-effect:none;fill:#000000;fill-opacity:1;stroke:none;stroke-width:1.65416;stroke-linecap:round;stroke-linejoin:miter;stroke-miterlimit:4;stroke-dasharray:none;stroke-dashoffset:0;stroke-opacity:1;marker:none;marker-start:none;marker-mid:none;marker-end:none;paint-order:normal"
         d="m 89.398003,193.80324 h 4.58871 c 0.56116,0 1.01293,0.45177 1.01293,1.01294 v 3.2658 c 0,0.56116 -0.45177,1.01293 -1.01293,1.01293 h -4.58871 c -0.56117,0 -1.01293,-0.45177 -1.01293,-1.01293 v -3.2658 c 0,-0.56117 0.45176,-1.01294 1.01293,-1.01294 z"
         id="path58" />
      <path
         style="display:inline;opacity:1;vector-effect:none;fill:#000000;fill-opacity:1;stroke:none;stroke-width:1.65416;stroke-linecap:round;stroke-linejoin:miter;stroke-miterlimit:4;stroke-dasharray:none;stroke-dashoffset:0;stroke-opacity:1;marker:none;marker-start:none;marker-mid:none;marker-end:none;paint-order:normal"
         d="m 81.460512,193.80324 h 4.588721 c 0.56116,0 1.01293,0.45177 1.01293,1.01294 v 3.2658 c 0,0.56116 -0.45177,1.01293 -1.01293,1.01293 h -4.588721 c -0.56116,0 -1.01293,-0.45177 -1.01293,-1.01293 v -3.2658 c 0,-0.56117 0.45177,-1.01294 1.01293,-1.01294 z"
         id="path56" />
      <path
         style="display:inline;opacity:1;vector-effect:none;fill:#000000;fill-opacity:1;stroke:none;stroke-width:1.65416;stroke-linecap:round;stroke-linejoin:miter;stroke-miterlimit:4;stroke-dasharray:none;stroke-dashoffset:0;stroke-opacity:1;marker:none;marker-start:none;marker-mid:none;marker-end:none;paint-order:normal"
         d="m 73.523007,193.80324 h 4.588705 c 0.56117,0 1.01293,0.45177 1.01293,1.01294 v 3.2658 c 0,0.56116 -0.45176,1.01293 -1.01293,1.01293 h -4.588705 c -0.561165,0 -1.012933,-0.45177 -1.012933,-1.01293 v -3.2658 c 0,-0.56117 0.451768,-1.01294 1.012933,-1.01294 z"
         id="path54" />
      <path
         style="display:inline;opacity:1;vector-effect:none;fill:#000000;fill-opacity:1;stroke:none;stroke-width:1.65416;stroke-linecap:round;stroke-linejoin:miter;stroke-miterlimit:4;stroke-dasharray:none;stroke-dashoffset:0;stroke-opacity:1;marker:none;marker-start:none;marker-mid:none;marker-end:none;paint-order:normal"
         d="m 61.616749,193.80324 h 8.557466 c 0.561165,0 1.012933,0.45177 1.012933,1.01294 v 3.2658 c 0,0.56116 -0.451768,1.01293 -1.012933,1.01293 h -8.557466 c -0.561165,0 -1.012933,-0.45177 -1.012933,-1.01293 v -3.2658 c 0,-0.56117 0.451768,-1.01294 1.012933,-1.01294 z"
         id="path52" />
      <path
         style="display:inline;opacity:1;vector-effect:none;fill:#000000;fill-opacity:1;stroke:none;stroke-width:1.65416;stroke-linecap:round;stroke-linejoin:miter;stroke-miterlimit:4;stroke-dasharray:none;stroke-dashoffset:0;stroke-opacity:1;marker:none;marker-start:none;marker-mid:none;marker-end:none;paint-order:normal"
         d="m 109.24176,187.18866 h 8.55746 c 0.56116,0 1.01293,0.45177 1.01293,1.01294 v 3.2658 c 0,0.56116 -0.45177,1.01293 -1.01293,1.01293 h -8.55746 c -0.56116,0 -1.01293,-0.45177 -1.01293,-1.01293 v -3.2658 c 0,-0.56117 0.45177,-1.01294 1.01293,-1.01294 z"
         id="path50" />
      <path
         style="display:inline;opacity:1;vector-effect:none;fill:#000000;fill-opacity:1;stroke:none;stroke-width:1.65416;stroke-linecap:round;stroke-linejoin:miter;stroke-miterlimit:4;stroke-dasharray:none;stroke-dashoffset:0;stroke-opacity:1;marker:none;marker-start:none;marker-mid:none;marker-end:none;paint-order:normal"
         d="m 101.30426,187.18866 h 4.58871 c 0.56117,0 1.01293,0.45177 1.01293,1.01294 v 3.2658 c 0,0.56116 -0.45176,1.01293 -1.01293,1.01293 h -4.58871 c -0.56116,0 -1.01293,-0.45177 -1.01293,-1.01293 v -3.2658 c 0,-0.56117 0.45177,-1.01294 1.01293,-1.01294 z"
         id="path48" />
      <path
         style="display:inline;opacity:1;vector-effect:none;fill:#000000;fill-opacity:1;stroke:none;stroke-width:1.65416;stroke-linecap:round;stroke-linejoin:miter;stroke-miterlimit:4;stroke-dasharray:none;stroke-dashoffset:0;stroke-opacity:1;marker:none;marker-start:none;marker-mid:none;marker-end:none;paint-order:normal"
         d="m 93.366753,187.18866 h 4.58871 c 0.56116,0 1.01293,0.45177 1.01293,1.01294 v 3.2658 c 0,0.56116 -0.45177,1.01293 -1.01293,1.01293 h -4.58871 c -0.56117,0 -1.01293,-0.45177 -1.01293,-1.01293 v -3.2658 c 0,-0.56117 0.45176,-1.01294 1.01293,-1.01294 z"
         id="path46" />
      <path
         style="display:inline;opacity:1;vector-effect:none;fill:#000000;fill-opacity:1;stroke:none;stroke-width:1.65416;stroke-linecap:round;stroke-linejoin:miter;stroke-miterlimit:4;stroke-dasharray:none;stroke-dashoffset:0;stroke-opacity:1;marker:none;marker-start:none;marker-mid:none;marker-end:none;paint-order:normal"
         d="m 85.429273,187.18866 h 4.58871 c 0.56116,0 1.01293,0.45177 1.01293,1.01294 v 3.2658 c 0,0.56116 -0.45177,1.01293 -1.01293,1.01293 h -4.58871 c -0.56116,0 -1.01293,-0.45177 -1.01293,-1.01293 v -3.2658 c 0,-0.56117 0.45177,-1.01294 1.01293,-1.01294 z"
         id="path44-2" />
      <path
         style="display:inline;opacity:1;vector-effect:none;fill:#000000;fill-opacity:1;stroke:none;stroke-width:1.65416;stroke-linecap:round;stroke-linejoin:miter;stroke-miterlimit:4;stroke-dasharray:none;stroke-dashoffset:0;stroke-opacity:1;marker:none;marker-start:none;marker-mid:none;marker-end:none;paint-order:normal"
         d="m 77.491752,187.18866 h 4.588711 c 0.56117,0 1.01294,0.45177 1.01294,1.01294 v 3.2658 c 0,0.56116 -0.45177,1.01293 -1.01294,1.01293 h -4.588711 c -0.56116,0 -1.01293,-0.45177 -1.01293,-1.01293 v -3.2658 c 0,-0.56117 0.45177,-1.01294 1.01293,-1.01294 z"
         id="path42" />
      <path
         style="display:inline;opacity:1;vector-effect:none;fill:#000000;fill-opacity:1;stroke:none;stroke-width:1.65416;stroke-linecap:round;stroke-linejoin:miter;stroke-miterlimit:4;stroke-dasharray:none;stroke-dashoffset:0;stroke-opacity:1;marker:none;marker-start:none;marker-mid:none;marker-end:none;paint-order:normal"
         d="m 69.554249,187.18866 h 4.588706 c 0.561165,0 1.012933,0.45177 1.012933,1.01294 v 3.2658 c 0,0.56116 -0.451768,1.01293 -1.012933,1.01293 h -4.588706 c -0.561165,0 -1.012933,-0.45177 -1.012933,-1.01293 v -3.2658 c 0,-0.56117 0.451768,-1.01294 1.012933,-1.01294 z"
         id="path40-9" />
      <path
         style="display:inline;opacity:1;vector-effect:none;fill:#000000;fill-opacity:1;stroke:none;stroke-width:1.65416;stroke-linecap:round;stroke-linejoin:miter;stroke-miterlimit:4;stroke-dasharray:none;stroke-dashoffset:0;stroke-opacity:1;marker:none;marker-start:none;marker-mid:none;marker-end:none;paint-order:normal"
         d="m 61.616749,187.18866 h 4.588706 c 0.561165,0 1.012933,0.45177 1.012933,1.01294 v 3.2658 c 0,0.56116 -0.451768,1.01293 -1.012933,1.01293 h -4.588706 c -0.561165,0 -1.012933,-0.45177 -1.012933,-1.01293 v -3.2658 c 0,-0.56117 0.451768,-1.01294 1.012933,-1.01294 z"
         id="path38-3" />
      <path
         style="display:inline;opacity:1;vector-effect:none;fill:#000000;fill-opacity:1;stroke:none;stroke-width:1.65416;stroke-linecap:round;stroke-linejoin:miter;stroke-miterlimit:4;stroke-dasharray:none;stroke-dashoffset:0;stroke-opacity:1;marker:none;marker-start:none;marker-mid:none;marker-end:none;paint-order:normal"
         d="m 61.616757,200.41782 h 4.588705 c 0.561165,0 1.012933,0.45177 1.012933,1.01293 v 3.2658 c 0,0.56117 -0.451768,1.01294 -1.012933,1.01294 h -4.588705 c -0.561165,0 -1.012933,-0.45177 -1.012933,-1.01294 v -3.2658 c 0,-0.56116 0.451768,-1.01293 1.012933,-1.01293 z"
         id="path36-1" />
      <path
         style="display:inline;opacity:1;vector-effect:none;fill:#000000;fill-opacity:1;stroke:none;stroke-width:1.65416;stroke-linecap:round;stroke-linejoin:miter;stroke-miterlimit:4;stroke-dasharray:none;stroke-dashoffset:0;stroke-opacity:1;marker:none;marker-start:none;marker-mid:none;marker-end:none;paint-order:normal"
         d="m 73.523007,207.03241 h 4.588705 c 0.56117,0 1.01293,0.45177 1.01293,1.01294 v 3.2658 c 0,0.56116 -0.45176,1.01293 -1.01293,1.01293 h -4.588705 c -0.561165,0 -1.012933,-0.45177 -1.012933,-1.01293 v -3.2658 c 0,-0.56117 0.451768,-1.01294 1.012933,-1.01294 z"
         id="path34-9" />
      <path
         style="display:inline;opacity:1;vector-effect:none;fill:#000000;fill-opacity:1;stroke:none;stroke-width:1.65416;stroke-linecap:round;stroke-linejoin:miter;stroke-miterlimit:4;stroke-dasharray:none;stroke-dashoffset:0;stroke-opacity:1;marker:none;marker-start:none;marker-mid:none;marker-end:none;paint-order:normal"
         d="m 61.616749,207.03241 h 8.557485 c 0.561165,0 1.012933,0.45177 1.012933,1.01294 v 3.2658 c 0,0.56116 -0.451768,1.01293 -1.012933,1.01293 h -8.557485 c -0.561165,0 -1.012933,-0.45177 -1.012933,-1.01293 v -3.2658 c 0,-0.56117 0.451768,-1.01294 1.012933,-1.01294 z"
         id="path32-4" />
      <path
         style="display:inline;opacity:1;vector-effect:none;fill:#000000;fill-opacity:1;stroke:none;stroke-width:1.65416;stroke-linecap:round;stroke-linejoin:miter;stroke-miterlimit:4;stroke-dasharray:none;stroke-dashoffset:0;stroke-opacity:1;marker:none;marker-start:none;marker-mid:none;marker-end:none;paint-order:normal"
         d="m 113.2105,193.80324 h 4.58871 c 0.56116,0 1.01293,0.45177 1.01293,1.01294 v 3.2658 c 0,0.56116 -0.45177,1.01293 -1.01293,1.01293 h -4.58871 c -0.56117,0 -1.01293,-0.45177 -1.01293,-1.01293 v -3.2658 c 0,-0.56117 0.45176,-1.01294 1.01293,-1.01294 z"
         id="path30-7" />
      <path
         style="display:inline;opacity:1;vector-effect:none;fill:#000000;fill-opacity:1;stroke:none;stroke-width:1.65416;stroke-linecap:round;stroke-linejoin:miter;stroke-miterlimit:4;stroke-dasharray:none;stroke-dashoffset:0;stroke-opacity:1;marker:none;marker-start:none;marker-mid:none;marker-end:none;paint-order:normal"
         d="m 115.85634,193.80324 h 1.94287 c 0.56116,0 1.01293,0.45177 1.01293,1.01294 v 9.88037 c 0,0.56117 -0.45177,1.01294 -1.01293,1.01294 h -1.94287 c -0.56116,0 -1.01293,-0.45177 -1.01293,-1.01294 v -9.88037 c 0,-0.56117 0.45177,-1.01294 1.01293,-1.01294 z"
         id="rect29280" />
      <path
         style="display:inline;opacity:1;vector-effect:none;fill:#36343d;fill-opacity:1;stroke:none;stroke-width:7.14935;stroke-linecap:round;stroke-linejoin:miter;stroke-miterlimit:4;stroke-dasharray:none;stroke-dashoffset:0;stroke-opacity:1;marker:none;marker-start:none;marker-mid:none;marker-end:none;paint-order:normal"
         d="m 427.88281,780.48438 c -2.12095,0 -3.82812,1.7072 -3.82812,3.82812 v 12.34375 c 0,2.12096 1.70717,3.82813 3.82812,3.82813 h 17.3418 c 2.12096,-10e-6 3.83008,-1.70717 3.83008,-3.82813 V 784.3125 c 0,-2.12092 -1.70912,-3.82812 -3.83008,-3.82812 z"
         transform="scale(0.26458333)"
         id="path132" />
      <path
         style="display:inline;opacity:1;vector-effect:none;fill:#36343d;fill-opacity:1;stroke:none;stroke-width:7.14935;stroke-linecap:round;stroke-linejoin:miter;stroke-miterlimit:4;stroke-dasharray:none;stroke-dashoffset:0;stroke-opacity:1;marker:none;marker-start:none;marker-mid:none;marker-end:none;paint-order:normal"
         d="m 339.43428,780.48438 c -2.12093,0 -3.82812,1.7072 -3.82812,3.82812 v 12.34375 c 0,2.12092 1.70719,3.82813 3.82812,3.82813 h 76.07974 c 2.12092,-10e-6 3.83008,-1.70721 3.83008,-3.82813 V 784.3125 c 0,-2.12092 -1.70916,-3.82812 -3.83008,-3.82812 z"
         transform="scale(0.26458333)"
         id="path128"
         sodipodi:nodetypes="sssscssss" />
      <path
         style="display:inline;opacity:1;vector-effect:none;fill:#36343d;fill-opacity:1;stroke:none;stroke-width:7.14935;stroke-linecap:round;stroke-linejoin:miter;stroke-miterlimit:4;stroke-dasharray:none;stroke-dashoffset:0;stroke-opacity:1;marker:none;marker-start:none;marker-mid:none;marker-end:none;paint-order:normal"
         d="m 277.88281,780.48438 c -2.12094,0 -3.82812,1.7072 -3.82812,3.82812 v 12.34375 c 0,2.12096 1.70718,3.82813 3.82812,3.82813 h 17.3418 c 2.12094,-10e-6 3.83008,-1.70717 3.83008,-3.82813 V 784.3125 c 0,-2.12092 -1.70914,-3.82812 -3.83008,-3.82812 z"
         transform="scale(0.26458333)"
         id="path126" />
      <path
         style="display:inline;opacity:1;vector-effect:none;fill:#36343d;fill-opacity:1;stroke:none;stroke-width:7.14935;stroke-linecap:round;stroke-linejoin:miter;stroke-miterlimit:4;stroke-dasharray:none;stroke-dashoffset:0;stroke-opacity:1;marker:none;marker-start:none;marker-mid:none;marker-end:none;paint-order:normal"
         d="m 232.88281,780.48438 c -2.12094,0 -3.82812,1.7072 -3.82812,3.82812 v 12.34375 c 0,2.12096 1.70718,3.82813 3.82812,3.82813 h 32.3418 c 2.12094,-10e-6 3.83008,-1.70717 3.83008,-3.82813 V 784.3125 c 0,-2.12092 -1.70914,-3.82812 -3.83008,-3.82812 z"
         transform="scale(0.26458333)"
         id="path124" />
      <path
         style="display:inline;opacity:1;vector-effect:none;fill:#36343d;fill-opacity:1;stroke:none;stroke-width:7.14935;stroke-linecap:round;stroke-linejoin:miter;stroke-miterlimit:4;stroke-dasharray:none;stroke-dashoffset:0;stroke-opacity:1;marker:none;marker-start:none;marker-mid:none;marker-end:none;paint-order:normal"
         d="m 412.88281,755.48438 c -2.12092,-10e-6 -3.82812,1.70716 -3.82812,3.82812 v 12.34375 c 0,2.12096 1.7072,3.82813 3.82812,3.82813 h 12.3418 c 2.12092,-10e-6 3.83008,-1.70717 3.83008,-3.82813 V 759.3125 c 0,-2.12096 -1.70916,-3.82812 -3.83008,-3.82812 z"
         transform="scale(0.26458333)"
         id="path122" />
      <path
         style="display:inline;opacity:1;vector-effect:none;fill:#36343d;fill-opacity:1;stroke:none;stroke-width:7.14935;stroke-linecap:round;stroke-linejoin:miter;stroke-miterlimit:4;stroke-dasharray:none;stroke-dashoffset:0;stroke-opacity:1;marker:none;marker-start:none;marker-mid:none;marker-end:none;paint-order:normal"
         d="m 382.88281,755.48438 c -2.12092,-10e-6 -3.82812,1.70716 -3.82812,3.82812 v 12.34375 c 0,2.12096 1.7072,3.82813 3.82812,3.82813 h 17.3418 c 2.12092,-10e-6 3.82812,-1.70717 3.82812,-3.82813 V 759.3125 c 0,-2.12096 -1.7072,-3.82812 -3.82812,-3.82812 z"
         transform="scale(0.26458333)"
         id="path120" />
      <path
         style="display:inline;opacity:1;vector-effect:none;fill:#36343d;fill-opacity:1;stroke:none;stroke-width:7.14935;stroke-linecap:round;stroke-linejoin:miter;stroke-miterlimit:4;stroke-dasharray:none;stroke-dashoffset:0;stroke-opacity:1;marker:none;marker-start:none;marker-mid:none;marker-end:none;paint-order:normal"
         d="m 352.88281,755.48438 c -2.12094,-10e-6 -3.82812,1.70716 -3.82812,3.82812 v 12.34375 c 0,2.12096 1.70718,3.82813 3.82812,3.82813 h 17.3418 c 2.12093,-10e-6 3.82812,-1.70717 3.82812,-3.82813 V 759.3125 c 0,-2.12096 -1.70719,-3.82812 -3.82812,-3.82812 z"
         transform="scale(0.26458333)"
         id="path118" />
      <path
         style="display:inline;opacity:1;vector-effect:none;fill:#36343d;fill-opacity:1;stroke:none;stroke-width:7.14935;stroke-linecap:round;stroke-linejoin:miter;stroke-miterlimit:4;stroke-dasharray:none;stroke-dashoffset:0;stroke-opacity:1;marker:none;marker-start:none;marker-mid:none;marker-end:none;paint-order:normal"
         d="m 322.88281,755.48438 c -2.12093,-10e-6 -3.82812,1.70716 -3.82812,3.82812 v 12.34375 c 0,2.12096 1.70719,3.82813 3.82812,3.82813 h 17.3418 c 2.12094,-10e-6 3.83008,-1.70717 3.83008,-3.82813 V 759.3125 c 0,-2.12096 -1.70914,-3.82812 -3.83008,-3.82812 z"
         transform="scale(0.26458333)"
         id="path116" />
      <path
         style="display:inline;opacity:1;vector-effect:none;fill:#36343d;fill-opacity:1;stroke:none;stroke-width:7.14935;stroke-linecap:round;stroke-linejoin:miter;stroke-miterlimit:4;stroke-dasharray:none;stroke-dashoffset:0;stroke-opacity:1;marker:none;marker-start:none;marker-mid:none;marker-end:none;paint-order:normal"
         d="m 292.88281,755.48438 c -2.12093,-10e-6 -3.82812,1.70716 -3.82812,3.82812 v 12.34375 c 0,2.12096 1.70719,3.82813 3.82812,3.82813 h 17.3418 c 2.12094,-10e-6 3.82812,-1.70717 3.82812,-3.82813 V 759.3125 c 0,-2.12096 -1.70718,-3.82812 -3.82812,-3.82812 z"
         transform="scale(0.26458333)"
         id="path114" />
      <path
         style="display:inline;opacity:1;vector-effect:none;fill:#36343d;fill-opacity:1;stroke:none;stroke-width:7.14935;stroke-linecap:round;stroke-linejoin:miter;stroke-miterlimit:4;stroke-dasharray:none;stroke-dashoffset:0;stroke-opacity:1;marker:none;marker-start:none;marker-mid:none;marker-end:none;paint-order:normal"
         d="m 262.88281,755.48438 c -2.12094,-10e-6 -3.82812,1.70716 -3.82812,3.82812 v 12.34375 c 0,2.12096 1.70718,3.82813 3.82812,3.82813 h 17.3418 c 2.12094,-10e-6 3.83008,-1.70717 3.83008,-3.82813 V 759.3125 c 0,-2.12096 -1.70914,-3.82812 -3.83008,-3.82812 z"
         transform="scale(0.26458333)"
         id="path112" />
      <path
         style="display:inline;opacity:1;vector-effect:none;fill:#36343d;fill-opacity:1;stroke:none;stroke-width:7.14935;stroke-linecap:round;stroke-linejoin:miter;stroke-miterlimit:4;stroke-dasharray:none;stroke-dashoffset:0;stroke-opacity:1;marker:none;marker-start:none;marker-mid:none;marker-end:none;paint-order:normal"
         d="m 232.88281,755.48438 c -2.12094,-10e-6 -3.82812,1.70716 -3.82812,3.82812 v 12.34375 c 0,2.12096 1.70718,3.82813 3.82812,3.82813 h 17.3418 c 2.12094,-10e-6 3.83008,-1.70717 3.83008,-3.82813 V 759.3125 c 0,-2.12096 -1.70914,-3.82812 -3.83008,-3.82812 z"
         transform="scale(0.26458333)"
         id="path110" />
      <path
         style="display:inline;opacity:1;vector-effect:none;fill:#36343d;fill-opacity:1;stroke:none;stroke-width:7.14935;stroke-linecap:round;stroke-linejoin:miter;stroke-miterlimit:4;stroke-dasharray:none;stroke-dashoffset:0;stroke-opacity:1;marker:none;marker-start:none;marker-mid:none;marker-end:none;paint-order:normal"
         d="m 427.88281,730.48438 c -2.12092,-10e-6 -3.83008,1.7072 -3.83008,3.82812 v 12.34375 c 0,2.12096 1.70916,3.82813 3.83008,3.82813 h 6.13281 v 21.17187 c 10e-6,2.12094 1.70719,3.82813 3.82813,3.82813 h 7.34375 c 2.12094,0 3.82812,-1.70719 3.82812,-3.82813 V 747.0332 c 0.0124,-0.12585 0.0371,-0.24774 0.0371,-0.37695 V 734.3125 c 0,-2.12092 -1.7072,-3.82812 -3.82812,-3.82812 h -0.0371 -7.34375 z"
         transform="scale(0.26458333)"
         id="path108" />
      <path
         style="display:inline;opacity:1;vector-effect:none;fill:#36343d;fill-opacity:1;stroke:none;stroke-width:7.14935;stroke-linecap:round;stroke-linejoin:miter;stroke-miterlimit:4;stroke-dasharray:none;stroke-dashoffset:0;stroke-opacity:1;marker:none;marker-start:none;marker-mid:none;marker-end:none;paint-order:normal"
         d="m 397.88281,730.48438 c -2.12092,-10e-6 -3.82812,1.7072 -3.82812,3.82812 v 12.34375 c 0,2.12096 1.7072,3.82813 3.82812,3.82813 h 17.3418 c 2.12092,-10e-6 3.83008,-1.70717 3.83008,-3.82813 V 734.3125 c 0,-2.12092 -1.70916,-3.82812 -3.83008,-3.82812 z"
         transform="scale(0.26458333)"
         id="path106" />
      <path
         style="display:inline;opacity:1;vector-effect:none;fill:#36343d;fill-opacity:1;stroke:none;stroke-width:7.14935;stroke-linecap:round;stroke-linejoin:miter;stroke-miterlimit:4;stroke-dasharray:none;stroke-dashoffset:0;stroke-opacity:1;marker:none;marker-start:none;marker-mid:none;marker-end:none;paint-order:normal"
         d="m 367.88281,730.48438 c -2.12093,-10e-6 -3.82812,1.7072 -3.82812,3.82812 v 12.34375 c 0,2.12096 1.70719,3.82813 3.82812,3.82813 h 17.3418 c 2.12092,-10e-6 3.83008,-1.70717 3.83008,-3.82813 V 734.3125 c 0,-2.12092 -1.70916,-3.82812 -3.83008,-3.82812 z"
         transform="scale(0.26458333)"
         id="path104" />
      <path
         style="display:inline;opacity:1;vector-effect:none;fill:#36343d;fill-opacity:1;stroke:none;stroke-width:7.14935;stroke-linecap:round;stroke-linejoin:miter;stroke-miterlimit:4;stroke-dasharray:none;stroke-dashoffset:0;stroke-opacity:1;marker:none;marker-start:none;marker-mid:none;marker-end:none;paint-order:normal"
         d="m 337.88281,730.48438 c -2.12094,-10e-6 -3.82812,1.7072 -3.82812,3.82812 v 12.34375 c 0,2.12096 1.70718,3.82813 3.82812,3.82813 h 17.3418 c 2.12093,-10e-6 3.82812,-1.70717 3.82812,-3.82813 V 734.3125 c 0,-2.12092 -1.70719,-3.82812 -3.82812,-3.82812 z"
         transform="scale(0.26458333)"
         id="path102" />
      <path
         style="display:inline;opacity:1;vector-effect:none;fill:#36343d;fill-opacity:1;stroke:none;stroke-width:7.14935;stroke-linecap:round;stroke-linejoin:miter;stroke-miterlimit:4;stroke-dasharray:none;stroke-dashoffset:0;stroke-opacity:1;marker:none;marker-start:none;marker-mid:none;marker-end:none;paint-order:normal"
         d="m 307.88281,730.48438 c -2.12093,-10e-6 -3.82812,1.7072 -3.82812,3.82812 v 12.34375 c 0,2.12096 1.70719,3.82813 3.82812,3.82813 h 17.3418 c 2.12094,-10e-6 3.83008,-1.70717 3.83008,-3.82813 V 734.3125 c 0,-2.12092 -1.70914,-3.82812 -3.83008,-3.82812 z"
         transform="scale(0.26458333)"
         id="path100" />
      <path
         style="display:inline;opacity:1;vector-effect:none;fill:#36343d;fill-opacity:1;stroke:none;stroke-width:7.14935;stroke-linecap:round;stroke-linejoin:miter;stroke-miterlimit:4;stroke-dasharray:none;stroke-dashoffset:0;stroke-opacity:1;marker:none;marker-start:none;marker-mid:none;marker-end:none;paint-order:normal"
         d="m 277.88281,730.48438 c -2.12094,-10e-6 -3.82812,1.7072 -3.82812,3.82812 v 12.34375 c 0,2.12096 1.70718,3.82813 3.82812,3.82813 h 17.3418 c 2.12094,-10e-6 3.83008,-1.70717 3.83008,-3.82813 V 734.3125 c 0,-2.12092 -1.70914,-3.82812 -3.83008,-3.82812 z"
         transform="scale(0.26458333)"
         id="path98" />
      <path
         style="display:inline;opacity:1;vector-effect:none;fill:#36343d;fill-opacity:1;stroke:none;stroke-width:7.14935;stroke-linecap:round;stroke-linejoin:miter;stroke-miterlimit:4;stroke-dasharray:none;stroke-dashoffset:0;stroke-opacity:1;marker:none;marker-start:none;marker-mid:none;marker-end:none;paint-order:normal"
         d="m 232.88281,730.48438 c -2.12094,-10e-6 -3.82812,1.7072 -3.82812,3.82812 v 12.34375 c 0,2.12096 1.70718,3.82813 3.82812,3.82813 h 32.3418 c 2.12094,-10e-6 3.83008,-1.70717 3.83008,-3.82813 V 734.3125 c 0,-2.12092 -1.70914,-3.82812 -3.83008,-3.82812 z"
         transform="scale(0.26458333)"
         id="path96" />
      <path
         style="display:inline;opacity:1;vector-effect:none;fill:#36343d;fill-opacity:1;stroke:none;stroke-width:7.14935;stroke-linecap:round;stroke-linejoin:miter;stroke-miterlimit:4;stroke-dasharray:none;stroke-dashoffset:0;stroke-opacity:1;marker:none;marker-start:none;marker-mid:none;marker-end:none;paint-order:normal"
         d="m 412.88281,705.48438 c -2.12092,0 -3.82812,1.7072 -3.82812,3.82812 v 12.34375 c 0,2.12096 1.7072,3.82813 3.82812,3.82813 h 32.3418 c 2.12096,0 3.83008,-1.70717 3.83008,-3.82813 V 709.3125 c 0,-2.12092 -1.70912,-3.82812 -3.83008,-3.82812 z"
         transform="scale(0.26458333)"
         id="path94" />
      <path
         style="display:inline;opacity:1;vector-effect:none;fill:#36343d;fill-opacity:1;stroke:none;stroke-width:7.14935;stroke-linecap:round;stroke-linejoin:miter;stroke-miterlimit:4;stroke-dasharray:none;stroke-dashoffset:0;stroke-opacity:1;marker:none;marker-start:none;marker-mid:none;marker-end:none;paint-order:normal"
         d="m 382.88281,705.48438 c -2.12092,0 -3.82812,1.7072 -3.82812,3.82812 v 12.34375 c 0,2.12096 1.7072,3.82813 3.82812,3.82813 h 17.3418 c 2.12092,0 3.83008,-1.70717 3.83008,-3.82813 V 709.3125 c 0,-2.12092 -1.70916,-3.82812 -3.83008,-3.82812 z"
         transform="scale(0.26458333)"
         id="path92" />
      <path
         style="display:inline;opacity:1;vector-effect:none;fill:#36343d;fill-opacity:1;stroke:none;stroke-width:7.14935;stroke-linecap:round;stroke-linejoin:miter;stroke-miterlimit:4;stroke-dasharray:none;stroke-dashoffset:0;stroke-opacity:1;marker:none;marker-start:none;marker-mid:none;marker-end:none;paint-order:normal"
         d="m 352.88281,705.48438 c -2.12094,0 -3.82812,1.7072 -3.82812,3.82812 v 12.34375 c 0,2.12096 1.70718,3.82813 3.82812,3.82813 h 17.3418 c 2.12093,0 3.82812,-1.70717 3.82812,-3.82813 V 709.3125 c 0,-2.12092 -1.70719,-3.82812 -3.82812,-3.82812 z"
         transform="scale(0.26458333)"
         id="path90" />
      <path
         style="display:inline;opacity:1;vector-effect:none;fill:#36343d;fill-opacity:1;stroke:none;stroke-width:7.14935;stroke-linecap:round;stroke-linejoin:miter;stroke-miterlimit:4;stroke-dasharray:none;stroke-dashoffset:0;stroke-opacity:1;marker:none;marker-start:none;marker-mid:none;marker-end:none;paint-order:normal"
         d="m 322.88281,705.48438 c -2.12093,0 -3.82812,1.7072 -3.82812,3.82812 v 12.34375 c 0,2.12096 1.70719,3.82813 3.82812,3.82813 h 17.3418 c 2.12094,0 3.83008,-1.70717 3.83008,-3.82813 V 709.3125 c 0,-2.12092 -1.70914,-3.82812 -3.83008,-3.82812 z"
         transform="scale(0.26458333)"
         id="path88" />
      <path
         style="display:inline;opacity:1;vector-effect:none;fill:#36343d;fill-opacity:1;stroke:none;stroke-width:7.14935;stroke-linecap:round;stroke-linejoin:miter;stroke-miterlimit:4;stroke-dasharray:none;stroke-dashoffset:0;stroke-opacity:1;marker:none;marker-start:none;marker-mid:none;marker-end:none;paint-order:normal"
         d="m 292.88281,705.48438 c -2.12094,0 -3.82812,1.7072 -3.82812,3.82812 v 12.34375 c 0,2.12096 1.70718,3.82813 3.82812,3.82813 h 17.3418 c 2.12094,0 3.83008,-1.70717 3.83008,-3.82813 V 709.3125 c 0,-2.12092 -1.70914,-3.82812 -3.83008,-3.82812 z"
         transform="scale(0.26458333)"
         id="path86" />
      <path
         style="display:inline;opacity:1;vector-effect:none;fill:#36343d;fill-opacity:1;stroke:none;stroke-width:7.14935;stroke-linecap:round;stroke-linejoin:miter;stroke-miterlimit:4;stroke-dasharray:none;stroke-dashoffset:0;stroke-opacity:1;marker:none;marker-start:none;marker-mid:none;marker-end:none;paint-order:normal"
         d="m 262.88281,705.48438 c -2.12094,0 -3.82812,1.7072 -3.82812,3.82812 v 12.34375 c 0,2.12096 1.70718,3.82813 3.82812,3.82813 h 17.3418 c 2.12094,0 3.83008,-1.70717 3.83008,-3.82813 V 709.3125 c 0,-2.12092 -1.70914,-3.82812 -3.83008,-3.82812 z"
         transform="scale(0.26458333)"
         id="path84" />
      <path
         style="display:inline;opacity:1;vector-effect:none;fill:#36343d;fill-opacity:1;stroke:none;stroke-width:7.14935;stroke-linecap:round;stroke-linejoin:miter;stroke-miterlimit:4;stroke-dasharray:none;stroke-dashoffset:0;stroke-opacity:1;marker:none;marker-start:none;marker-mid:none;marker-end:none;paint-order:normal"
         d="m 232.88281,705.48438 c -2.12094,0 -3.82812,1.7072 -3.82812,3.82812 v 12.34375 c 0,2.12096 1.70718,3.82813 3.82812,3.82813 h 17.3418 c 2.12093,0 3.83008,-1.70717 3.83008,-3.82813 V 709.3125 c 0,-2.12092 -1.70915,-3.82812 -3.83008,-3.82812 z"
         transform="scale(0.26458333)"
         id="rect2260-9" />
      <path
         style="display:inline;opacity:1;vector-effect:none;fill:#000000;fill-opacity:1;stroke:none;stroke-width:1.65416;stroke-linecap:round;stroke-linejoin:miter;stroke-miterlimit:4;stroke-dasharray:none;stroke-dashoffset:0;stroke-opacity:1;marker:none;marker-start:none;marker-mid:none;marker-end:none;paint-order:normal"
         d="m 81.537083,207.03241 h 4.588705 c 0.56117,0 1.01293,0.45177 1.01293,1.01294 v 3.2658 c 0,0.56116 -0.45176,1.01293 -1.01293,1.01293 h -4.588705 c -0.561165,0 -1.012933,-0.45177 -1.012933,-1.01293 v -3.2658 c 0,-0.56117 0.451768,-1.01294 1.012933,-1.01294 z"
         id="path134" />
      <path
         style="display:inline;opacity:1;vector-effect:none;fill:#36343d;fill-opacity:1;stroke:none;stroke-width:1.8916;stroke-linecap:round;stroke-linejoin:miter;stroke-miterlimit:4;stroke-dasharray:none;stroke-dashoffset:0;stroke-opacity:1;marker:none;marker-start:none;marker-mid:none;marker-end:none;paint-order:normal"
         d="m 81.537235,206.50316 c -0.561166,0 -1.012857,0.45169 -1.012857,1.01285 v 3.26595 c 0,0.56117 0.451691,1.01286 1.012857,1.01286 h 4.588351 c 0.561165,0 1.013375,-0.45169 1.013375,-1.01286 v -3.26595 c 0,-0.56116 -0.45221,-1.01285 -1.013375,-1.01285 z"
         id="path136" />
    </g>
    <g
       transform="matrix(2.1828653,0,0,2.1828653,2427.6418,-1437.7268)"
       id="g11726"
       style="display:inline;stroke-width:1.50077">
      <rect
         style="opacity:1;vector-effect:none;fill:#000000;fill-opacity:0.102362;stroke:none;stroke-width:2.38247;stroke-linecap:round;stroke-linejoin:miter;stroke-miterlimit:4;stroke-dasharray:none;stroke-dashoffset:0;stroke-opacity:1;marker:none;marker-start:none;marker-mid:none;marker-end:none;paint-order:normal"
         id="rect15054"
         width="23.283333"
         height="35.454166"
         x="248.70833"
         y="158.74997"
         rx="17.471415"
         ry="17.471415" />
      <rect
         ry="11.641666"
         rx="11.641666"
         y="157.69165"
         x="248.70833"
         height="35.454166"
         width="23.283333"
         id="rect11709"
         style="opacity:1;vector-effect:none;fill:#deddda;fill-opacity:1;stroke:none;stroke-width:2.38247;stroke-linecap:round;stroke-linejoin:miter;stroke-miterlimit:4;stroke-dasharray:none;stroke-dashoffset:0;stroke-opacity:1;marker:none;marker-start:none;marker-mid:none;marker-end:none;paint-order:normal" />
      <rect
         style="opacity:1;vector-effect:none;fill:#f6f5f4;fill-opacity:1;stroke:none;stroke-width:6.35324;stroke-linecap:round;stroke-linejoin:miter;stroke-miterlimit:4;stroke-dasharray:none;stroke-dashoffset:0;stroke-opacity:1;marker:none;marker-start:none;marker-mid:none;marker-end:none;paint-order:normal"
         id="rect11701"
         width="23.283333"
         height="35.454166"
         x="248.70833"
         y="156.10417"
         rx="11.641666"
         ry="11.641666" />
      <path
         style="fill:#5e5c64;fill-opacity:1;stroke:#5e5c64;stroke-width:0.397077px;stroke-linecap:butt;stroke-linejoin:miter;stroke-opacity:1"
         d="M 260.61458,170.65625 V 156.10416"
         id="path11703"
         inkscape:connector-curvature="0" />
      <rect
         style="opacity:1;vector-effect:none;fill:#36343d;fill-opacity:1;stroke:none;stroke-width:6.35324;stroke-linecap:round;stroke-linejoin:miter;stroke-miterlimit:4;stroke-dasharray:none;stroke-dashoffset:0;stroke-opacity:1;marker:none;marker-start:none;marker-mid:none;marker-end:none;paint-order:normal"
         id="rect11707"
         width="5.2916665"
         height="13.229166"
         x="257.96875"
         y="160.07292"
         rx="2.6458333"
         ry="2.6458333" />
      <circle
         r="1.4552083"
         cy="162.00343"
         cx="260.603"
         id="path15652"
         style="opacity:1;vector-effect:none;fill:#c0bfbc;fill-opacity:0.102362;stroke:none;stroke-width:2.90278;stroke-linecap:round;stroke-linejoin:miter;stroke-miterlimit:4;stroke-dasharray:none;stroke-dashoffset:0;stroke-opacity:1;marker:none;marker-start:none;marker-mid:none;marker-end:none;paint-order:normal" />
    </g>
  </g>
</svg>
