<?xml version="1.0" encoding="UTF-8" standalone="no"?>
<svg
   xmlns:dc="http://purl.org/dc/elements/1.1/"
   xmlns:cc="http://creativecommons.org/ns#"
   xmlns:rdf="http://www.w3.org/1999/02/22-rdf-syntax-ns#"
   xmlns:svg="http://www.w3.org/2000/svg"
   xmlns="http://www.w3.org/2000/svg"
   xmlns:xlink="http://www.w3.org/1999/xlink"
   xmlns:sodipodi="http://sodipodi.sourceforge.net/DTD/sodipodi-0.dtd"
   xmlns:inkscape="http://www.inkscape.org/namespaces/inkscape"
   inkscape:version="1.0.1 (3bc2e813f5, 2020-09-07)"
   id="svg8"
   version="1.1"
   viewBox="0 0 256 256"
   height="256"
   width="256"
   sodipodi:docname="logo.svg"
   inkscape:export-filename="/var/home/jimmac/SparkleShare/app-illustrations/logo.png"
   inkscape:export-xdpi="96"
   inkscape:export-ydpi="96">
  <defs
     id="defs2">
    <inkscape:path-effect
       effect="fillet_chamfer"
       id="path-effect339"
       is_visible="true"
       lpeversion="1"
       satellites_param="F,0,0,1,0,10.171695,0,1 @ F,0,0,1,0,32.630977,0,1 @ F,0,0,1,0,24.814453,0,1 @ F,0,0,1,0,16.330078,0,1"
       unit="px"
       method="auto"
       mode="F"
       radius="0"
       chamfer_steps="1"
       flexible="false"
       use_knot_distance="true"
       apply_no_radius="true"
       apply_with_radius="true"
       only_selected="false"
       hide_knots="false" />
    <clipPath
       clipPathUnits="userSpaceOnUse"
       id="clipPath1145">
      <path
         id="path1147"
         style="display:inline;fill:url(#linearGradient1149);fill-opacity:1;stroke:none;stroke-width:2.58902;stroke-linecap:round;stroke-opacity:1;stop-color:#000000"
         d="m 704.2778,841.11017 c 0,69.08331 -53.578,165.63503 -53.578,165.63503 0,0 -53.578,-96.39289 -53.578,-165.63503 0,-29.5903 23.9877,-53.57798 53.578,-53.57798 29.5903,0 53.578,23.98768 53.578,53.57798 z"
         sodipodi:nodetypes="scsss" />
    </clipPath>
    <linearGradient
       inkscape:collect="always"
       id="linearGradient1094">
      <stop
         style="stop-color:#e01b24;stop-opacity:1;"
         offset="0"
         id="stop1090" />
      <stop
         style="stop-color:#e01b24;stop-opacity:0;"
         offset="1"
         id="stop1092" />
    </linearGradient>
    <linearGradient
       inkscape:collect="always"
       id="linearGradient1104">
      <stop
         style="stop-color:#e5a50a;stop-opacity:1;"
         offset="0"
         id="stop1100" />
      <stop
         style="stop-color:#e5a50a;stop-opacity:0;"
         offset="1"
         id="stop1102" />
    </linearGradient>
    <linearGradient
       inkscape:collect="always"
       id="linearGradient1112">
      <stop
         style="stop-color:#ffffff;stop-opacity:1;"
         offset="0"
         id="stop1108" />
      <stop
         style="stop-color:#ffffff;stop-opacity:0;"
         offset="1"
         id="stop1110" />
    </linearGradient>
    <inkscape:path-effect
       effect="fillet_chamfer"
       id="path-effect1037"
       is_visible="true"
       lpeversion="1"
       satellites_param="F,0,0,1,0,10.171695,0,1 @ F,0,0,1,0,32.630977,0,1 @ F,0,0,1,0,24.814453,0,1 @ F,0,0,1,0,16.330078,0,1"
       unit="px"
       method="auto"
       mode="F"
       radius="0"
       chamfer_steps="1"
       flexible="false"
       use_knot_distance="true"
       apply_no_radius="true"
       apply_with_radius="true"
       only_selected="false"
       hide_knots="false" />
    <inkscape:path-effect
       effect="fillet_chamfer"
       id="path-effect224"
       is_visible="true"
       lpeversion="1"
       satellites_param="F,0,0,1,0,10.171695,0,1 @ F,0,0,1,0,32.630977,0,1 @ F,0,0,1,0,24.814453,0,1 @ F,0,0,1,0,16.330078,0,1"
       unit="px"
       method="auto"
       mode="F"
       radius="0"
       chamfer_steps="1"
       flexible="false"
       use_knot_distance="true"
       apply_no_radius="true"
       apply_with_radius="true"
       only_selected="false"
       hide_knots="false" />
    <clipPath
       clipPathUnits="userSpaceOnUse"
       id="clipPath228">
      <path
         id="path226"
         style="display:inline;fill:url(#linearGradient1149);fill-opacity:1;stroke:none;stroke-width:2.58902;stroke-linecap:round;stroke-opacity:1;stop-color:#000000"
         d="m 704.2778,841.11017 c 0,69.08331 -53.578,165.63503 -53.578,165.63503 0,0 -53.578,-96.39289 -53.578,-165.63503 0,-29.5903 23.9877,-53.57798 53.578,-53.57798 29.5903,0 53.578,23.98768 53.578,53.57798 z"
         sodipodi:nodetypes="scsss" />
    </clipPath>
    <radialGradient
       inkscape:collect="always"
       xlink:href="#linearGradient1104"
       id="radialGradient238"
       cx="650.69977"
       cy="832.23047"
       fx="650.69977"
       fy="832.23047"
       r="41.388672"
       gradientUnits="userSpaceOnUse"
       gradientTransform="matrix(2.4762363,0,0,2.4762363,-960.58661,-1242.494)" />
    <radialGradient
       inkscape:collect="always"
       xlink:href="#linearGradient1112"
       id="radialGradient246"
       cx="650.69977"
       cy="818.30518"
       fx="650.69977"
       fy="818.30518"
       r="22.805021"
       gradientUnits="userSpaceOnUse"
       gradientTransform="matrix(2.6752067,0,0,2.6752067,-1090.0566,-1370.8303)" />
    <inkscape:path-effect
       effect="fillet_chamfer"
       id="path-effect254"
       is_visible="true"
       lpeversion="1"
       satellites_param="F,0,0,1,0,10.171695,0,1 @ F,0,0,1,0,32.630977,0,1 @ F,0,0,1,0,24.814453,0,1 @ F,0,0,1,0,16.330078,0,1"
       unit="px"
       method="auto"
       mode="F"
       radius="0"
       chamfer_steps="1"
       flexible="false"
       use_knot_distance="true"
       apply_no_radius="true"
       apply_with_radius="true"
       only_selected="false"
       hide_knots="false" />
    <inkscape:path-effect
       effect="fillet_chamfer"
       id="path-effect256"
       is_visible="true"
       lpeversion="1"
       satellites_param="F,0,0,1,0,10.171695,0,1 @ F,0,0,1,0,32.630977,0,1 @ F,0,0,1,0,24.814453,0,1 @ F,0,0,1,0,16.330078,0,1"
       unit="px"
       method="auto"
       mode="F"
       radius="0"
       chamfer_steps="1"
       flexible="false"
       use_knot_distance="true"
       apply_no_radius="true"
       apply_with_radius="true"
       only_selected="false"
       hide_knots="false" />
    <linearGradient
       inkscape:collect="always"
       xlink:href="#linearGradient1094"
       id="linearGradient371"
       gradientUnits="userSpaceOnUse"
       x1="650.63708"
       y1="826.85352"
       x2="650.63708"
       y2="1043.7871" />
    <radialGradient
       inkscape:collect="always"
       xlink:href="#linearGradient1104"
       id="radialGradient373"
       gradientUnits="userSpaceOnUse"
       gradientTransform="matrix(2.4762363,0,0,2.4762363,-960.58661,-1242.494)"
       cx="650.69977"
       cy="832.23047"
       fx="650.69977"
       fy="832.23047"
       r="41.388672" />
    <radialGradient
       inkscape:collect="always"
       xlink:href="#linearGradient1112"
       id="radialGradient375"
       gradientUnits="userSpaceOnUse"
       gradientTransform="matrix(2.6752067,0,0,2.6752067,-1090.0566,-1370.8303)"
       cx="650.69977"
       cy="818.30518"
       fx="650.69977"
       fy="818.30518"
       r="22.805021" />
    <inkscape:path-effect
       effect="fillet_chamfer"
       id="path-effect1091"
       is_visible="true"
       lpeversion="1"
       satellites_param="F,0,0,1,0,0,0,1 @ F,0,0,1,0,0,0,1 @ F,0,1,1,0,2.1489258,0,1 @ F,0,0,1,0,0,0,1 @ F,0,0,1,0,0,0,1 @ F,0,0,1,0,0,0,1 @ F,0,1,1,0,2.1489258,0,1 @ F,0,0,1,0,0,0,1 @ F,0,0,1,0,0,0,1 @ F,0,0,1,0,2.1489258,0,1 @ F,0,1,1,0,2.1489258,0,1 @ F,0,0,1,0,0,0,1 @ F,0,0,1,0,0,0,1 @ F,0,0,1,0,0,0,1 @ F,0,1,1,0,2.1489258,0,1 @ F,0,0,1,0,0,0,1"
       unit="px"
       method="auto"
       mode="F"
       radius="0"
       chamfer_steps="1"
       flexible="false"
       use_knot_distance="true"
       apply_no_radius="true"
       apply_with_radius="true"
       only_selected="false"
       hide_knots="false" />
  </defs>
  <sodipodi:namedview
     units="px"
     borderlayer="true"
     inkscape:showpageshadow="false"
     showgrid="false"
     inkscape:document-rotation="0"
     inkscape:current-layer="layer1"
     inkscape:document-units="px"
     inkscape:cy="560"
     inkscape:cx="400"
     inkscape:zoom="0.35"
     inkscape:pageshadow="2"
     inkscape:pageopacity="1"
     borderopacity="1"
     bordercolor="#383838"
     pagecolor="#0c0e21"
     id="base" />
  <metadata
     id="metadata5">
    <rdf:RDF>
      <cc:Work
         rdf:about="">
        <dc:format>image/svg+xml</dc:format>
        <dc:type
           rdf:resource="http://purl.org/dc/dcmitype/StillImage" />
        <dc:title></dc:title>
        <cc:license
           rdf:resource="http://creativecommons.org/licenses/by-sa/4.0/" />
      </cc:Work>
      <cc:License
         rdf:about="http://creativecommons.org/licenses/by-sa/4.0/">
        <cc:permits
           rdf:resource="http://creativecommons.org/ns#Reproduction" />
        <cc:permits
           rdf:resource="http://creativecommons.org/ns#Distribution" />
        <cc:requires
           rdf:resource="http://creativecommons.org/ns#Notice" />
        <cc:requires
           rdf:resource="http://creativecommons.org/ns#Attribution" />
        <cc:permits
           rdf:resource="http://creativecommons.org/ns#DerivativeWorks" />
        <cc:requires
           rdf:resource="http://creativecommons.org/ns#ShareAlike" />
      </cc:License>
    </rdf:RDF>
  </metadata>
  <g
     id="layer1"
     inkscape:groupmode="layer"
     inkscape:label="Layer 1">
    <g
       id="use1054"
       transform="matrix(0.36070737,0.36070737,-0.36070737,0.36070737,148.96324,-357.65802)"
       style="display:inline">
      <g
         id="g349"
         transform="translate(0,-44.82708)"
         clip-path="url(#clipPath1145)">
        <path
           id="path341"
           style="fill:url(#linearGradient371);fill-opacity:1;stroke:none;stroke-width:2.58902;stroke-linecap:round;stroke-opacity:1;stop-color:#000000"
           d="m 704.27774,841.11017 c 0,69.08331 -53.57797,165.63503 -53.57797,165.63503 0,0 -53.57798,-96.39289 -53.57798,-165.63503 0,-29.5903 23.98768,-53.57798 53.57798,-53.57798 29.5903,0 53.57797,23.98768 53.57797,53.57798 z"
           sodipodi:nodetypes="scsss" />
        <circle
           style="fill:url(#radialGradient373);fill-opacity:1;stroke:none;stroke-width:4.95248;stroke-linecap:round;stroke-opacity:1;stop-color:#000000"
           id="circle343"
           cx="650.69977"
           cy="818.30518"
           r="102.48813" />
        <circle
           style="fill:url(#radialGradient375);fill-opacity:1;stroke:none;stroke-width:2.94805;stroke-linecap:round;stroke-opacity:1;stop-color:#000000"
           id="circle345"
           cx="650.69977"
           cy="818.30518"
           r="61.008148" />
        <circle
           style="fill:#ffffff;fill-opacity:1;stroke:none;stroke-width:1.0397;stroke-linecap:round;stroke-opacity:1;stop-color:#000000"
           id="circle347"
           cx="650.69977"
           cy="818.30518"
           r="21.515961" />
      </g>
      <rect
         style="fill:#f6f5f4;fill-opacity:1;stroke:none;stroke-width:2;stroke-linecap:round;stroke-opacity:1;stop-color:#000000"
         id="rect351"
         width="138.54297"
         height="244.12891"
         x="581.39844"
         y="524.57617"
         rx="69.271484"
         ry="69.271484" />
      <circle
         style="fill:#deddda;fill-opacity:1;stroke:none;stroke-width:2;stroke-linecap:round;stroke-opacity:1;stop-color:#000000"
         id="circle353"
         cx="650.66992"
         cy="646.64062"
         r="36.824219" />
      <circle
         style="fill:#5e5c64;fill-opacity:1;stroke:none;stroke-width:1.43503;stroke-linecap:round;stroke-opacity:1;stop-color:#000000"
         id="circle355"
         cx="650.66992"
         cy="646.64062"
         r="26.421875" />
      <path
         id="path357"
         style="fill:#deddda;fill-opacity:0.169818;stroke:none;stroke-width:2;stroke-linecap:round;stroke-opacity:1;stop-color:#000000"
         d="m 626.02148,770.69336 c -5.5937,0 -11.0213,0.67379 -16.2246,1.91406 30.49565,7.2681 53.04882,34.57406 53.04882,67.35742 v 105.58594 c 0,32.78337 -22.55317,60.08932 -53.04882,67.35742 5.2033,1.2403 10.6309,1.9141 16.2246,1.9141 38.3764,0 69.27149,-30.89511 69.27149,-69.27152 V 839.96484 c 0,-38.37641 -30.89509,-69.27148 -69.27149,-69.27148 z"
         transform="translate(24.64844,-246.11719)" />
      <path
         id="path359"
         style="fill:#ed333b;fill-opacity:1;stroke:none;stroke-width:1.86257;stroke-linecap:round;stroke-opacity:1;stop-color:#000000"
         d="m 650.65625,488.05664 a 69.284216,111.70673 0 0 0 -68.48828,94.83985 h 136.97851 a 69.284216,111.70673 0 0 0 -68.49023,-94.83985 z" />
      <path
         style="fill:#c0bfbc;fill-opacity:1;stroke:none;stroke-width:1px;stroke-linecap:butt;stroke-linejoin:miter;stroke-opacity:1"
         d="m 591.75594,710.92305 9.04181,23.1309 a 36.179337,36.179337 110.69763 0 1 -17.12839,45.33463 l -30.06678,15.48829 a 15.130661,15.130661 31.372831 0 1 -22.05961,-13.45089 v -12.62695 a 36.744497,36.744497 113.96143 0 1 12.12089,-27.27336 l 36.839,-33.25989 a 7.0265846,7.0265846 13.286238 0 1 11.25308,2.65727 z"
         id="path361"
         sodipodi:nodetypes="ccccc"
         inkscape:path-effect="#path-effect339"
         inkscape:original-d="m 588.05273,701.44942 24.625,62.99609 -81.13476,41.79492 v -53.77148 z" />
      <rect
         style="fill:#deddda;fill-opacity:1;stroke:none;stroke-width:2;stroke-linecap:round;stroke-opacity:1;stop-color:#000000"
         id="rect363"
         width="10.320312"
         height="97.167969"
         x="645.50977"
         y="714.05273"
         rx="5.1601558"
         ry="5.1601558" />
      <path
         id="path365"
         style="fill:#e01b24;fill-opacity:1;stroke:none;stroke-width:1.86257;stroke-linecap:round;stroke-opacity:1;stop-color:#000000"
         d="m 662.07031,489.58399 a 79.455116,165.0204 0 0 1 23.11328,93.3125 h 33.96289 a 69.284216,111.70673 0 0 0 -57.07617,-93.3125 z" />
      <path
         style="fill:#ffffff;fill-opacity:1;stroke:none;stroke-width:1px;stroke-linecap:butt;stroke-linejoin:miter;stroke-opacity:1"
         d="m 710.11616,710.92305 -9.04181,23.1309 a 36.179337,36.179337 69.302366 0 0 17.12839,45.33463 l 30.06678,15.48829 a 15.130661,15.130661 148.62717 0 0 22.05961,-13.45089 v -12.62695 a 36.744497,36.744497 66.038565 0 0 -12.12089,-27.27336 l -36.839,-33.25989 a 7.0265846,7.0265846 166.71376 0 0 -11.25308,2.65727 z"
         id="path367"
         sodipodi:nodetypes="ccccc"
         inkscape:path-effect="#path-effect1037"
         inkscape:original-d="m 713.81937,701.44942 -24.625,62.99609 81.13476,41.79492 v -53.77148 z" />
    </g>
    <circle
       style="display:inline;fill:#ffffff;fill-opacity:1;stroke:none;stroke-width:16;stroke-linecap:round;stroke-linejoin:round;stroke-miterlimit:4;stroke-dasharray:none;stroke-opacity:0.482318;stop-color:#000000"
       id="circle1138"
       cx="56.454052"
       cy="64.726151"
       r="1.490411" />
    <circle
       style="display:inline;fill:#ffffff;fill-opacity:1;stroke:none;stroke-width:16;stroke-linecap:round;stroke-linejoin:round;stroke-miterlimit:4;stroke-dasharray:none;stroke-opacity:0.482318;stop-color:#000000"
       id="circle1140"
       cx="29.490673"
       cy="33.438259"
       r="3.1628039" />
    <circle
       style="display:inline;fill:#ffffff;fill-opacity:1;stroke:none;stroke-width:16;stroke-linecap:round;stroke-linejoin:round;stroke-miterlimit:4;stroke-dasharray:none;stroke-opacity:0.482318;stop-color:#000000"
       id="circle99"
       cx="146.24489"
       cy="78.356606"
       r="3.1628039" />
    <circle
       style="display:inline;fill:#ffffff;fill-opacity:1;stroke:none;stroke-width:16;stroke-linecap:round;stroke-linejoin:round;stroke-miterlimit:4;stroke-dasharray:none;stroke-opacity:0.482318;stop-color:#000000"
       id="circle1142"
       cx="35.369457"
       cy="73.838623"
       r="1.0860374" />
    <path
       id="path1089"
       style="color:#000000;font-style:normal;font-variant:normal;font-weight:normal;font-stretch:normal;font-size:medium;line-height:normal;font-family:sans-serif;font-variant-ligatures:normal;font-variant-position:normal;font-variant-caps:normal;font-variant-numeric:normal;font-variant-alternates:normal;font-variant-east-asian:normal;font-feature-settings:normal;font-variation-settings:normal;text-indent:0;text-align:start;text-decoration:none;text-decoration-line:none;text-decoration-style:solid;text-decoration-color:#000000;letter-spacing:normal;word-spacing:normal;text-transform:none;writing-mode:lr-tb;direction:ltr;text-orientation:mixed;dominant-baseline:auto;baseline-shift:baseline;text-anchor:start;white-space:normal;shape-padding:0;shape-margin:0;inline-size:0;clip-rule:nonzero;display:inline;overflow:visible;visibility:visible;opacity:1;isolation:auto;mix-blend-mode:normal;color-interpolation:sRGB;color-interpolation-filters:linearRGB;solid-color:#000000;solid-opacity:1;vector-effect:none;fill:#ffffff;fill-opacity:1;fill-rule:nonzero;stroke:none;stroke-width:16;stroke-linecap:round;stroke-linejoin:miter;stroke-miterlimit:4;stroke-dasharray:none;stroke-dashoffset:0;stroke-opacity:1;color-rendering:auto;image-rendering:auto;shape-rendering:auto;text-rendering:auto;enable-background:accumulate;stop-color:#000000;stop-opacity:1"
       d="m 103.36264,37.05368 c -1.35616,-2e-6 -2.45555,1.099382 -2.45556,2.455546 l 0,1.314994 a 2.1489258,2.1489258 135 0 1 -2.148926,2.148926 h -1.314989 c -1.356169,-2e-6 -2.455562,1.099391 -2.45556,2.45556 -2e-6,1.356169 1.099391,2.455562 2.45556,2.45556 h 1.314989 a 2.1489258,2.1489258 45 0 1 2.148926,2.148926 v 1.314984 c 0,1.356169 1.09939,2.455562 2.45556,2.45556 0.59895,3e-6 1.14781,-0.214433 1.574,-0.570721 0.8817,-0.737076 0.88157,-2.846946 0.88157,-4.033765 a 1.7814412,1.7814412 148.53644 0 1 2.14893,-1.314984 h 1.31497 c 1.35618,2.4e-5 2.4556,-1.099375 2.4556,-2.45556 0,-1.356185 -1.09942,-2.455584 -2.4556,-2.45556 h -1.31497 a 2.1489258,2.1489258 45 0 1 -2.14893,-2.148926 v -1.314994 c -10e-6,-1.356168 -1.0994,-2.455553 -2.45557,-2.455546 z"
       inkscape:path-effect="#path-effect1091"
       inkscape:original-d="m 103.36264,37.05368 a 2.4555567,2.4555567 0 0 0 -2.45556,2.455546 v 3.46392 h -3.463915 a 2.4555567,2.4555567 0 0 0 -2.45556,2.45556 2.4555567,2.4555567 0 0 0 2.45556,2.45556 h 3.463915 v 3.46391 a 2.4555567,2.4555567 0 0 0 2.45556,2.45556 2.4555567,2.4555567 0 0 0 2.45557,-2.45556 v -3.46391 h 3.4639 a 2.4555567,2.4555567 0 0 0 2.4556,-2.45556 2.4555567,2.4555567 0 0 0 -2.4556,-2.45556 h -3.4639 v -3.46392 a 2.4555567,2.4555567 0 0 0 -2.45557,-2.455546 z" />
    <circle
       style="display:inline;fill:#ffffff;fill-opacity:1;stroke:none;stroke-width:16;stroke-linecap:round;stroke-linejoin:round;stroke-miterlimit:4;stroke-dasharray:none;stroke-opacity:0.482318;stop-color:#000000"
       id="circle407"
       cx="209.49068"
       cy="213.43826"
       r="3.1628039" />
  </g>
</svg>
