<?xml version="1.0" encoding="UTF-8" standalone="no"?>
<svg
   id="svg4749"
   version="1.1"
   viewBox="0 0 360 360.00002"
   height="360"
   width="360"
   xmlns:xlink="http://www.w3.org/1999/xlink"
   xmlns="http://www.w3.org/2000/svg"
   xmlns:svg="http://www.w3.org/2000/svg"
   xmlns:rdf="http://www.w3.org/1999/02/22-rdf-syntax-ns#"
   xmlns:cc="http://creativecommons.org/ns#"
   xmlns:dc="http://purl.org/dc/elements/1.1/">
  <defs
     id="defs4743">
    <linearGradient
       xlink:href="#linearGradient1005"
       id="linearGradient1103"
       gradientUnits="userSpaceOnUse"
       x1="128.81717"
       y1="-97.698288"
       x2="158.51802"
       y2="-127.39915"
       gradientTransform="matrix(-0.03666811,0.05185654,0.03666811,0.05185655,180.12374,169.11601)" />
    <linearGradient
       id="linearGradient1005">
      <stop
         id="stop1001"
         offset="0"
         style="stop-color:#d0bb8e;stop-opacity:1" />
      <stop
         id="stop1003"
         offset="1"
         style="stop-color:#ffffff;stop-opacity:1" />
    </linearGradient>
  </defs>
  <metadata
     id="metadata4746">
    <rdf:RDF>
      <cc:Work
         rdf:about="">
        <dc:format>image/svg+xml</dc:format>
        <dc:type
           rdf:resource="http://purl.org/dc/dcmitype/StillImage" />
      </cc:Work>
    </rdf:RDF>
  </metadata>
  <g
     style="display:inline;opacity:1"
     id="layer2"
     transform="translate(-7680,80.000003)">
    <rect
       style="opacity:1;vector-effect:none;fill:#57e389;fill-opacity:1;stroke:none;stroke-width:2.31269;stroke-linecap:round;stroke-linejoin:miter;stroke-miterlimit:4;stroke-dasharray:none;stroke-dashoffset:0;stroke-opacity:1;marker:none;marker-start:none;marker-mid:none;marker-end:none;paint-order:normal"
       id="rect5316"
       width="360"
       height="360"
       x="7680"
       y="-80" />
  </g>
  <g
     style="opacity:1"
     transform="translate(-7680,6957.4803)"
     id="layer1">
    <g
       transform="matrix(0,6.673475,-6.673475,0,9070.3033,-7933.6153)"
       id="g11720"
       style="display:inline">
      <path
         id="path33901"
         style="font-variation-settings:normal;display:inline;vector-effect:none;fill:#000000;fill-opacity:0.102;stroke:none;stroke-width:0.752933;stroke-linecap:butt;stroke-linejoin:miter;stroke-miterlimit:4;stroke-dasharray:none;stroke-dashoffset:0;stroke-opacity:1;-inkscape-stroke:none;marker:none;marker-start:none;marker-mid:none;marker-end:none;paint-order:normal;enable-background:new;stop-color:#000000"
         d="m 168.8261,202.1978 c 0,0.86115 0.69322,1.55437 1.55437,1.55437 h 0.85986 c 0.0224,0 0.0449,-5.4e-4 0.067,-0.001 0.01,-4.1e-4 0.0195,-8.7e-4 0.0293,-0.001 0.25956,-0.0157 0.50187,-0.0944 0.71119,-0.22126 0.0534,-0.0324 0.10445,-0.0681 0.15336,-0.10653 0.01,-0.008 0.0197,-0.0152 0.0293,-0.0231 0.34521,-0.28465 0.56456,-0.71613 0.56456,-1.20053 v -0.85987 c 0,-0.0787 -0.006,-0.156 -0.017,-0.2315 h 0.017 v -1.32287 h -1.19087 -0.36379 -0.85986 -1.55437 v 1.32287 h 0.017 c -0.0112,0.0755 -0.017,0.1528 -0.017,0.2315 z m 0,-2.41424 1.17331,-0.0105 h 1.63925 l 1.17331,0.0105 v -27.64383 l -1.19585,-1.19585 -0.79694,-0.79724 -0.79723,0.79724 -1.19585,1.19585 z" />
      <path
         style="display:inline;opacity:1;vector-effect:none;fill:url(#linearGradient1103);fill-opacity:1;stroke:none;stroke-width:3.30459;stroke-linecap:round;stroke-linejoin:miter;stroke-miterlimit:4;stroke-dasharray:none;stroke-dashoffset:0;stroke-opacity:1;marker:none;marker-start:none;marker-mid:none;marker-end:none;paint-order:normal;enable-background:new"
         d="m 170.00335,170.12366 -1.99291,1.99292 3.98582,1e-5 z"
         id="path1038" />
      <path
         id="path1042"
         d="m 170.00335,170.12366 -0.79718,0.79717 h 1.59434 z"
         style="display:inline;opacity:1;vector-effect:none;fill:#424048;fill-opacity:1;stroke:none;stroke-width:3.30459;stroke-linecap:round;stroke-linejoin:miter;stroke-miterlimit:4;stroke-dasharray:none;stroke-dashoffset:0;stroke-opacity:1;marker:none;marker-start:none;marker-mid:none;marker-end:none;paint-order:normal;enable-background:new" />
      <path
         id="path1044"
         d="m 171.59767,172.11659 -3.18866,-1e-5 v 27.63326 h 3.18868 z"
         style="display:inline;fill:#f6d32d;fill-opacity:1;stroke:none;stroke-width:0.133995px;stroke-linecap:butt;stroke-linejoin:miter;stroke-opacity:1;enable-background:new" />
      <path
         id="path1046"
         d="m 169.18381,172.11659 -1.17337,-1e-5 -2e-5,27.64384 1.17338,-0.0106 z"
         style="display:inline;opacity:1;fill:#f9f06b;fill-opacity:1;stroke:none;stroke-width:0.0947489px;stroke-linecap:butt;stroke-linejoin:miter;stroke-opacity:1;enable-background:new" />
      <path
         id="path1048"
         d="m 170.82287,172.11659 h 1.17339 v 27.64383 l -1.17339,-0.0106 z"
         style="display:inline;opacity:1;fill:#e5a50a;fill-opacity:1;stroke:none;stroke-width:0.0947489px;stroke-linecap:butt;stroke-linejoin:miter;stroke-opacity:1;enable-background:new" />
      <rect
         ry="1.554427"
         rx="1.554427"
         y="199.76042"
         x="168.01042"
         height="3.9687288"
         width="3.96875"
         id="rect11569"
         style="opacity:1;vector-effect:none;fill:#f66151;fill-opacity:1;stroke:none;stroke-width:0.916541;stroke-linecap:round;stroke-linejoin:miter;stroke-miterlimit:4;stroke-dasharray:none;stroke-dashoffset:0;stroke-opacity:1;marker:none;marker-start:none;marker-mid:none;marker-end:none;paint-order:normal" />
      <path
         style="opacity:1;vector-effect:none;fill:#ed333b;fill-opacity:1;stroke:none;stroke-width:3.46409;stroke-linecap:round;stroke-linejoin:miter;stroke-miterlimit:4;stroke-dasharray:none;stroke-dashoffset:0;stroke-opacity:1;marker:none;marker-start:none;marker-mid:none;marker-end:none;paint-order:normal"
         d="m 640.875,755 c -0.21157,0 -0.41933,0.0116 -0.625,0.0332 2.9582,0.31067 5.25,2.79863 5.25,5.8418 v 3.25 c 0,3.04317 -2.2918,5.52917 -5.25,5.83984 0.20567,0.0216 0.41342,0.0352 0.625,0.0352 h 3.25 c 3.25475,0 5.875,-2.62025 5.875,-5.875 v -3.25 C 650,757.62025 647.37975,755 644.125,755 Z"
         transform="scale(0.26458333)"
         id="rect11573" />
      <rect
         style="opacity:1;vector-effect:none;fill:#f6f5f4;fill-opacity:1;stroke:none;stroke-width:0.529167;stroke-linecap:round;stroke-linejoin:miter;stroke-miterlimit:4;stroke-dasharray:none;stroke-dashoffset:0;stroke-opacity:1;marker:none;marker-start:none;marker-mid:none;marker-end:none;paint-order:normal"
         id="rect11567"
         width="3.96875"
         height="1.3229166"
         x="168.01042"
         y="199.76042"
         rx="0"
         ry="0" />
      <rect
         ry="0"
         rx="0"
         y="199.76042"
         x="170.78854"
         height="1.3229166"
         width="1.1906307"
         id="rect11571"
         style="opacity:1;vector-effect:none;fill:#deddda;fill-opacity:1;stroke:none;stroke-width:0.289837;stroke-linecap:round;stroke-linejoin:miter;stroke-miterlimit:4;stroke-dasharray:none;stroke-dashoffset:0;stroke-opacity:1;marker:none;marker-start:none;marker-mid:none;marker-end:none;paint-order:normal" />
    </g>
    <g
       transform="matrix(0,5.9250624,5.9250624,0,6822.2884,-7731.4)"
       id="g11597"
       style="display:inline;opacity:1">
      <path
         id="rect217-1"
         style="font-variation-settings:normal;opacity:1;vector-effect:none;fill:#000000;fill-opacity:0.102;stroke:none;stroke-width:0.848038;stroke-linecap:butt;stroke-linejoin:miter;stroke-miterlimit:4;stroke-dasharray:none;stroke-dashoffset:0;stroke-opacity:1;marker:none;stop-color:#000000;stop-opacity:1"
         d="m 174.8876,199.15395 v -33.81219 c 0,-0.78051 1.40879,-7.94608 1.40879,-7.94608 h 0.45887 c 0,0 1.40879,7.16557 1.40879,7.94608 v 33.81219 c 0,0.78046 -0.62833,1.40879 -1.40879,1.40879 h -0.45887 c -0.78046,0 -1.40879,-0.62833 -1.40879,-1.40879 z" />
      <rect
         style="opacity:1;vector-effect:none;fill:#1a5fb4;fill-opacity:1;stroke:none;stroke-width:0.529167;stroke-linecap:round;stroke-linejoin:miter;stroke-miterlimit:4;stroke-dasharray:none;stroke-dashoffset:0;stroke-opacity:1;marker:none;marker-start:none;marker-mid:none;marker-end:none;paint-order:normal"
         id="rect11580"
         width="3.4395833"
         height="2.1166666"
         x="173.56667"
         y="198.70209"
         rx="0.46772167"
         ry="0.46772167" />
      <path
         style="opacity:1;vector-effect:none;fill:#1a5fb4;fill-opacity:1;stroke:none;stroke-width:0.982083;stroke-linecap:round;stroke-linejoin:miter;stroke-miterlimit:4;stroke-dasharray:none;stroke-dashoffset:0;stroke-opacity:1;marker:none;marker-start:none;marker-mid:none;marker-end:none;paint-order:normal"
         d="m 174.8049,157.42708 h 0.96312 c 0.0997,0 0.16352,0.0833 0.1799,0.1836 l 1.05833,6.4828 c 0.0426,0.26086 -0.2086,0.47734 -0.46772,0.47734 h -2.50414 c -0.25912,0 -0.5103,-0.21648 -0.46772,-0.47734 l 1.05833,-6.4828 c 0.0164,-0.10032 0.0802,-0.1836 0.1799,-0.1836 z"
         id="rect11582" />
      <rect
         style="opacity:1;vector-effect:none;fill:#ffffff;fill-opacity:1;stroke:none;stroke-width:0.529167;stroke-linecap:round;stroke-linejoin:miter;stroke-miterlimit:4;stroke-dasharray:none;stroke-dashoffset:0;stroke-opacity:1;marker:none;marker-start:none;marker-mid:none;marker-end:none;paint-order:normal"
         id="rect11578"
         width="3.96875"
         height="35.71875"
         x="173.30208"
         y="164.04167" />
      <rect
         style="opacity:1;vector-effect:none;fill:#1a5fb4;fill-opacity:1;stroke:none;stroke-width:0.529167;stroke-linecap:round;stroke-linejoin:miter;stroke-miterlimit:4;stroke-dasharray:none;stroke-dashoffset:0;stroke-opacity:1;marker:none;marker-start:none;marker-mid:none;marker-end:none;paint-order:normal"
         id="rect11585"
         width="0.79374695"
         height="2.3812485"
         x="174.88959"
         y="155.83958"
         rx="0.39687347"
         ry="0.46772248" />
      <rect
         style="opacity:1;vector-effect:none;fill:#ffffff;fill-opacity:1;stroke:none;stroke-width:0.529167;stroke-linecap:round;stroke-linejoin:miter;stroke-miterlimit:4;stroke-dasharray:none;stroke-dashoffset:0;stroke-opacity:1;marker:none;marker-start:none;marker-mid:none;marker-end:none;paint-order:normal"
         id="rect11587"
         width="1.3229166"
         height="1.0583333"
         x="174.625"
         y="156.63333"
         rx="0"
         ry="0" />
      <rect
         y="164.04167"
         x="175.94792"
         height="35.71875"
         width="1.3229121"
         id="rect11589"
         style="opacity:1;vector-effect:none;fill:#f6f5f4;fill-opacity:1;stroke:none;stroke-width:0.305514;stroke-linecap:round;stroke-linejoin:miter;stroke-miterlimit:4;stroke-dasharray:none;stroke-dashoffset:0;stroke-opacity:1;marker:none;marker-start:none;marker-mid:none;marker-end:none;paint-order:normal" />
    </g>
  </g>
</svg>
