<?xml version="1.0" encoding="UTF-8" standalone="no"?>
<svg
   xmlns:dc="http://purl.org/dc/elements/1.1/"
   xmlns:cc="http://creativecommons.org/ns#"
   xmlns:rdf="http://www.w3.org/1999/02/22-rdf-syntax-ns#"
   xmlns:svg="http://www.w3.org/2000/svg"
   xmlns="http://www.w3.org/2000/svg"
   xmlns:xlink="http://www.w3.org/1999/xlink"
   xmlns:sodipodi="http://sodipodi.sourceforge.net/DTD/sodipodi-0.dtd"
   xmlns:inkscape="http://www.inkscape.org/namespaces/inkscape"
   version="1.1"
   id="svg293"
   width="512"
   height="512"
   viewBox="0 0 512.00002 512"
   sodipodi:docname="alldone.svg"
   inkscape:version="1.0.2 (e86c870879, 2021-01-15)"
   inkscape:export-filename="/var/home/jimmac/SparkleShare/app-illustrations/experiment/todo/todo-paperplane.png"
   inkscape:export-xdpi="96"
   inkscape:export-ydpi="96">
  <metadata
     id="metadata299">
    <rdf:RDF>
      <cc:Work
         rdf:about="">
        <dc:format>image/svg+xml</dc:format>
        <dc:type
           rdf:resource="http://purl.org/dc/dcmitype/StillImage" />
        <dc:title></dc:title>
      </cc:Work>
    </rdf:RDF>
  </metadata>
  <defs
     id="defs297">
    <linearGradient
       inkscape:collect="always"
       id="linearGradient1238">
      <stop
         style="stop-color:#99c1f1;stop-opacity:1;"
         offset="0"
         id="stop1234" />
      <stop
         style="stop-color:#99c1f1;stop-opacity:0;"
         offset="1"
         id="stop1236" />
    </linearGradient>
    <inkscape:path-effect
       effect="spiro"
       id="path-effect1232"
       is_visible="true"
       lpeversion="1" />
    <inkscape:path-effect
       effect="fillet_chamfer"
       id="path-effect603"
       is_visible="true"
       lpeversion="1"
       satellites_param="F,0,1,1,0,29.342629,0,1 @ F,0,1,1,0,29.342629,0,1 @ F,0,1,1,0,29.342629,0,1 @ F,0,0,1,0,29.342629,0,1 @ F,0,1,1,0,29.342629,0,1 @ F,0,1,1,0,29.342629,0,1 @ F,0,0,1,0,13,0,1 @ F,0,0,1,0,13,0,1"
       unit="px"
       method="auto"
       mode="F"
       radius="13"
       chamfer_steps="1"
       flexible="false"
       use_knot_distance="true"
       apply_no_radius="true"
       apply_with_radius="true"
       only_selected="false"
       hide_knots="false" />
    <inkscape:path-effect
       effect="fillet_chamfer"
       id="path-effect1212"
       is_visible="true"
       lpeversion="1"
       satellites_param="F,0,1,1,0,29.342629,0,1 @ F,0,1,1,0,29.342629,0,1 @ F,0,1,1,0,29.342629,0,1 @ F,0,0,1,0,29.342629,0,1 @ F,0,1,1,0,29.342629,0,1 @ F,0,1,1,0,29.342629,0,1 @ F,0,0,1,0,13,0,1 @ F,0,0,1,0,13,0,1"
       unit="px"
       method="auto"
       mode="F"
       radius="13"
       chamfer_steps="1"
       flexible="false"
       use_knot_distance="true"
       apply_no_radius="true"
       apply_with_radius="true"
       only_selected="false"
       hide_knots="false" />
    <rect
       x="4.3671875"
       y="405.60156"
       width="293.75391"
       height="157.21484"
       id="rect1230" />
    <rect
       x="4.3671875"
       y="405.60156"
       width="293.75391"
       height="157.21484"
       id="rect409" />
    <rect
       x="4.3671875"
       y="405.60156"
       width="293.75391"
       height="157.21484"
       id="rect1230-3" />
    <rect
       x="4.3671875"
       y="405.60156"
       width="293.75391"
       height="157.21484"
       id="rect523" />
    <filter
       height="1.3"
       width="1.3"
       y="-0.15000001"
       x="-0.15000001"
       inkscape:menu-tooltip="Van Gogh painting effect for bitmaps"
       inkscape:menu="Distort"
       inkscape:label="Pixel Smear"
       style="color-interpolation-filters:sRGB"
       id="filter1342">
      <feTurbulence
         type="fractalNoise"
         numOctaves="3"
         baseFrequency="0.25 0.4"
         seed="5"
         id="feTurbulence1324" />
      <feColorMatrix
         result="result5"
         values="1 0 0 0 0 0 1 0 0 0 0 0 1 0 0 0 0 0 1 0 "
         id="feColorMatrix1326" />
      <feComposite
         in="SourceGraphic"
         operator="in"
         in2="result5"
         id="feComposite1328" />
      <feMorphology
         operator="dilate"
         radius="0.58216698841698833"
         result="result3"
         id="feMorphology1330" />
      <feTurbulence
         numOctaves="5"
         baseFrequency="0.25986365830115832"
         type="fractalNoise"
         seed="7"
         id="feTurbulence1332" />
      <feGaussianBlur
         stdDeviation="0.85210328125000001"
         result="result91"
         id="feGaussianBlur1334" />
      <feDisplacementMap
         in="result3"
         xChannelSelector="R"
         yChannelSelector="G"
         scale="7.5210619"
         result="result4"
         in2="result91"
         id="feDisplacementMap1336" />
      <feComposite
         in="result4"
         k3="0.8"
         k1="1.3"
         result="result2"
         operator="arithmetic"
         in2="result4"
         id="feComposite1338"
         k2="0"
         k4="0" />
      <feBlend
         in2="result2"
         mode="screen"
         in="result2"
         id="feBlend1340" />
    </filter>
    <linearGradient
       id="a-3"
       gradientTransform="matrix(0.707107,0.707107,0.707107,-0.707107,2,-170)"
       gradientUnits="userSpaceOnUse"
       x1="188.44394"
       x2="261.09912"
       y1="-77.78183"
       y2="-150.43706">
      <stop
         offset="0"
         stop-color="#f6d32d"
         id="stop2-6" />
      <stop
         offset="1"
         stop-color="#f5c211"
         id="stop4-7" />
    </linearGradient>
    <radialGradient
       id="b"
       cx="280.9942"
       cy="488.84842"
       gradientTransform="matrix(0.347005,0,0,0.342234,-31.50647,-127.48206)"
       gradientUnits="userSpaceOnUse"
       r="224">
      <stop
         offset="0"
         stop-color="#fdfacf"
         id="stop7" />
      <stop
         offset="0.4"
         stop-color="#f9f06b"
         id="stop9" />
      <stop
         offset="1"
         stop-color="#f6d32d"
         id="stop11" />
    </radialGradient>
    <linearGradient
       gradientTransform="translate(7.160156,10.0625)"
       id="a"
       gradientUnits="userSpaceOnUse"
       x1="63.58112"
       x2="63.58112"
       y1="72.502037"
       y2="41.887589">
      <stop
         offset="0"
         stop-color="#eef4fc"
         id="stop2" />
      <stop
         offset="1"
         stop-color="#ffffff"
         id="stop4" />
    </linearGradient>
    <radialGradient
       id="radialGradient387"
       cx="280.9942"
       cy="488.84842"
       gradientTransform="matrix(0.347005,0,0,0.342234,-31.50647,-127.48206)"
       gradientUnits="userSpaceOnUse"
       r="224">
      <stop
         offset="0"
         stop-color="#fdfacf"
         id="stop381" />
      <stop
         offset="0.4"
         stop-color="#f9f06b"
         id="stop383" />
      <stop
         offset="1"
         stop-color="#f6d32d"
         id="stop385" />
    </radialGradient>
    <linearGradient
       inkscape:collect="always"
       xlink:href="#linearGradient1238"
       id="linearGradient1240"
       x1="787.16028"
       y1="530.00653"
       x2="843.89966"
       y2="485.81778"
       gradientUnits="userSpaceOnUse"
       gradientTransform="matrix(1.2647728,0,0,1.2647728,-726.01688,-354.38654)" />
    <linearGradient
       xlink:href="#h"
       id="i"
       x1="342.914"
       y1="17.349001"
       x2="342.914"
       y2="201.142"
       gradientUnits="userSpaceOnUse"
       gradientTransform="matrix(0.63944214,0,0,0.63944214,702.74465,449.74733)" />
    <linearGradient
       id="h">
      <stop
         offset="0"
         stop-color="#051224"
         id="stop2-3" />
      <stop
         offset="1"
         stop-color="#3584e4"
         id="stop4-6" />
    </linearGradient>
    <linearGradient
       xlink:href="#linearGradient3161-7"
       id="linearGradient4128-9"
       gradientUnits="userSpaceOnUse"
       gradientTransform="matrix(0.28127836,0,0,0.28127836,147.37964,84.797696)"
       x1="1275.7029"
       y1="760"
       x2="281.12207"
       y2="760" />
    <linearGradient
       id="linearGradient3161-7">
      <stop
         style="stop-color:#1c71d8;stop-opacity:1"
         offset="0"
         id="stop3157-7" />
      <stop
         style="stop-color:#33d17a;stop-opacity:1"
         offset="1"
         id="stop3159-6" />
    </linearGradient>
  </defs>
  <sodipodi:namedview
     pagecolor="#ffffff"
     bordercolor="#666666"
     borderopacity="1"
     objecttolerance="10"
     gridtolerance="10"
     guidetolerance="10"
     inkscape:pageopacity="0"
     inkscape:pageshadow="2"
     inkscape:window-width="640"
     inkscape:window-height="480"
     id="namedview295"
     showgrid="false"
     inkscape:current-layer="layer1"
     inkscape:document-rotation="0"
     inkscape:showpageshadow="false"
     borderlayer="true">
    <inkscape:grid
       type="xygrid"
       id="grid37" />
  </sodipodi:namedview>
  <g
     inkscape:groupmode="layer"
     id="layer1"
     inkscape:label="vectors">
    <g
       id="g159"
       transform="translate(1011.5645,134.18033)" />
    <path
       id="rect1722-1"
       style="fill:url(#linearGradient4128-9);fill-opacity:1;stroke:none;stroke-width:2.52953;stroke-opacity:0.956856;stop-color:#000000"
       d="m 265.38464,152.64173 v 0.5254 c 0,18.16508 14.72571,32.89078 32.89079,32.89078 h 16.82826 c 4.14255,0 7.50074,3.35821 7.50074,7.50076 v 3.07503 c 0,4.14255 -3.35819,7.50076 -7.50074,7.50076 H 185.89598 c -18.16507,0 -32.89077,14.72571 -32.89078,32.89078 v 0.52539 c 0,18.16508 14.7257,32.89078 32.89078,32.8908 h 95.93471 c 4.14255,0 7.50076,3.3582 7.50076,7.50074 v 1.87519 c 0,4.14256 -3.3582,7.50076 -7.50076,7.50076 h -4.05042 c -18.16508,0 -32.89081,14.72572 -32.89081,32.8908 v 0.52539 c 0,18.16508 14.72573,32.89079 32.89081,32.89079 h 140.80068 c 18.16509,0 32.8908,-14.7257 32.8908,-32.89078 v -0.5254 c 0,-18.16508 -14.72571,-32.8908 -32.8908,-32.8908 H 401.8428 c -4.14256,0 -7.50076,-3.3582 -7.50076,-7.50076 v -1.87519 c 0,-4.14254 3.35821,-7.50074 7.50076,-7.50074 h 74.55754 c 18.16509,-2e-5 32.89079,-14.72572 32.89079,-32.8908 v -0.52539 c -2e-5,-18.16507 -14.72572,-32.89077 -32.89079,-32.89078 h -19.97352 c -4.97993,0 -9.01694,-4.03703 -9.01693,-9.01696 v -0.0428 c 0,-4.9799 4.03703,-9.01692 9.01693,-9.01692 h 6.84719 c 18.16509,0 32.8908,-14.72572 32.8908,-32.8908 v -0.52538 c -3e-5,-18.16507 -14.72573,-32.89076 -32.8908,-32.89076 H 298.27543 c -18.16508,0 -32.89079,14.7257 -32.89079,32.89079 z"
       sodipodi:nodetypes="cssssssssssssssssssssssssssssssssssssssssc" />
    <path
       style="fill:none;stroke:url(#linearGradient1240);stroke-width:7.58864;stroke-linecap:round;stroke-linejoin:miter;stroke-miterlimit:4;stroke-dasharray:7.58864, 30.3545;stroke-dashoffset:0;stroke-opacity:1"
       d="m 349.86935,243.70404 c 7.95728,30.54753 5.24361,63.76578 -7.56607,92.61681 -11.57093,26.06103 -31.17689,48.37078 -55.1275,63.84437 -23.95061,15.4736 -52.12805,24.14747 -80.60552,25.59568 -19.13562,0.97314 -38.61969,-1.31107 -56.40768,-8.4319 -17.788,-7.12084 -33.8116,-19.27754 -43.98655,-35.51298 -10.17495,-16.23543 -14.109219,-36.64411 -9.017865,-55.11563 2.545677,-9.23576 7.287265,-17.88628 13.872105,-24.84471 6.58483,-6.95842 15.01683,-12.19347 24.23843,-14.78997 9.03819,-2.54486 18.77911,-2.52976 27.81583,0.0203 9.03672,2.5501 17.34347,7.62496 23.75424,14.48552 6.41076,6.86057 10.90948,15.48552 12.89025,24.66385 1.98077,9.17833 1.4409,18.88452 -1.52305,27.79408 -4.86231,14.616 -16.13416,26.66275 -29.69587,33.96681 -13.56172,7.30407 -29.25757,10.10101 -44.65402,9.63326 C 87.833039,396.53517 52.850731,377.03142 32.981127,346.9639 13.111523,316.89637 8.8852452,277.06803 22.002355,243.50021"
       id="path1230"
       sodipodi:nodetypes="csssssc"
       inkscape:original-d="m 349.86935,243.70404 c 0,0 -0.21353,59.54282 -7.56607,92.61681 -7.35258,33.07398 -87.97148,83.4917 -135.73302,89.44005 C 114.4626,437.23224 94.054889,290.73157 135.2687,287.06571 c 41.21381,-3.66586 72.04264,51.34681 62.93727,66.96379 -9.10538,15.61697 -38.48664,51.16401 -74.34989,43.60007 C 87.992882,390.06564 22.002355,243.50021 22.002355,243.50021"
       inkscape:path-effect="#path-effect1232" />
    <g
       id="g85"
       transform="matrix(1.9987357,0,0,1.9987357,-101.72089,-15.406636)">
      <path
         id="path4018"
         style="fill:#000000;fill-opacity:0.177083;stroke:none;stroke-width:0.999999px;stroke-linecap:butt;stroke-linejoin:miter;stroke-opacity:1"
         d="m 498.19066,60.320947 -100.9766,79.855473 40.5742,15.17577 8.5117,27.12892 9.7715,-20.29102 39.7227,14.85546 z" />
      <g
         id="g3999"
         transform="matrix(0.73717951,0,0,0.73717951,-179.19544,-190.71946)"
         style="stroke-width:1.35652">
        <path
           style="fill:#ffffff;fill-opacity:1;stroke:none;stroke-width:1.35652px;stroke-linecap:butt;stroke-linejoin:miter;stroke-opacity:1"
           d="m 918.91708,335.21206 -136.97562,108.32539 133.72633,50.0148 z"
           id="path1206" />
        <path
           style="fill:#d3d3d3;fill-opacity:1;stroke:none;stroke-width:1.35652px;stroke-linecap:butt;stroke-linejoin:miter;stroke-opacity:1"
           d="M 918.91708,335.21206 836.9517,464.02763 848.52684,500.92524 848.0273,468.1991 Z"
           id="path1208"
           sodipodi:nodetypes="ccccc" />
        <path
           style="fill:#f6f5f4;fill-opacity:1;stroke:none;stroke-width:1.35652px;stroke-linecap:butt;stroke-linejoin:miter;stroke-opacity:1"
           d="M 848.52684,500.92524 861.80528,473.35545 848.0273,468.1991 Z"
           id="path1228"
           sodipodi:nodetypes="cccc" />
      </g>
    </g>
    <g
       id="g4024"
       transform="matrix(0.73717951,0,0,0.73717951,489.50632,130.70123)"
       style="stroke-width:1.35652" />
    <path
       id="path4077"
       style="display:inline;fill:#000000;fill-opacity:0.143433;stroke:none;stroke-width:1.26477px;stroke-linecap:butt;stroke-linejoin:miter;stroke-opacity:1;enable-background:new"
       d="M 350.20244,91.407606 244.32219,253.4764 h 91.76273 l 14.11752,32.41474 14.11753,-32.41474 h 91.76272 z" />
    <g
       style="display:inline;stroke-width:0.747876;enable-background:new"
       id="g2376"
       transform="matrix(1.764671,0,0,1.620696,731.37153,-198.89482)">
      <path
         sodipodi:nodetypes="cccc"
         inkscape:connector-curvature="0"
         id="path2355"
         d="m -216,176 60,100 h -120 z"
         style="fill:#f6f5f4;stroke:none;stroke-width:0.747876px;stroke-linecap:butt;stroke-linejoin:miter;stroke-opacity:1" />
      <path
         style="fill:#ffffff;stroke:none;stroke-width:0.747876px;stroke-linecap:butt;stroke-linejoin:miter;stroke-opacity:1"
         d="M -216,177.50504 V 296 l -8,-20 c 2.01052,-32.89397 5.09949,-65.68473 8,-98.49496 z"
         id="path2365"
         inkscape:connector-curvature="0"
         sodipodi:nodetypes="cccc" />
      <path
         inkscape:connector-curvature="0"
         id="path2367"
         d="M -216,177.50504 V 296 l 8,-20 c 0,0 -4.96963,-65.6956 -8,-98.49496 z"
         style="fill:#deddda;stroke:none;stroke-width:0.747876px;stroke-linecap:butt;stroke-linejoin:miter;stroke-opacity:1"
         sodipodi:nodetypes="cccc" />
    </g>
    <g
       style="display:inline;stroke-width:0.747876;enable-background:new"
       id="g4083"
       transform="matrix(1.3952474,0,0,1.2814128,1232.6833,109.73281)" />
  </g>
</svg>
