<?xml version="1.0" encoding="UTF-8" standalone="no"?>
<svg
   xmlns:dc="http://purl.org/dc/elements/1.1/"
   xmlns:cc="http://creativecommons.org/ns#"
   xmlns:rdf="http://www.w3.org/1999/02/22-rdf-syntax-ns#"
   xmlns:svg="http://www.w3.org/2000/svg"
   xmlns="http://www.w3.org/2000/svg"
   xmlns:sodipodi="http://sodipodi.sourceforge.net/DTD/sodipodi-0.dtd"
   xmlns:inkscape="http://www.inkscape.org/namespaces/inkscape"
   inkscape:version="1.0.2 (e86c870879, 2021-01-15)"
   id="svg8"
   version="1.1"
   viewBox="0 0 800 150"
   height="150"
   width="800"
   sodipodi:docname="hig-symbolic-inversion.svg">
  <defs
     id="defs2">
    <marker
       style="overflow:visible"
       id="TriangleInM"
       refX="0"
       refY="0"
       orient="auto"
       inkscape:stockid="TriangleInM"
       inkscape:isstock="true">
      <path
         transform="scale(-0.4)"
         style="fill:#1a5fb4;fill-opacity:1;fill-rule:evenodd;stroke:#1a5fb4;stroke-width:1pt;stroke-opacity:1"
         d="M 5.77,0 -2.88,5 V -5 Z"
         id="path4327" />
    </marker>
    <marker
       style="overflow:visible"
       id="TriangleOutM"
       refX="0"
       refY="0"
       orient="auto"
       inkscape:stockid="TriangleOutM"
       inkscape:isstock="true">
      <path
         transform="scale(0.4)"
         style="fill:#1a5fb4;fill-opacity:1;fill-rule:evenodd;stroke:#1a5fb4;stroke-width:1pt;stroke-opacity:1"
         d="M 5.77,0 -2.88,5 V -5 Z"
         id="path4336" />
    </marker>
    <clipPath
       clipPathUnits="userSpaceOnUse"
       id="clipPath984">
      <circle
         style="font-variation-settings:normal;display:block;opacity:1;vector-effect:none;fill:#77767b;fill-opacity:1;stroke:none;stroke-width:5.04302;stroke-linecap:round;stroke-linejoin:miter;stroke-miterlimit:4;stroke-dasharray:none;stroke-dashoffset:0;stroke-opacity:1;marker:none;marker-start:none;marker-mid:none;marker-end:none;paint-order:normal;stop-color:#000000;stop-opacity:1"
         id="circle986"
         cx="541.88373"
         cy="647.72638"
         r="73.975525" />
    </clipPath>
    <inkscape:path-effect
       effect="powerclip"
       id="path-effect988"
       is_visible="true"
       lpeversion="1"
       inverse="true"
       flatten="false"
       hide_clip="false"
       message="m 125,653 v -2 c 0,-1 -1,-1 -1,-1 h -8 c 0,0 -1,0 -1,1 v 10 c 0,1 1,1 1,1 h 8 c 1,0 1,-1 1,-1 v -2" />
    <inkscape:path-effect
       effect="fillet_chamfer"
       id="path-effect259"
       is_visible="true"
       lpeversion="1"
       satellites_param="F,0,0,1,0,8,0,1 @ F,0,0,1,0,8,0,1 @ F,0,0,1,0,8,0,1 @ F,0,0,1,0,8,0,1"
       unit="px"
       method="auto"
       mode="F"
       radius="8"
       chamfer_steps="1"
       flexible="false"
       use_knot_distance="true"
       apply_no_radius="true"
       apply_with_radius="true"
       only_selected="false"
       hide_knots="false" />
    <marker
       id="o"
       refX="0"
       refY="0"
       orient="auto"
       overflow="visible">
      <path
         d="m -2.308,0 3.46,-2 v 4 z"
         fill="#ffffff"
         fill-rule="evenodd"
         stroke="#ffffff"
         stroke-width="0.4pt"
         id="path44" />
    </marker>
    <marker
       id="p"
       refX="0"
       refY="0"
       orient="auto"
       overflow="visible">
      <path
         d="m 2.308,0 -3.46,2 v -4 z"
         fill="#ffffff"
         fill-rule="evenodd"
         stroke="#ffffff"
         stroke-width="0.4pt"
         id="path47" />
    </marker>
    <marker
       id="q"
       refX="0"
       refY="0"
       orient="auto"
       overflow="visible">
      <path
         d="m 2.308,0 -3.46,2 v -4 z"
         fill="#ffffff"
         fill-rule="evenodd"
         stroke="#ffffff"
         stroke-width="0.4pt"
         id="path50" />
    </marker>
    <marker
       id="r"
       refX="0"
       refY="0"
       orient="auto"
       overflow="visible">
      <path
         d="m 2.308,0 -3.46,2 v -4 z"
         fill="#ffffff"
         fill-rule="evenodd"
         stroke="#ffffff"
         stroke-width="0.4pt"
         id="path53" />
    </marker>
    <marker
       id="s"
       refX="0"
       refY="0"
       orient="auto"
       overflow="visible">
      <path
         d="m 2.308,0 -3.46,2 v -4 z"
         fill="#ffffff"
         fill-rule="evenodd"
         stroke="#ffffff"
         stroke-width="0.4pt"
         id="path56" />
    </marker>
    <marker
       id="t"
       refX="0"
       refY="0"
       orient="auto"
       overflow="visible">
      <path
         d="m 2.308,0 -3.46,2 v -4 z"
         fill="#ffffff"
         fill-rule="evenodd"
         stroke="#ffffff"
         stroke-width="0.4pt"
         id="path59" />
    </marker>
    <marker
       id="u"
       refX="0"
       refY="0"
       orient="auto"
       overflow="visible">
      <path
         d="m -2.308,0 3.46,-2 v 4 z"
         fill="#ffffff"
         fill-rule="evenodd"
         stroke="#ffffff"
         stroke-width="0.4pt"
         id="path62" />
    </marker>
    <marker
       id="v"
       refX="0"
       refY="0"
       orient="auto"
       overflow="visible">
      <path
         d="m 2.308,0 -3.46,2 v -4 z"
         fill="#ffffff"
         fill-rule="evenodd"
         stroke="#ffffff"
         stroke-width="0.4pt"
         id="path65" />
    </marker>
    <marker
       id="w"
       refX="0"
       refY="0"
       orient="auto"
       overflow="visible">
      <path
         d="m -2.308,0 3.46,-2 v 4 z"
         fill="#ffffff"
         fill-rule="evenodd"
         stroke="#ffffff"
         stroke-width="0.4pt"
         id="path68" />
    </marker>
    <marker
       id="x"
       refX="0"
       refY="0"
       orient="auto"
       overflow="visible">
      <path
         d="m 2.308,0 -3.46,2 v -4 z"
         fill="#ffffff"
         fill-rule="evenodd"
         stroke="#ffffff"
         stroke-width="0.4pt"
         id="path71" />
    </marker>
    <marker
       id="y"
       refX="0"
       refY="0"
       orient="auto"
       overflow="visible">
      <path
         d="m -2.308,0 3.46,-2 v 4 z"
         fill="#ffffff"
         fill-rule="evenodd"
         stroke="#ffffff"
         stroke-width="0.4pt"
         id="path74" />
    </marker>
    <marker
       id="z"
       refX="0"
       refY="0"
       orient="auto"
       overflow="visible">
      <path
         d="m 2.308,0 -3.46,2 v -4 z"
         fill="#ffffff"
         fill-rule="evenodd"
         stroke="#ffffff"
         stroke-width="0.4pt"
         id="path77" />
    </marker>
  </defs>
  <sodipodi:namedview
     units="px"
     borderlayer="true"
     inkscape:showpageshadow="false"
     showgrid="true"
     inkscape:document-rotation="0"
     inkscape:current-layer="layer1"
     inkscape:document-units="px"
     inkscape:cy="560"
     inkscape:cx="400"
     inkscape:zoom="0.35"
     inkscape:pageshadow="2"
     inkscape:pageopacity="0"
     borderopacity="1"
     bordercolor="#383838"
     pagecolor="#ffffff"
     id="base"
     showguides="true"
     inkscape:guide-bbox="true"
     inkscape:snap-global="true"
     inkscape:object-nodes="false"
     inkscape:snap-bbox="true"
     inkscape:snap-bbox-midpoints="true"
     inkscape:bbox-nodes="true"
     inkscape:bbox-paths="true">
    <sodipodi:guide
       position="466,96"
       orientation="0,-1"
       id="guide3203" />
    <sodipodi:guide
       position="98.772321,-385.70313"
       orientation="1,0"
       id="guide3205" />
    <sodipodi:guide
       position="1232,974"
       orientation="0,-1"
       id="guide3209" />
    <inkscape:grid
       type="xygrid"
       id="grid3335" />
    <sodipodi:guide
       position="1040,555"
       orientation="1,0"
       id="guide9669" />
    <sodipodi:guide
       position="1821.5071,-57.027703"
       orientation="1,0"
       id="guide162" />
  </sodipodi:namedview>
  <metadata
     id="metadata5">
    <rdf:RDF>
      <cc:Work
         rdf:about="">
        <dc:format>image/svg+xml</dc:format>
        <dc:type
           rdf:resource="http://purl.org/dc/dcmitype/StillImage" />
        <dc:title></dc:title>
        <cc:license
           rdf:resource="http://creativecommons.org/licenses/by-sa/4.0/" />
      </cc:Work>
      <cc:License
         rdf:about="http://creativecommons.org/licenses/by-sa/4.0/">
        <cc:permits
           rdf:resource="http://creativecommons.org/ns#Reproduction" />
        <cc:permits
           rdf:resource="http://creativecommons.org/ns#Distribution" />
        <cc:requires
           rdf:resource="http://creativecommons.org/ns#Notice" />
        <cc:requires
           rdf:resource="http://creativecommons.org/ns#Attribution" />
        <cc:permits
           rdf:resource="http://creativecommons.org/ns#DerivativeWorks" />
        <cc:requires
           rdf:resource="http://creativecommons.org/ns#ShareAlike" />
      </cc:License>
    </rdf:RDF>
  </metadata>
  <g
     id="layer1"
     inkscape:groupmode="layer"
     inkscape:label="Layer 1">
    <g
       id="g11190"
       transform="matrix(1.0681961,0,0,1.0681961,41.297693,1314.1079)"
       style="display:inline;enable-background:new" />
    <rect
       style="color:#000000;display:inline;overflow:visible;visibility:visible;fill:#2e3436;fill-opacity:1;fill-rule:nonzero;stroke:none;stroke-width:0.201941;marker:none;enable-background:accumulate"
       id="rect5888"
       width="64"
       height="64"
       x="566"
       y="24.999992" />
    <g
       transform="matrix(2.5,0,0,2.5,140,-1107.5)"
       inkscape:label="emblem-ok"
       id="g9602-3"
       style="display:inline;enable-background:new">
      <rect
         style="color:#bebebe;display:inline;overflow:visible;visibility:visible;fill:none;stroke:none;stroke-width:1;marker:none"
         id="rect9604-6"
         width="16"
         height="16"
         x="160"
         y="487" />
      <path
         style="color:#000000;font-style:normal;font-variant:normal;font-weight:normal;font-stretch:normal;font-size:medium;line-height:normal;font-family:Sans;-inkscape-font-specification:Sans;text-indent:0;text-align:start;text-decoration:none;text-decoration-line:none;letter-spacing:normal;word-spacing:normal;text-transform:none;writing-mode:lr-tb;direction:ltr;baseline-shift:baseline;text-anchor:start;display:inline;overflow:visible;visibility:visible;fill:#26a269;fill-opacity:1;stroke:none;stroke-width:3;marker:none;enable-background:accumulate"
         d="m 173.5,492 -1,-1 -4.99995,5 -2.5,-2.5 -2,2 4.5,4.5 7,-7 z"
         id="path8913-6-7-1-5-1-5"
         inkscape:connector-curvature="0"
         sodipodi:nodetypes="cccccccc" />
    </g>
    <g
       transform="matrix(4,0,0,4,401,-1079)"
       id="g11537"
       inkscape:label="camera-photo"
       style="display:inline;enable-background:new">
      <rect
         y="276"
         x="20"
         height="16"
         width="16"
         id="rect11539"
         style="color:#bebebe;display:inline;overflow:visible;visibility:visible;fill:none;stroke:none;stroke-width:1;marker:none" />
      <path
         style="color:#bebebe;display:inline;overflow:visible;visibility:visible;fill:#2e3436;fill-opacity:1;fill-rule:nonzero;stroke:none;stroke-width:3;marker:none;enable-background:accumulate"
         d="m 26,278 c -0.549959,0 -1,0.45004 -1,1 v 1 h -3 c -0.552014,0 -1,0.45004 -1,1 v 8 c 0,0.54996 0.447986,1 1,1 h 12 c 0.552014,0 1,-0.45004 1,-1 v -8 c 0,-0.54996 -0.447986,-1 -1,-1 h -3 v -1 c 0,-0.54996 -0.450041,-1 -1,-1 z m 2,3 c 2.209139,0 4,1.79086 4,4 0,2.20914 -1.790861,4 -4,4 -2.209139,0 -4,-1.79086 -4,-4 0,-2.20914 1.790861,-4 4,-4 z m 0,2 c -1.10457,0 -2,0.89543 -2,2 0,1.10457 0.89543,2 2,2 1.10457,0 2,-0.89543 2,-2 0,-1.10457 -0.89543,-2 -2,-2 z"
         id="rect5238"
         inkscape:connector-curvature="0" />
    </g>
    <g
       transform="matrix(4,0,0,4,486,-1079)"
       id="g5894"
       inkscape:label="camera-photo"
       style="display:inline;enable-background:new">
      <rect
         y="276"
         x="20"
         height="16"
         width="16"
         id="rect5890"
         style="color:#bebebe;display:inline;overflow:visible;visibility:visible;fill:none;stroke:none;stroke-width:1;marker:none" />
      <path
         style="color:#bebebe;display:inline;overflow:visible;visibility:visible;fill:#ffffff;fill-opacity:1;fill-rule:nonzero;stroke:none;stroke-width:3;marker:none;enable-background:accumulate"
         d="m 26,278 c -0.549959,0 -1,0.45004 -1,1 v 1 h -3 c -0.552014,0 -1,0.45004 -1,1 v 8 c 0,0.54996 0.447986,1 1,1 h 12 c 0.552014,0 1,-0.45004 1,-1 v -8 c 0,-0.54996 -0.447986,-1 -1,-1 h -3 v -1 c 0,-0.54996 -0.450041,-1 -1,-1 z m 2,3 c 2.209139,0 4,1.79086 4,4 0,2.20914 -1.790861,4 -4,4 -2.209139,0 -4,-1.79086 -4,-4 0,-2.20914 1.790861,-4 4,-4 z m 0,2 c -1.10457,0 -2,0.89543 -2,2 0,1.10457 0.89543,2 2,2 1.10457,0 2,-0.89543 2,-2 0,-1.10457 -0.89543,-2 -2,-2 z"
         id="path5892"
         inkscape:connector-curvature="0" />
    </g>
    <rect
       style="color:#000000;display:inline;overflow:visible;visibility:visible;fill:#2e3436;fill-opacity:1;fill-rule:nonzero;stroke:none;stroke-width:0.201941;marker:none;enable-background:accumulate"
       id="rect5915"
       width="64"
       height="64"
       x="211.96599"
       y="24.999992" />
    <rect
       y="25"
       x="126.966"
       height="64"
       width="64"
       id="rect5917"
       style="color:#bebebe;display:inline;overflow:visible;visibility:visible;fill:none;stroke:none;stroke-width:4;marker:none" />
    <path
       id="path5919"
       style="color:#bebebe;display:inline;overflow:visible;visibility:visible;fill:#2e3436;fill-opacity:1;fill-rule:nonzero;stroke:none;stroke-width:12;marker:none;enable-background:accumulate"
       d="M 150.9668 33 C 148.76697 33 146.9668 34.80016 146.9668 37 L 146.9668 41 L 134.9668 41 C 132.75875 41 130.9668 42.80016 130.9668 45 L 130.9668 77 C 130.9668 79.19984 132.75875 81 134.9668 81 L 182.9668 81 C 185.17486 81 186.9668 79.19984 186.9668 77 L 186.9668 45 C 186.9668 42.80016 185.17486 41 182.9668 41 L 170.9668 41 L 170.9668 37 C 170.9668 34.80016 169.16664 33 166.9668 33 L 150.9668 33 z M 158.9668 45 C 167.80336 45 174.9668 52.16344 174.9668 61 C 174.9668 69.83656 167.80336 77 158.9668 77 C 150.13025 77 142.9668 69.83656 142.9668 61 C 142.9668 52.16344 150.13025 45 158.9668 45 z M 158.9668 49 C 152.33938 49 146.9668 54.37256 146.9668 61 C 146.9668 67.62744 152.33938 73 158.9668 73 C 165.59422 73 170.9668 67.62744 170.9668 61 C 170.9668 54.37256 165.59422 49 158.9668 49 z M 162.5 55 A 2.5 2.5 0 0 1 165 57.5 A 2.5 2.5 0 0 1 162.5 60 A 2.5 2.5 0 0 1 160 57.5 A 2.5 2.5 0 0 1 162.5 55 z " />
    <g
       transform="matrix(4,0,0,4,131.966,-1059)"
       id="g5927"
       inkscape:label="camera-photo"
       style="display:inline;enable-background:new" />
    <g
       transform="matrix(-2.031242,0,0,2.031242,665.59831,-1363.2246)"
       style="display:inline;enable-background:new"
       id="g6995"
       inkscape:label="action-unavailable">
      <rect
         ry="0.15129246"
         rx="0.14408804"
         y="727"
         x="221.00015"
         height="16"
         width="16"
         id="rect4218"
         style="color:#bebebe;display:inline;overflow:visible;visibility:visible;fill:none;stroke:none;stroke-width:1;marker:none" />
      <path
         inkscape:connector-curvature="0"
         style="color:#000000;font-style:normal;font-variant:normal;font-weight:normal;font-stretch:normal;line-height:normal;font-family:Sans;-inkscape-font-specification:Sans;text-indent:0;text-align:start;text-decoration:none;text-decoration-line:none;letter-spacing:normal;word-spacing:normal;text-transform:none;writing-mode:lr-tb;direction:ltr;baseline-shift:baseline;text-anchor:start;display:inline;overflow:visible;visibility:visible;fill:#e01b24;fill-opacity:1;stroke:none;stroke-width:2;marker:none;enable-background:accumulate"
         d="m 229.0002,728 c -3.86295,0 -7,3.13704 -7,7 0,3.86295 3.13705,7 7,7 3.86295,0 7,-3.13705 7,-7 0,-3.86296 -3.13705,-7 -7,-7 z m 0,2 c 1.01943,0 1.95898,0.28763 2.75,0.8125 l -6.9375,6.9375 c -0.52487,-0.79102 -0.8125,-1.73057 -0.8125,-2.75 0,-2.75926 2.24075,-5 5,-5 z m 4.1875,2.25 c 0.52487,0.79102 0.8125,1.73057 0.8125,2.75 0,2.75925 -2.24075,5 -5,5 -1.01943,0 -1.95898,-0.28763 -2.75,-0.8125 z"
         id="path4992" />
    </g>
    <path
       id="path5919-3"
       style="color:#bebebe;display:inline;overflow:visible;visibility:visible;fill:#ffffff;fill-opacity:1;fill-rule:nonzero;stroke:none;stroke-width:12;marker:none;enable-background:accumulate"
       d="m 235.93935,33 c -2.19983,0 -4,1.80016 -4,4 v 4 h -12 c -2.20805,0 -4,1.80016 -4,4 v 32 c 0,2.19984 1.79195,4 4,4 h 48 c 2.20806,0 4,-1.80016 4,-4 V 45 c 0,-2.19984 -1.79194,-4 -4,-4 h -12 v -4 c 0,-2.19984 -1.80016,-4 -4,-4 z m 8,12 c 8.83656,0 16,7.16344 16,16 0,8.83656 -7.16344,16 -16,16 -8.83655,0 -16,-7.16344 -16,-16 0,-8.83656 7.16345,-16 16,-16 z m 0,4 c -6.62742,0 -12,5.37256 -12,12 0,6.62744 5.37258,12 12,12 6.62742,0 12,-5.37256 12,-12 0,-6.62744 -5.37258,-12 -12,-12 z m 3.5332,6 a 2.5,2.5 0 0 1 2.5,2.5 2.5,2.5 0 0 1 -2.5,2.5 2.5,2.5 0 0 1 -2.5,-2.5 2.5,2.5 0 0 1 2.5,-2.5 z" />
  </g>
</svg>
