<?xml version="1.0" encoding="UTF-8" standalone="no"?>
<svg
   inkscape:version="1.1 (c68e22c387, 2021-05-23)"
   id="svg8"
   version="1.1"
   viewBox="0 0 230 140"
   height="140"
   width="230"
   sodipodi:docname="controls-buttons.svg"
   xmlns:inkscape="http://www.inkscape.org/namespaces/inkscape"
   xmlns:sodipodi="http://sodipodi.sourceforge.net/DTD/sodipodi-0.dtd"
   xmlns="http://www.w3.org/2000/svg"
   xmlns:svg="http://www.w3.org/2000/svg"
   xmlns:rdf="http://www.w3.org/1999/02/22-rdf-syntax-ns#">
  <defs
     id="defs2">
    <clipPath
       clipPathUnits="userSpaceOnUse"
       id="clipPath28924">
      <rect
         style="fill:#99c1f1;stroke:none;stroke-width:4.7625;stroke-linecap:round;stroke-dashoffset:26.4"
         id="rect28926"
         width="60.854164"
         height="37.041683"
         x="223.57289"
         y="113.77081"
         ry="2.1166666"
         rx="2.1166666" />
    </clipPath>
    <inkscape:path-effect
       effect="fillet_chamfer"
       id="path-effect51438"
       is_visible="true"
       lpeversion="1"
       satellites_param="F,0,0,1,0,0,0,1 @ F,0,0,1,0,0,0,1 @ F,0,0,1,0,0,0,1 @ F,0,0,1,0,2,0,1"
       unit="px"
       method="auto"
       mode="F"
       radius="8"
       chamfer_steps="1"
       flexible="false"
       use_knot_distance="true"
       apply_no_radius="true"
       apply_with_radius="true"
       only_selected="false"
       hide_knots="false" />
    <clipPath
       clipPathUnits="userSpaceOnUse"
       id="clipPath40461">
      <rect
         style="fill:#99c1f1;stroke:none;stroke-width:4.7625;stroke-linecap:round;stroke-dashoffset:26.4"
         id="rect40463"
         width="60.854164"
         height="37.041683"
         x="223.57289"
         y="163.24783"
         ry="2.1166666"
         rx="2.1166666" />
    </clipPath>
    <clipPath
       clipPathUnits="userSpaceOnUse"
       id="clipPath53720">
      <rect
         style="fill:#99c1f1;stroke:none;stroke-width:4.7625;stroke-linecap:round;stroke-dashoffset:26.4"
         id="rect53722"
         width="60.854168"
         height="37.041683"
         x="-47.603741"
         y="164.65617"
         ry="2.1166666"
         rx="2.1166666" />
    </clipPath>
    <clipPath
       id="c-9">
      <path
         d="M 0,0 H 1024 V 800 H 0 Z"
         id="path64878" />
    </clipPath>
    <mask
       id="b-90">
      <g
         filter="url(#a)"
         id="g64875"
         style="filter:url(#a-4)">
        <path
           d="M 0,0 H 16 V 16 H 0 Z"
           fill-opacity="0.3"
           id="path64873" />
      </g>
    </mask>
    <filter
       id="a-4"
       height="1"
       width="1"
       x="0"
       y="0">
      <feColorMatrix
         in="SourceGraphic"
         type="matrix"
         values="0 0 0 0 1 0 0 0 0 1 0 0 0 0 1 0 0 0 1 0"
         id="feColorMatrix64870" />
    </filter>
    <clipPath
       id="e-7">
      <path
         d="M 0,0 H 1024 V 800 H 0 Z"
         id="path64886" />
    </clipPath>
    <mask
       id="d-1">
      <g
         filter="url(#a)"
         id="g64883"
         style="filter:url(#a-4)">
        <path
           d="M 0,0 H 16 V 16 H 0 Z"
           fill-opacity="0.05"
           id="path64881" />
      </g>
    </mask>
    <filter
       id="filter7691"
       height="1"
       width="1"
       x="0"
       y="0">
      <feColorMatrix
         in="SourceGraphic"
         type="matrix"
         values="0 0 0 0 1 0 0 0 0 1 0 0 0 0 1 0 0 0 1 0"
         id="feColorMatrix7689" />
    </filter>
    <clipPath
       id="g-1">
      <path
         d="M 0,0 H 1024 V 800 H 0 Z"
         id="path64894" />
    </clipPath>
    <mask
       id="f-7">
      <g
         filter="url(#a)"
         id="g64891"
         style="filter:url(#a-4)">
        <path
           d="M 0,0 H 16 V 16 H 0 Z"
           fill-opacity="0.05"
           id="path64889" />
      </g>
    </mask>
    <filter
       id="filter7700"
       height="1"
       width="1"
       x="0"
       y="0">
      <feColorMatrix
         in="SourceGraphic"
         type="matrix"
         values="0 0 0 0 1 0 0 0 0 1 0 0 0 0 1 0 0 0 1 0"
         id="feColorMatrix7698" />
    </filter>
    <clipPath
       id="i-5">
      <path
         d="M 0,0 H 1024 V 800 H 0 Z"
         id="path64902" />
    </clipPath>
    <mask
       id="h-1">
      <g
         filter="url(#a)"
         id="g64899"
         style="filter:url(#a-4)">
        <path
           d="M 0,0 H 16 V 16 H 0 Z"
           fill-opacity="0.05"
           id="path64897" />
      </g>
    </mask>
    <filter
       id="filter7709"
       height="1"
       width="1"
       x="0"
       y="0">
      <feColorMatrix
         in="SourceGraphic"
         type="matrix"
         values="0 0 0 0 1 0 0 0 0 1 0 0 0 0 1 0 0 0 1 0"
         id="feColorMatrix7707" />
    </filter>
    <clipPath
       id="k-77">
      <path
         d="M 0,0 H 1024 V 800 H 0 Z"
         id="path64910" />
    </clipPath>
    <mask
       id="j-9">
      <g
         filter="url(#a)"
         id="g64907"
         style="filter:url(#a-4)">
        <path
           d="M 0,0 H 16 V 16 H 0 Z"
           fill-opacity="0.05"
           id="path64905" />
      </g>
    </mask>
    <filter
       id="filter7718"
       height="1"
       width="1"
       x="0"
       y="0">
      <feColorMatrix
         in="SourceGraphic"
         type="matrix"
         values="0 0 0 0 1 0 0 0 0 1 0 0 0 0 1 0 0 0 1 0"
         id="feColorMatrix7716" />
    </filter>
    <clipPath
       id="m-7">
      <path
         d="M 0,0 H 1024 V 800 H 0 Z"
         id="path64918" />
    </clipPath>
    <mask
       id="l-6">
      <g
         filter="url(#a)"
         id="g64915"
         style="filter:url(#a-4)">
        <path
           d="M 0,0 H 16 V 16 H 0 Z"
           fill-opacity="0.05"
           id="path64913" />
      </g>
    </mask>
    <filter
       id="filter7727"
       height="1"
       width="1"
       x="0"
       y="0">
      <feColorMatrix
         in="SourceGraphic"
         type="matrix"
         values="0 0 0 0 1 0 0 0 0 1 0 0 0 0 1 0 0 0 1 0"
         id="feColorMatrix7725" />
    </filter>
    <clipPath
       id="o-5">
      <path
         d="M 0,0 H 1024 V 800 H 0 Z"
         id="path64926" />
    </clipPath>
    <mask
       id="n-36">
      <g
         filter="url(#a)"
         id="g64923"
         style="filter:url(#a-4)">
        <path
           d="M 0,0 H 16 V 16 H 0 Z"
           fill-opacity="0.05"
           id="path64921" />
      </g>
    </mask>
    <filter
       id="filter7736"
       height="1"
       width="1"
       x="0"
       y="0">
      <feColorMatrix
         in="SourceGraphic"
         type="matrix"
         values="0 0 0 0 1 0 0 0 0 1 0 0 0 0 1 0 0 0 1 0"
         id="feColorMatrix7734" />
    </filter>
    <clipPath
       id="q-9">
      <path
         d="M 0,0 H 1024 V 800 H 0 Z"
         id="path64934" />
    </clipPath>
    <mask
       id="p-63">
      <g
         filter="url(#a)"
         id="g64931"
         style="filter:url(#a-4)">
        <path
           d="M 0,0 H 16 V 16 H 0 Z"
           fill-opacity="0.3"
           id="path64929" />
      </g>
    </mask>
    <filter
       id="filter7745"
       height="1"
       width="1"
       x="0"
       y="0">
      <feColorMatrix
         in="SourceGraphic"
         type="matrix"
         values="0 0 0 0 1 0 0 0 0 1 0 0 0 0 1 0 0 0 1 0"
         id="feColorMatrix7743" />
    </filter>
    <clipPath
       id="s-8">
      <path
         d="M 0,0 H 1024 V 800 H 0 Z"
         id="path64942" />
    </clipPath>
    <mask
       id="r-4">
      <g
         filter="url(#a)"
         id="g64939"
         style="filter:url(#a-4)">
        <path
           d="M 0,0 H 16 V 16 H 0 Z"
           fill-opacity="0.5"
           id="path64937" />
      </g>
    </mask>
    <filter
       id="filter7754"
       height="1"
       width="1"
       x="0"
       y="0">
      <feColorMatrix
         in="SourceGraphic"
         type="matrix"
         values="0 0 0 0 1 0 0 0 0 1 0 0 0 0 1 0 0 0 1 0"
         id="feColorMatrix7752" />
    </filter>
    <clipPath
       id="u-9">
      <path
         d="M 0,0 H 1024 V 800 H 0 Z"
         id="path64950" />
    </clipPath>
    <mask
       id="t-12">
      <g
         filter="url(#a)"
         id="g64947"
         style="filter:url(#a-4)">
        <path
           d="M 0,0 H 16 V 16 H 0 Z"
           fill-opacity="0.4"
           id="path64945" />
      </g>
    </mask>
    <filter
       id="filter7763"
       height="1"
       width="1"
       x="0"
       y="0">
      <feColorMatrix
         in="SourceGraphic"
         type="matrix"
         values="0 0 0 0 1 0 0 0 0 1 0 0 0 0 1 0 0 0 1 0"
         id="feColorMatrix7761" />
    </filter>
    <clipPath
       id="w-90">
      <path
         d="M 0,0 H 1024 V 800 H 0 Z"
         id="path64958" />
    </clipPath>
    <mask
       id="v-3">
      <g
         filter="url(#a)"
         id="g64955"
         style="filter:url(#a-4)">
        <path
           d="M 0,0 H 16 V 16 H 0 Z"
           fill-opacity="0.4"
           id="path64953" />
      </g>
    </mask>
    <filter
       id="filter7772"
       height="1"
       width="1"
       x="0"
       y="0">
      <feColorMatrix
         in="SourceGraphic"
         type="matrix"
         values="0 0 0 0 1 0 0 0 0 1 0 0 0 0 1 0 0 0 1 0"
         id="feColorMatrix7770" />
    </filter>
    <clipPath
       id="y-8">
      <path
         d="M 0,0 H 1024 V 800 H 0 Z"
         id="path64966" />
    </clipPath>
    <mask
       id="x-8">
      <g
         filter="url(#a)"
         id="g64963"
         style="filter:url(#a-4)">
        <path
           d="M 0,0 H 16 V 16 H 0 Z"
           fill-opacity="0.5"
           id="path64961" />
      </g>
    </mask>
    <filter
       id="filter7781"
       height="1"
       width="1"
       x="0"
       y="0">
      <feColorMatrix
         in="SourceGraphic"
         type="matrix"
         values="0 0 0 0 1 0 0 0 0 1 0 0 0 0 1 0 0 0 1 0"
         id="feColorMatrix7779" />
    </filter>
    <clipPath
       id="A-0">
      <path
         d="M 0,0 H 1024 V 800 H 0 Z"
         id="path64974" />
    </clipPath>
    <mask
       id="z-5">
      <g
         filter="url(#a)"
         id="g64971"
         style="filter:url(#a-4)">
        <path
           d="M 0,0 H 16 V 16 H 0 Z"
           fill-opacity="0.5"
           id="path64969" />
      </g>
    </mask>
    <filter
       id="filter7790"
       height="1"
       width="1"
       x="0"
       y="0">
      <feColorMatrix
         in="SourceGraphic"
         type="matrix"
         values="0 0 0 0 1 0 0 0 0 1 0 0 0 0 1 0 0 0 1 0"
         id="feColorMatrix7788" />
    </filter>
    <inkscape:path-effect
       effect="fillet_chamfer"
       id="path-effect70083"
       is_visible="true"
       lpeversion="1"
       satellites_param="F,0,0,1,0,0,0,1 @ F,0,0,1,0,0,0,1 @ F,0,0,1,0,0,0,1 @ F,0,0,1,0,2,0,1"
       unit="px"
       method="auto"
       mode="F"
       radius="8"
       chamfer_steps="1"
       flexible="false"
       use_knot_distance="true"
       apply_no_radius="true"
       apply_with_radius="true"
       only_selected="false"
       hide_knots="false" />
  </defs>
  <sodipodi:namedview
     units="px"
     borderlayer="true"
     inkscape:showpageshadow="false"
     showgrid="false"
     inkscape:document-rotation="0"
     inkscape:current-layer="layer1"
     inkscape:document-units="px"
     inkscape:cy="560"
     inkscape:cx="400"
     inkscape:zoom="0.35"
     inkscape:pageshadow="2"
     inkscape:pageopacity="0"
     borderopacity="1"
     bordercolor="#383838"
     pagecolor="#1f1f1f"
     id="base"
     inkscape:pagecheckerboard="1"
     width="230px">
    <inkscape:grid
       type="xygrid"
       id="grid1900" />
  </sodipodi:namedview>
  <metadata
     id="metadata5">
    <rdf:RDF />
  </metadata>
  <g
     id="layer1"
     inkscape:groupmode="layer"
     inkscape:label="Layer 1">
    <rect
       style="fill:#99c1f1;stroke:none;stroke-width:18;stroke-linecap:round;stroke-dashoffset:26.4"
       id="rect1098"
       width="229.99998"
       height="140.00005"
       x="0.0010986328"
       y="-5.7220459e-05"
       ry="7.999999"
       rx="7.999999" />
    <g
       id="g34542"
       transform="matrix(3.7795272,0,0,3.7795272,-4020,-430.00017)">
      <path
         id="rect26485"
         style="fill:#ffffff;fill-opacity:0.269756;stroke:none;stroke-width:0.529164;stroke-miterlimit:4;stroke-dasharray:none"
         d="m 1065.7418,150.81256 c -1.1727,0 -2.1167,-0.94403 -2.1167,-2.11666 v -24.34167 h 52.5105 c 3.1566,0 5.6978,2.54124 5.6978,5.69784 v 20.76049 z" />
      <path
         id="rect23460"
         style="fill:#ffffff;fill-opacity:1;stroke:none;stroke-width:2;stroke-miterlimit:4;stroke-dasharray:none"
         d="m 3460,100 v 40 h 57.9785 c 6.7519,0 12.1875,-5.43562 12.1875,-12.1875 v -15.625 c 0,-6.75188 -5.4356,-12.1875 -12.1875,-12.1875 z"
         transform="matrix(0.26458336,0,0,0.26458336,148.16667,100.54166)" />
      <rect
         width="23.812475"
         height="10.583335"
         x="1084.8356"
         y="-137.58318"
         rx="3.2246125"
         ry="3.2246125"
         fill="#ffffff"
         id="rect24555"
         style="fill:#99c1f1;fill-opacity:1;stroke:none;stroke-width:0.529165;stroke-miterlimit:4;stroke-dasharray:none"
         transform="scale(1,-1)" />
      <path
         d="m 1113.8966,130.96909 h 0.3409 c 0.085,0.005 0.17,0.0425 0.2275,0.10347 l 0.7543,0.75353 0.7643,-0.75385 c 0.087,-0.0762 0.1475,-0.10123 0.2275,-0.10348 h 0.3307 v 0.33063 c 0,0.0945 -0.025,0.18196 -0.082,0.24794 l -0.7541,0.75451 0.7439,0.74393 c 0.062,0.0623 0.092,0.15022 0.092,0.2377 v 0.33062 h -0.3306 c -0.088,0 -0.175,-0.0307 -0.2375,-0.0927 l -0.7541,-0.75419 -0.7543,0.75386 a 0.33559873,0.33559873 0 0 1 -0.2375,0.0932 h -0.3306 v -0.33063 c 0,-0.0877 0.03,-0.17521 0.092,-0.23769 l 0.7543,-0.74394 -0.7539,-0.75418 a 0.30055098,0.30055098 0 0 1 -0.092,-0.24794 z"
         style="line-height:normal;-inkscape-font-specification:'Andale Mono';text-indent:0;text-align:start;text-decoration-line:none;text-transform:none;fill:#99c1f1;fill-opacity:1;stroke:none;stroke-width:0.264583;marker:none"
         color="#bebebe"
         font-weight="400"
         font-family="'Andale Mono'"
         overflow="visible"
         fill="#2e3436"
         id="path150549-2" />
    </g>
  </g>
</svg>
