<?xml version="1.0" encoding="UTF-8" standalone="no"?>
<svg
   inkscape:version="1.1 (c68e22c387, 2021-05-23)"
   id="svg8"
   version="1.1"
   viewBox="0 0 230 140"
   height="140"
   width="230"
   sodipodi:docname="containers-modelbased.svg"
   xmlns:inkscape="http://www.inkscape.org/namespaces/inkscape"
   xmlns:sodipodi="http://sodipodi.sourceforge.net/DTD/sodipodi-0.dtd"
   xmlns="http://www.w3.org/2000/svg"
   xmlns:svg="http://www.w3.org/2000/svg"
   xmlns:rdf="http://www.w3.org/1999/02/22-rdf-syntax-ns#">
  <defs
     id="defs2">
    <clipPath
       clipPathUnits="userSpaceOnUse"
       id="clipPath28924">
      <rect
         style="fill:#99c1f1;stroke:none;stroke-width:4.7625;stroke-linecap:round;stroke-dashoffset:26.4"
         id="rect28926"
         width="60.854164"
         height="37.041683"
         x="223.57289"
         y="113.77081"
         ry="2.1166666"
         rx="2.1166666" />
    </clipPath>
    <inkscape:path-effect
       effect="fillet_chamfer"
       id="path-effect51438"
       is_visible="true"
       lpeversion="1"
       satellites_param="F,0,0,1,0,0,0,1 @ F,0,0,1,0,0,0,1 @ F,0,0,1,0,0,0,1 @ F,0,0,1,0,2,0,1"
       unit="px"
       method="auto"
       mode="F"
       radius="8"
       chamfer_steps="1"
       flexible="false"
       use_knot_distance="true"
       apply_no_radius="true"
       apply_with_radius="true"
       only_selected="false"
       hide_knots="false" />
    <clipPath
       clipPathUnits="userSpaceOnUse"
       id="clipPath40461">
      <rect
         style="fill:#99c1f1;stroke:none;stroke-width:4.7625;stroke-linecap:round;stroke-dashoffset:26.4"
         id="rect40463"
         width="60.854164"
         height="37.041683"
         x="223.57289"
         y="163.24783"
         ry="2.1166666"
         rx="2.1166666" />
    </clipPath>
  </defs>
  <sodipodi:namedview
     units="px"
     borderlayer="true"
     inkscape:showpageshadow="false"
     showgrid="false"
     inkscape:document-rotation="0"
     inkscape:current-layer="layer1"
     inkscape:document-units="px"
     inkscape:cy="560"
     inkscape:cx="400"
     inkscape:zoom="0.35"
     inkscape:pageshadow="2"
     inkscape:pageopacity="0"
     borderopacity="1"
     bordercolor="#383838"
     pagecolor="#1f1f1f"
     id="base"
     inkscape:pagecheckerboard="1"
     width="230px">
    <inkscape:grid
       type="xygrid"
       id="grid1900" />
  </sodipodi:namedview>
  <metadata
     id="metadata5">
    <rdf:RDF />
  </metadata>
  <g
     id="layer1"
     inkscape:groupmode="layer"
     inkscape:label="Layer 1">
    <rect
       style="fill:#99c1f1;stroke:none;stroke-width:18;stroke-linecap:round;stroke-dashoffset:26.4"
       id="rect1098"
       width="229.99998"
       height="140.00005"
       x="0.0010986328"
       y="-5.7220459e-05"
       ry="7.999999"
       rx="7.999999" />
    <g
       id="g4157-3"
       transform="matrix(3.7795273,0,0,3.7795273,-1467.5,-809.99983)">
      <circle
         style="fill:#d1e3f9;fill-opacity:1;stroke-width:1.05833;stroke-linecap:round;stroke-linejoin:round;stroke-dashoffset:26.4"
         id="path2495-6"
         cx="402.69586"
         cy="219.60417"
         r="1.8520792" />
      <rect
         style="fill:#ffffff;stroke-width:1.05833;stroke-linecap:round;stroke-linejoin:round;stroke-dashoffset:26.4"
         id="rect2621-7"
         width="29.104164"
         height="1.5875021"
         x="407.45837"
         y="218.81042" />
      <circle
         style="fill:#d1e3f9;fill-opacity:1;stroke-width:1.05833;stroke-linecap:round;stroke-linejoin:round;stroke-dashoffset:26.4"
         id="circle2703-5"
         cx="402.69586"
         cy="226.21875"
         r="1.8520792" />
      <rect
         style="fill:#ffffff;stroke-width:1.05833;stroke-linecap:round;stroke-linejoin:round;stroke-dashoffset:26.4"
         id="rect2705-3"
         width="29.104164"
         height="1.587491"
         x="407.45837"
         y="225.42502" />
      <circle
         style="fill:#d1e3f9;fill-opacity:1;stroke-width:1.05833;stroke-linecap:round;stroke-linejoin:round;stroke-dashoffset:26.4"
         id="circle4465-5"
         cx="402.69586"
         cy="232.83331"
         r="1.8520792" />
      <rect
         style="fill:#ffffff;stroke-width:1.05833;stroke-linecap:round;stroke-linejoin:round;stroke-dashoffset:26.4"
         id="rect4467-6"
         width="29.104164"
         height="1.5875021"
         x="407.45837"
         y="232.03957" />
      <circle
         style="fill:#d1e3f9;fill-opacity:1;stroke-width:1.05833;stroke-linecap:round;stroke-linejoin:round;stroke-dashoffset:26.4"
         id="circle4469-2"
         cx="402.69586"
         cy="239.44789"
         r="1.8520792" />
      <rect
         style="fill:#ffffff;stroke-width:1.05833;stroke-linecap:round;stroke-linejoin:round;stroke-dashoffset:26.4"
         id="rect4471-9"
         width="29.104164"
         height="1.587491"
         x="407.45837"
         y="238.65416" />
      <circle
         style="fill:#d1e3f9;fill-opacity:1;stroke-width:1.05833;stroke-linecap:round;stroke-linejoin:round;stroke-dashoffset:26.4"
         id="circle4473-1"
         cx="402.69586"
         cy="246.06244"
         r="1.8520792" />
      <rect
         style="fill:#ffffff;stroke-width:1.05833;stroke-linecap:round;stroke-linejoin:round;stroke-dashoffset:26.4"
         id="rect4475-2"
         width="29.104164"
         height="1.587491"
         x="407.45837"
         y="245.26871" />
    </g>
  </g>
</svg>
