<?xml version="1.0" encoding="UTF-8" standalone="no"?>
<svg
   height="200"
   width="800"
   version="1.1"
   id="svg271"
   sodipodi:docname="hig-containers.svg"
   inkscape:version="1.1-beta1 (77e7b44db3, 2021-03-28)"
   xmlns:inkscape="http://www.inkscape.org/namespaces/inkscape"
   xmlns:sodipodi="http://sodipodi.sourceforge.net/DTD/sodipodi-0.dtd"
   xmlns:xlink="http://www.w3.org/1999/xlink"
   xmlns="http://www.w3.org/2000/svg"
   xmlns:svg="http://www.w3.org/2000/svg"
   xmlns:rdf="http://www.w3.org/1999/02/22-rdf-syntax-ns#"
   xmlns:cc="http://creativecommons.org/ns#"
   xmlns:dc="http://purl.org/dc/elements/1.1/">
  <metadata
     id="metadata275">
    <rdf:RDF>
      <cc:Work
         rdf:about="">
        <dc:format>image/svg+xml</dc:format>
        <dc:type
           rdf:resource="http://purl.org/dc/dcmitype/StillImage" />
      </cc:Work>
    </rdf:RDF>
  </metadata>
  <sodipodi:namedview
     pagecolor="#ffffff"
     bordercolor="#666666"
     borderopacity="1"
     objecttolerance="10"
     gridtolerance="10"
     guidetolerance="10"
     inkscape:pageopacity="0"
     inkscape:pageshadow="2"
     inkscape:window-width="640"
     inkscape:window-height="480"
     id="namedview273"
     showgrid="false"
     inkscape:current-layer="svg271"
     borderlayer="true"
     inkscape:showpageshadow="false"
     inkscape:pagecheckerboard="1"
     inkscape:snap-bbox="true"
     inkscape:snap-bbox-midpoints="true"
     inkscape:snap-bbox-edge-midpoints="true"
     inkscape:bbox-nodes="true"
     inkscape:bbox-paths="true"
     inkscape:snap-nodes="false"
     inkscape:snap-others="false">
    <inkscape:grid
       type="xygrid"
       id="grid2951" />
  </sodipodi:namedview>
  <defs
     id="defs47">
    <inkscape:path-effect
       effect="fillet_chamfer"
       id="path-effect7397"
       is_visible="true"
       lpeversion="1"
       satellites_param="F,0,0,1,0,9,0,1 @ F,0,0,1,0,9,0,1 @ F,0,0,1,0,0,0,1 @ F,0,0,1,0,0,0,1"
       unit="px"
       method="auto"
       mode="F"
       radius="9"
       chamfer_steps="1"
       flexible="false"
       use_knot_distance="true"
       apply_no_radius="true"
       apply_with_radius="true"
       only_selected="false"
       hide_knots="false" />
    <marker
       style="overflow:visible"
       id="Arrow2Mend"
       refX="0"
       refY="0"
       orient="auto"
       inkscape:stockid="Arrow2Mend"
       inkscape:isstock="true">
      <path
         transform="scale(-0.6)"
         d="M 8.7185878,4.0337352 -2.2072895,0.01601326 8.7185884,-4.0017078 c -1.7454984,2.3720609 -1.7354408,5.6174519 -6e-7,8.035443 z"
         style="fill:context-stroke;fill-rule:evenodd;stroke-width:0.625;stroke-linejoin:round"
         id="path2968" />
    </marker>
    <marker
       style="overflow:visible"
       id="DiamondSstart"
       refX="0"
       refY="0"
       orient="auto"
       inkscape:stockid="DiamondSstart"
       inkscape:isstock="true">
      <path
         transform="matrix(0.2,0,0,0.2,1.2,0)"
         style="fill:context-stroke;fill-rule:evenodd;stroke:context-stroke;stroke-width:1pt"
         d="M 0,-7.0710768 -7.0710894,0 0,7.0710589 7.0710462,0 Z"
         id="path3035" />
    </marker>
    <marker
       style="overflow:visible"
       id="Arrow2Mstart"
       refX="0"
       refY="0"
       orient="auto"
       inkscape:stockid="Arrow2Mstart"
       inkscape:isstock="true">
      <path
         transform="scale(0.6)"
         d="M 8.7185878,4.0337352 -2.2072895,0.01601326 8.7185884,-4.0017078 c -1.7454984,2.3720609 -1.7354408,5.6174519 -6e-7,8.035443 z"
         style="fill:context-stroke;fill-rule:evenodd;stroke-width:0.625;stroke-linejoin:round"
         id="path2965" />
    </marker>
    <marker
       style="overflow:visible"
       id="Arrow2Lstart"
       refX="0"
       refY="0"
       orient="auto"
       inkscape:stockid="Arrow2Lstart"
       inkscape:isstock="true">
      <path
         transform="matrix(1.1,0,0,1.1,1.1,0)"
         d="M 8.7185878,4.0337352 -2.2072895,0.01601326 8.7185884,-4.0017078 c -1.7454984,2.3720609 -1.7354408,5.6174519 -6e-7,8.035443 z"
         style="fill:context-stroke;fill-rule:evenodd;stroke-width:0.625;stroke-linejoin:round"
         id="path2959" />
    </marker>
    <marker
       id="n"
       refX="0"
       refY="0"
       orient="auto"
       overflow="visible">
      <path
         d="m -2.308,0 3.46,-2 v 4 z"
         fill-rule="evenodd"
         stroke="#1a5fb4"
         stroke-width="0.4pt"
         fill="#1a5fb4"
         id="path2" />
    </marker>
    <marker
       id="o"
       refX="0"
       refY="0"
       orient="auto"
       overflow="visible">
      <path
         d="m 2.308,0 -3.46,2 v -4 z"
         fill-rule="evenodd"
         stroke="#1a5fb4"
         stroke-width="0.4pt"
         fill="#1a5fb4"
         id="path5" />
    </marker>
    <marker
       id="b"
       refX="0"
       refY="0"
       orient="auto"
       overflow="visible">
      <path
         d="m -2.308,0 3.46,-2 v 4 z"
         fill="#ffffff"
         fill-rule="evenodd"
         stroke="#ffffff"
         stroke-width="0.4pt"
         id="path8" />
    </marker>
    <marker
       id="c"
       refX="0"
       refY="0"
       orient="auto"
       overflow="visible">
      <path
         d="m 2.308,0 -3.46,2 v -4 z"
         fill="#ffffff"
         fill-rule="evenodd"
         stroke="#ffffff"
         stroke-width="0.4pt"
         id="path11" />
    </marker>
    <marker
       id="d"
       refX="0"
       refY="0"
       orient="auto"
       overflow="visible">
      <path
         d="m 2.308,0 -3.46,2 v -4 z"
         fill="#ffffff"
         fill-rule="evenodd"
         stroke="#ffffff"
         stroke-width="0.4pt"
         id="path14" />
    </marker>
    <marker
       id="e"
       refX="0"
       refY="0"
       orient="auto"
       overflow="visible">
      <path
         d="m 2.308,0 -3.46,2 v -4 z"
         fill="#ffffff"
         fill-rule="evenodd"
         stroke="#ffffff"
         stroke-width="0.4pt"
         id="path17" />
    </marker>
    <marker
       id="f"
       refX="0"
       refY="0"
       orient="auto"
       overflow="visible">
      <path
         d="m 2.308,0 -3.46,2 v -4 z"
         fill="#ffffff"
         fill-rule="evenodd"
         stroke="#ffffff"
         stroke-width="0.4pt"
         id="path20" />
    </marker>
    <marker
       id="g"
       refX="0"
       refY="0"
       orient="auto"
       overflow="visible">
      <path
         d="m 2.308,0 -3.46,2 v -4 z"
         fill="#ffffff"
         fill-rule="evenodd"
         stroke="#ffffff"
         stroke-width="0.4pt"
         id="path23" />
    </marker>
    <marker
       id="h"
       refX="0"
       refY="0"
       orient="auto"
       overflow="visible">
      <path
         d="m -2.308,0 3.46,-2 v 4 z"
         fill="#ffffff"
         fill-rule="evenodd"
         stroke="#ffffff"
         stroke-width="0.4pt"
         id="path26" />
    </marker>
    <marker
       id="i"
       refX="0"
       refY="0"
       orient="auto"
       overflow="visible">
      <path
         d="m 2.308,0 -3.46,2 v -4 z"
         fill="#ffffff"
         fill-rule="evenodd"
         stroke="#ffffff"
         stroke-width="0.4pt"
         id="path29" />
    </marker>
    <marker
       id="j"
       refX="0"
       refY="0"
       orient="auto"
       overflow="visible">
      <path
         d="m -2.308,0 3.46,-2 v 4 z"
         fill="#ffffff"
         fill-rule="evenodd"
         stroke="#ffffff"
         stroke-width="0.4pt"
         id="path32" />
    </marker>
    <marker
       id="k"
       refX="0"
       refY="0"
       orient="auto"
       overflow="visible">
      <path
         d="m 2.308,0 -3.46,2 v -4 z"
         fill="#ffffff"
         fill-rule="evenodd"
         stroke="#ffffff"
         stroke-width="0.4pt"
         id="path35" />
    </marker>
    <marker
       id="l"
       refX="0"
       refY="0"
       orient="auto"
       overflow="visible">
      <path
         d="m -2.308,0 3.46,-2 v 4 z"
         fill="#ffffff"
         fill-rule="evenodd"
         stroke="#ffffff"
         stroke-width="0.4pt"
         id="path38" />
    </marker>
    <marker
       id="m"
       refX="0"
       refY="0"
       orient="auto"
       overflow="visible">
      <path
         d="m 2.308,0 -3.46,2 v -4 z"
         fill="#ffffff"
         fill-rule="evenodd"
         stroke="#ffffff"
         stroke-width="0.4pt"
         id="path41" />
    </marker>
    <clipPath
       clipPathUnits="userSpaceOnUse"
       id="a">
      <path
         style="font-variation-settings:normal;marker:none"
         class="powerclip"
         d="M 399.306,389.64 H 684.462 V 791.62 H 399.306 Z m 216.553,258.086 a 73.976,73.976 0 0 0 -73.975,-73.975 73.976,73.976 0 0 0 -73.976,73.975 73.976,73.976 0 0 0 73.976,73.976 73.976,73.976 0 0 0 73.975,-73.976 z"
         display="block"
         fill="#77767b"
         stroke-width="5.043"
         stroke-linecap="round"
         id="path44" />
    </clipPath>
    <clipPath
       id="d-3"
       clipPathUnits="userSpaceOnUse">
      <path
         id="path25"
         stroke-width="1.357"
         fill="#4a86cf"
         overflow="visible"
         color="#000000"
         style="marker:none"
         d="m 2330.729,-970.526 h 1007.5 V -1366.5 h -1007.5 z" />
    </clipPath>
    <linearGradient
       gradientTransform="matrix(-0.03667,0.05186,0.03667,0.05186,180.124,169.116)"
       y2="-127.399"
       x2="158.51801"
       y1="-97.697998"
       x1="128.817"
       gradientUnits="userSpaceOnUse"
       id="e-6"
       xlink:href="#linearGradient1005" />
    <linearGradient
       inkscape:collect="always"
       id="linearGradient1005">
      <stop
         style="stop-color:#d0bb8e;stop-opacity:1"
         offset="0"
         id="stop1001" />
      <stop
         style="stop-color:#ffffff;stop-opacity:1"
         offset="1"
         id="stop1003" />
    </linearGradient>
    <linearGradient
       y2="292"
       x2="64"
       y1="254"
       x1="64"
       gradientTransform="matrix(1.3,0,0,1,-19.2,16.87)"
       gradientUnits="userSpaceOnUse"
       id="g-7"
       xlink:href="#linearGradient1880" />
    <linearGradient
       inkscape:collect="always"
       id="linearGradient1880">
      <stop
         style="stop-color:#cdab8f;stop-opacity:1;"
         offset="0"
         id="stop1876" />
      <stop
         style="stop-color:#d3b69d;stop-opacity:1"
         offset="1"
         id="stop1878" />
    </linearGradient>
    <inkscape:path-effect
       effect="fillet_chamfer"
       id="path-effect15396"
       is_visible="true"
       lpeversion="1"
       satellites_param="F,0,0,1,0,9,0,1 @ F,0,0,1,0,9,0,1 @ F,0,0,1,0,0,0,1 @ F,0,0,1,0,0,0,1"
       unit="px"
       method="auto"
       mode="F"
       radius="9"
       chamfer_steps="1"
       flexible="false"
       use_knot_distance="true"
       apply_no_radius="true"
       apply_with_radius="true"
       only_selected="false"
       hide_knots="false" />
    <marker
       id="y"
       refX="0"
       refY="0"
       orient="auto"
       overflow="visible">
      <path
         d="m -2.308,0 3.46,-2 v 4 z"
         fill="#ffffff"
         fill-rule="evenodd"
         stroke="#ffffff"
         stroke-width="0.4pt"
         id="path2716" />
    </marker>
    <marker
       id="z"
       refX="0"
       refY="0"
       orient="auto"
       overflow="visible">
      <path
         d="m 2.308,0 -3.46,2 v -4 z"
         fill="#ffffff"
         fill-rule="evenodd"
         stroke="#ffffff"
         stroke-width="0.4pt"
         id="path2719" />
    </marker>
  </defs>
  <rect
     style="fill:#99c1f1;fill-opacity:1;stroke:none;stroke-width:0.880834;stroke-linecap:round;stroke-linejoin:round;stop-color:#000000"
     id="rect1375"
     width="800.99219"
     height="199.92598"
     x="0"
     y="0"
     rx="0"
     ry="0" />
  <rect
     style="fill:#ffffff;stroke-width:1;stroke-linecap:round;stroke-linejoin:round;stroke-miterlimit:4;stroke-dasharray:none;stop-color:#000000"
     id="rect4644"
     width="69.96582"
     height="60.013672"
     x="294.94482"
     y="44.753906"
     rx="7.7944336"
     ry="7.7944336" />
  <path
     style="fill:none;stroke:#3584e4;stroke-width:1;stroke-linecap:butt;stroke-linejoin:miter;stroke-miterlimit:4;stroke-dasharray:none;stroke-opacity:1"
     d="m 10.513592,55.964565 -1.3e-5,-45.032994"
     id="path3946"
     sodipodi:nodetypes="cc" />
  <path
     style="fill:none;stroke:#3584e4;stroke-width:1;stroke-linecap:butt;stroke-linejoin:miter;stroke-miterlimit:4;stroke-dasharray:none;stroke-opacity:1"
     d="m 209.34206,182.45301 h 61.26893"
     id="path3661" />
  <path
     style="fill:none;stroke:#3584e4;stroke-width:1;stroke-linecap:butt;stroke-linejoin:miter;stroke-miterlimit:4;stroke-dasharray:none;stroke-opacity:1"
     d="m 239.4966,55.964565 -2e-5,-45.032994"
     id="path4049"
     sodipodi:nodetypes="cc" />
  <rect
     style="color:#000000;display:inline;overflow:visible;visibility:visible;fill:#ffffff;fill-opacity:1;fill-rule:nonzero;stroke:none;stroke-width:0.422232;stroke-linecap:butt;stroke-linejoin:miter;stroke-miterlimit:4;stroke-dasharray:none;stroke-dashoffset:0;stroke-opacity:1;marker:none;enable-background:accumulate"
     id="rect9421"
     width="229.84621"
     height="26.876934"
     x="10.062012"
     y="42.123066"
     rx="7.9363637"
     ry="8.1018686"
     inkscape:export-filename="/home/lapo.fedora/SparkleShare/gnome-mockups/content selection/content-selection.png"
     inkscape:export-xdpi="90"
     inkscape:export-ydpi="90" />
  <g
     id="g9433"
     transform="matrix(0.41718343,0,0,0.41718343,-471.9934,2693.5238)"
     style="display:inline">
    <rect
       ry="12.5"
       rx="12.78338"
       y="-6336.4785"
       x="1636.4999"
       height="25"
       width="49"
       id="rect9429"
       style="fill:#62a0ea;fill-opacity:1;stroke:none;stroke-width:1;stroke-linecap:round;stroke-miterlimit:4;stroke-dasharray:none;stroke-opacity:1" />
    <rect
       ry="12.5"
       rx="22.5"
       y="-6336.4785"
       x="1660.4999"
       height="25"
       width="25"
       id="rect9431"
       style="display:inline;fill:#fafaf9;fill-opacity:1;stroke:none;stroke-width:1;stroke-linecap:round;stroke-miterlimit:4;stroke-dasharray:none;stroke-opacity:1" />
  </g>
  <rect
     style="fill:#62a0ea;stroke-width:0.818585;stroke-linecap:round;stroke-linejoin:round;stop-color:#000000"
     id="rect98"
     width="66.749352"
     height="8.0310068"
     x="10.062012"
     y="27"
     rx="0.62577516"
     ry="0.6023255" />
  <rect
     style="fill:#99c1f1;stroke-width:0.81738;stroke-linecap:round;stroke-linejoin:round;stop-color:#000000"
     id="rect282"
     width="66.297157"
     height="8.0620089"
     x="19"
     y="52"
     rx="0.6215359"
     ry="0.60465068" />
  <path
     style="fill:none;stroke:#3584e4;stroke-width:1;stroke-linecap:butt;stroke-linejoin:miter;stroke-miterlimit:4;stroke-dasharray:none;stroke-opacity:1"
     d="m 209.36553,77.496482 h 61.26893"
     id="path3463" />
  <rect
     style="color:#000000;display:inline;overflow:visible;visibility:visible;fill:#dfecfb;fill-opacity:1;fill-rule:nonzero;stroke:none;stroke-width:0.41718;stroke-linecap:butt;stroke-linejoin:miter;stroke-miterlimit:4;stroke-dasharray:none;stroke-dashoffset:0;stroke-opacity:1;marker:none;enable-background:accumulate"
     id="rect15392"
     width="229.45088"
     height="105.54762"
     x="10.479168"
     y="77.166115"
     rx="8.3915892"
     ry="8.3915892"
     inkscape:export-filename="/home/lapo.fedora/SparkleShare/gnome-mockups/content selection/content-selection.png"
     inkscape:export-xdpi="90"
     inkscape:export-ydpi="90" />
  <path
     style="color:#000000;display:inline;overflow:visible;visibility:visible;fill:#ffffff;fill-opacity:1;fill-rule:nonzero;stroke:none;stroke-width:0.417179;stroke-linecap:butt;stroke-linejoin:miter;stroke-miterlimit:4;stroke-dasharray:none;stroke-dashoffset:0;stroke-opacity:1;marker:none;enable-background:accumulate"
     id="rect15318"
     width="229.45088"
     height="26.28261"
     x="10.479168"
     y="77.166115"
     inkscape:export-filename="/home/lapo.fedora/SparkleShare/gnome-mockups/content selection/content-selection.png"
     inkscape:export-xdpi="90"
     inkscape:export-ydpi="90"
     inkscape:path-effect="#path-effect15396"
     sodipodi:type="rect"
     d="M 19.479168,77.166115 H 230.93005 a 9,9 45 0 1 9,9 V 103.44872 H 10.479168 V 86.166115 a 9,9 135 0 1 9,-9 z" />
  <g
     transform="matrix(0,-0.41718341,-0.41718341,0,469.43372,107.41196)"
     inkscape:label="go-previous"
     id="g9543-6"
     style="display:inline;enable-background:new">
    <rect
       transform="scale(-1,1)"
       style="color:#bebebe;display:inline;overflow:visible;visibility:visible;fill:none;stroke:none;stroke-width:1;marker:none;enable-background:new"
       id="rect9531-8"
       y="584"
       x="-49"
       height="16"
       width="16" />
    <path
       id="path15403"
       style="color:#000000;font-style:normal;font-variant:normal;font-weight:normal;font-stretch:normal;font-size:medium;line-height:normal;font-family:sans-serif;font-variant-ligatures:normal;font-variant-position:normal;font-variant-caps:normal;font-variant-numeric:normal;font-variant-alternates:normal;font-variant-east-asian:normal;font-feature-settings:normal;font-variation-settings:normal;text-indent:0;text-align:start;text-decoration:none;text-decoration-line:none;text-decoration-style:solid;text-decoration-color:#000000;letter-spacing:normal;word-spacing:normal;text-transform:none;writing-mode:lr-tb;direction:ltr;text-orientation:mixed;dominant-baseline:auto;baseline-shift:baseline;text-anchor:start;white-space:normal;shape-padding:0;shape-margin:0;inline-size:0;clip-rule:nonzero;display:inline;overflow:visible;visibility:visible;opacity:1;isolation:auto;mix-blend-mode:normal;color-interpolation:sRGB;color-interpolation-filters:linearRGB;solid-color:#000000;solid-opacity:1;vector-effect:none;fill:#3584e4;fill-opacity:1;fill-rule:nonzero;stroke:none;stroke-width:2;stroke-linecap:butt;stroke-linejoin:miter;stroke-miterlimit:4;stroke-dasharray:none;stroke-dashoffset:0;stroke-opacity:1;marker:none;color-rendering:auto;image-rendering:auto;shape-rendering:auto;text-rendering:auto;enable-background:new;stop-color:#000000;stop-opacity:1"
       d="m 1872.0078,737 v 1 c 0,0.277 0.1122,0.52628 0.293,0.70703 l 5.707,5.70703 5.707,-5.70703 c 0.1808,-0.18075 0.293,-0.43003 0.293,-0.70703 v -1 h -1 c -0.277,0 -0.5263,0.11222 -0.707,0.29297 l -4.293,4.29297 -4.293,-4.29297 c -0.1807,-0.18075 -0.43,-0.29297 -0.707,-0.29297 z"
       transform="matrix(0,-1,-1,0,781.99993,2470.0087)" />
  </g>
  <g
     id="g9441-2"
     transform="matrix(0.41718343,0,0,0.41718343,-447.71019,-1362.7064)">
    <rect
       style="color:#000000;display:inline;overflow:visible;visibility:visible;fill:#dfecfb;fill-opacity:1;fill-rule:nonzero;stroke:none;stroke-width:1.01355;stroke-linecap:butt;stroke-linejoin:miter;stroke-miterlimit:4;stroke-dasharray:none;stroke-dashoffset:0;stroke-opacity:1;marker:none;enable-background:accumulate"
       id="rect9421-6"
       width="550"
       height="64.719849"
       x="1098.2924"
       y="3513.3379"
       inkscape:export-filename="/home/lapo.fedora/SparkleShare/gnome-mockups/content selection/content-selection.png"
       inkscape:export-xdpi="90"
       inkscape:export-ydpi="90" />
  </g>
  <g
     id="g15492"
     transform="matrix(0.41718343,0,0,0.41718343,-447.71019,-1336.4239)"
     style="stroke:none">
    <rect
       style="color:#000000;display:inline;overflow:visible;visibility:visible;fill:#dfecfb;fill-opacity:1;fill-rule:nonzero;stroke:none;stroke-width:0.99999;stroke-linecap:butt;stroke-linejoin:miter;stroke-miterlimit:4;stroke-dasharray:none;stroke-dashoffset:0;stroke-opacity:1;marker:none;enable-background:accumulate"
       id="rect15480"
       width="550"
       height="63.00013"
       x="1098.2924"
       y="3514.4136"
       inkscape:export-filename="/home/lapo.fedora/SparkleShare/gnome-mockups/content selection/content-selection.png"
       inkscape:export-xdpi="90"
       inkscape:export-ydpi="90" />
  </g>
  <rect
     style="fill:#99c1f1;stroke-width:0.834367;stroke-linecap:round;stroke-linejoin:round;stop-color:#000000"
     id="rect1632"
     width="66.749352"
     height="8.3436689"
     x="18.405682"
     y="85.093018"
     rx="0.62577516"
     ry="0.62577516" />
  <rect
     style="fill:#99c1f1;stroke-width:0.834367;stroke-linecap:round;stroke-linejoin:round;stop-color:#000000"
     id="rect1714"
     width="66.749352"
     height="8.3436689"
     x="18.405682"
     y="114.29586"
     rx="0.62577516"
     ry="0.62577516" />
  <rect
     style="fill:#99c1f1;stroke-width:0.834367;stroke-linecap:round;stroke-linejoin:round;stop-color:#000000"
     id="rect1716"
     width="66.749352"
     height="8.3436689"
     x="18.405682"
     y="139.32686"
     rx="0.62577516"
     ry="0.62577516" />
  <rect
     style="fill:#99c1f1;stroke-width:0.834367;stroke-linecap:round;stroke-linejoin:round;stop-color:#000000"
     id="rect1718"
     width="66.749352"
     height="8.3436689"
     x="18.405682"
     y="164.35786"
     rx="0.62577516"
     ry="0.62577516" />
  <g
     id="g1982"
     transform="matrix(0.41718343,0,0,0.41718343,-471.9934,2755.6838)"
     style="display:inline">
    <rect
       ry="12.5"
       rx="12.78338"
       y="-6336.4785"
       x="1636.4999"
       height="25"
       width="49"
       id="rect1978"
       style="fill:#62a0ea;fill-opacity:1;stroke:none;stroke-width:1;stroke-linecap:round;stroke-miterlimit:4;stroke-dasharray:none;stroke-opacity:1" />
    <rect
       ry="12.5"
       rx="22.5"
       y="-6336.4785"
       x="1660.4999"
       height="25"
       width="25"
       id="rect1980"
       style="display:inline;fill:#fafaf9;fill-opacity:1;stroke:none;stroke-width:1;stroke-linecap:round;stroke-miterlimit:4;stroke-dasharray:none;stroke-opacity:1" />
  </g>
  <g
     id="g2148"
     transform="matrix(0.41718343,0,0,0.41718343,-471.9934,2780.7148)"
     style="display:inline">
    <rect
       ry="12.5"
       rx="12.78338"
       y="-6336.4785"
       x="1636.4999"
       height="25"
       width="49"
       id="rect2144"
       style="fill:#62a0ea;fill-opacity:1;stroke:none;stroke-width:1;stroke-linecap:round;stroke-miterlimit:4;stroke-dasharray:none;stroke-opacity:1" />
    <rect
       ry="12.5"
       rx="22.5"
       y="-6336.4785"
       x="1660.4999"
       height="25"
       width="25"
       id="rect2146"
       style="display:inline;fill:#fafaf9;fill-opacity:1;stroke:none;stroke-width:1;stroke-linecap:round;stroke-miterlimit:4;stroke-dasharray:none;stroke-opacity:1" />
  </g>
  <g
     id="g2154"
     transform="matrix(0.41718343,0,0,0.41718343,-471.9934,2805.7458)"
     style="display:inline">
    <rect
       ry="12.5"
       rx="12.78338"
       y="-6336.4785"
       x="1636.4999"
       height="25"
       width="49"
       id="rect2150"
       style="fill:#62a0ea;fill-opacity:1;stroke:none;stroke-width:1;stroke-linecap:round;stroke-miterlimit:4;stroke-dasharray:none;stroke-opacity:1" />
    <rect
       ry="12.5"
       rx="22.5"
       y="-6336.4785"
       x="1660.4999"
       height="25"
       width="25"
       id="rect2152"
       style="display:inline;fill:#fafaf9;fill-opacity:1;stroke:none;stroke-width:1;stroke-linecap:round;stroke-miterlimit:4;stroke-dasharray:none;stroke-opacity:1" />
  </g>
  <g
     id="g9325"
     transform="matrix(1.5767562,0,0,1.5767562,28.359291,-245.27212)">
    <path
       sodipodi:nodetypes="cccc"
       inkscape:connector-curvature="0"
       id="path9321"
       d="m 199.49583,175.12616 -1.32291,1.32291 -1.32292,-1.32291 z"
       style="fill:#3584e4;fill-opacity:1;stroke:none;stroke-width:0.264583" />
    <rect
       transform="matrix(0,1,1,0,0,0)"
       style="color:#bebebe;display:inline;overflow:visible;visibility:visible;fill:none;stroke:none;stroke-width:0.264583;marker:none;enable-background:new"
       id="rect9323"
       y="196.05624"
       x="174.49791"
       height="4.2333331"
       width="4.2333331" />
  </g>
  <rect
     width="6.6749339"
     height="6.6749339"
     x="29.868834"
     y="337.49225"
     id="rect9331"
     style="color:#bebebe;display:inline;overflow:visible;visibility:visible;fill:none;stroke:none;stroke-width:0.417183;marker:none;enable-background:new"
     transform="matrix(0,1,1,0,0,0)" />
  <g
     transform="matrix(0.41718343,0,0,0.41718343,-0.3675721,-665.81455)"
     id="g9361">
    <path
       sodipodi:nodetypes="cccccccc"
       inkscape:connector-curvature="0"
       d="m 821.10072,1722.6648 -1,-1 -5,5 -2.5,-2.5 -2,2 4.5,4.5 7,-7 z"
       style="line-height:normal;-inkscape-font-specification:Sans;text-indent:0;text-align:start;text-decoration:none;text-decoration-line:none;text-transform:none;display:inline;fill:#3584e4;marker:none"
       color="#000000"
       font-weight="400"
       font-family="Sans"
       overflow="visible"
       fill="#2e3436"
       id="path9343" />
  </g>
  <path
     inkscape:connector-curvature="0"
     id="path9363"
     d="M 365,65.5 H 295.00114"
     style="display:inline;fill:none;stroke:#99c1f1;stroke-width:1.01812;stroke-linecap:butt;stroke-linejoin:miter;stroke-miterlimit:4;stroke-dasharray:none;stroke-opacity:1"
     sodipodi:nodetypes="cc" />
  <path
     style="display:inline;fill:none;stroke:#99c1f1;stroke-width:1.01812;stroke-linecap:butt;stroke-linejoin:miter;stroke-miterlimit:4;stroke-dasharray:none;stroke-opacity:1"
     d="M 364.96761,85.473238 H 294.96875"
     id="path9365"
     inkscape:connector-curvature="0"
     sodipodi:nodetypes="cc" />
  <rect
     style="fill:#ffffff;stroke-width:1.00209;stroke-linecap:round;stroke-linejoin:round;stroke-miterlimit:4;stroke-dasharray:none;stop-color:#000000"
     id="rect4932"
     width="10.148926"
     height="9.7304688"
     x="267.7374"
     y="-212.7807"
     rx="0"
     ry="0"
     transform="rotate(45)" />
  <rect
     style="fill:#62a0ea;stroke-width:0.834367;stroke-linecap:round;stroke-linejoin:round;stop-color:#000000"
     id="rect4894"
     width="29.202841"
     height="6.2577515"
     x="302.09042"
     y="28.773254"
     rx="0.62577516"
     ry="0.62577516" />
  <rect
     style="fill:#99c1f1;fill-opacity:1;stroke-width:0.834367;stroke-linecap:round;stroke-linejoin:round;stop-color:#000000"
     id="rect5129"
     width="29.202841"
     height="6.2577515"
     x="306.26224"
     y="51.718342"
     rx="0.62577516"
     ry="0.62577516" />
  <rect
     style="fill:#99c1f1;fill-opacity:1;stroke-width:0.834367;stroke-linecap:round;stroke-linejoin:round;stop-color:#000000"
     id="rect5211"
     width="31.288757"
     height="6.2577515"
     x="306.26224"
     y="72.577515"
     rx="0.62577516"
     ry="0.62577516" />
  <rect
     style="fill:#99c1f1;fill-opacity:1;stroke-width:0.834367;stroke-linecap:round;stroke-linejoin:round;stop-color:#000000"
     id="rect5213"
     width="18.773254"
     height="6.2577515"
     x="306.26224"
     y="91.350769"
     rx="0.62577516"
     ry="0.62577516" />
  <path
     style="fill:none;stroke:#3584e4;stroke-width:1;stroke-linecap:butt;stroke-linejoin:miter;stroke-miterlimit:4;stroke-dasharray:none;stroke-opacity:1"
     d="M 434.55205,35.888189 V 80.921183"
     id="path7387"
     sodipodi:nodetypes="cc" />
  <path
     style="fill:none;stroke:#3584e4;stroke-width:1;stroke-linecap:butt;stroke-linejoin:miter;stroke-miterlimit:4;stroke-dasharray:none;stroke-opacity:1"
     d="M 638.41565,35.888189 V 80.921183"
     id="path7389"
     sodipodi:nodetypes="cc" />
  <path
     style="color:#000000;display:inline;overflow:visible;visibility:visible;fill:#ffffff;fill-opacity:1;fill-rule:nonzero;stroke:none;stroke-width:0.417179;stroke-linecap:butt;stroke-linejoin:miter;stroke-miterlimit:4;stroke-dasharray:none;stroke-dashoffset:0;stroke-opacity:1;marker:none;enable-background:accumulate"
     id="path7393"
     width="229.45088"
     height="26.28261"
     x="434.28796"
     y="22.932266"
     inkscape:export-filename="/home/lapo.fedora/SparkleShare/gnome-mockups/content selection/content-selection.png"
     inkscape:export-xdpi="90"
     inkscape:export-ydpi="90"
     inkscape:path-effect="#path-effect7397"
     sodipodi:type="rect"
     d="m 443.28796,22.932266 h 211.45089 a 9,9 45 0 1 9,9 v 17.28261 H 434.28796 v -17.28261 a 9,9 135 0 1 9,-9 z" />
  <path
     id="path7405"
     d="M 663.53025,49.214875 H 434.49654"
     style="fill:none;stroke:#dfdfdf;stroke-width:0.417182px;stroke-linecap:butt;stroke-linejoin:miter;stroke-opacity:1" />
  <rect
     style="fill:#99c1f1;stroke-width:0.834367;stroke-linecap:round;stroke-linejoin:round;stop-color:#000000"
     id="rect7407"
     width="66.749352"
     height="8.3436689"
     x="504.79196"
     y="32.859169"
     rx="0.62577516"
     ry="0.62577516" />
  <g
     inkscape:label="window-close"
     id="g14265-5"
     style="display:inline;enable-background:new"
     transform="matrix(0.41718343,0,0,0.41718343,647.88587,32.501831)">
    <rect
       style="color:#bebebe;display:inline;overflow:visible;visibility:visible;fill:none;stroke:none;stroke-width:1;marker:none;enable-background:new"
       id="rect10837-5"
       y="0"
       x="0"
       height="16"
       width="16" />
    <path
       sodipodi:nodetypes="ccsccccccccccccccccccccccc"
       style="color:#bebebe;font-style:normal;font-variant:normal;font-weight:normal;font-stretch:normal;font-size:medium;line-height:normal;font-family:'Andale Mono';-inkscape-font-specification:'Andale Mono';text-indent:0;text-align:start;text-decoration:none;text-decoration-line:none;letter-spacing:normal;word-spacing:normal;text-transform:none;writing-mode:lr-tb;direction:ltr;text-anchor:start;display:inline;overflow:visible;visibility:visible;fill:#3584e4;fill-opacity:1;fill-rule:nonzero;stroke:none;stroke-width:1.78125;marker:none;enable-background:new"
       id="path10839-9"
       inkscape:connector-curvature="0"
       d="m 4,4 h 1 c 0.01037,-1.2e-4 0.02079,-4.6e-4 0.03125,0 0.254951,0.0112 0.50987,0.12858 0.6875,0.3125 L 8,6.59375 10.3125,4.3125 C 10.578125,4.082 10.759172,4.007 11,4 h 1 v 1 c 0,0.28647 -0.03434,0.55065 -0.25,0.75 l -2.28125,2.28125 2.25,2.25 C 11.906938,10.46942 11.999992,10.7347 12,11 v 1 h -1 c -0.265301,-10e-6 -0.530586,-0.0931 -0.71875,-0.28125 L 8,9.4375 5.71875,11.71875 C 5.530586,11.90694 5.26529,12 5,12 H 4 v -1 c -3e-6,-0.26529 0.09306,-0.53058 0.28125,-0.71875 L 6.5625,8.03125 4.28125,5.75 C 4.070508,5.55537 3.97809,5.28075 4,5 Z" />
  </g>
  <path
     style="fill:none;stroke:#3584e4;stroke-width:0.834367;stroke-linecap:butt;stroke-linejoin:miter;stroke-miterlimit:4;stroke-dasharray:0.834367, 1.66873;stroke-dashoffset:0;stroke-opacity:1"
     d="M 638.29065,23.372686 V 47.546509"
     id="path22612"
     sodipodi:nodetypes="cc" />
  <g
     id="g23437"
     transform="matrix(0.41718343,0,0,0.41718343,0,10)">
    <path
       id="rect23053"
       style="opacity:1;fill:#ffffff;stroke:none;stroke-width:2;stroke-linecap:round;stroke-linejoin:round;stroke-dasharray:2, 4;stop-color:#000000"
       d="m 1060,220 h 40 l 30,30.76953 V 310 h -70 z"
       sodipodi:nodetypes="cccccc" />
    <path
       style="fill:#62a0ea;stroke:none;stroke-width:1px;stroke-linecap:butt;stroke-linejoin:miter;stroke-opacity:1"
       d="m 1130,250 h -30 v -30 z"
       id="path23266" />
  </g>
  <g
     id="g23461"
     transform="matrix(0.41718343,0,0,0.41718343,50.062012,10)">
    <path
       id="path23457"
       style="opacity:1;fill:#ffffff;stroke:none;stroke-width:2;stroke-linecap:round;stroke-linejoin:round;stroke-dasharray:2, 4;stop-color:#000000"
       d="m 1060,220 h 40 l 30,30.76953 V 310 h -70 z"
       sodipodi:nodetypes="cccccc" />
    <path
       style="fill:#62a0ea;stroke:none;stroke-width:1px;stroke-linecap:butt;stroke-linejoin:miter;stroke-opacity:1"
       d="m 1130,250 h -30 v -30 z"
       id="path23459" />
  </g>
  <g
     id="g23467"
     transform="matrix(0.41718343,0,0,0.41718343,100.12402,10)">
    <path
       id="path23463"
       style="opacity:1;fill:#ffffff;stroke:none;stroke-width:2;stroke-linecap:round;stroke-linejoin:round;stroke-dasharray:2, 4;stop-color:#000000"
       d="m 1060,220 h 40 l 30,30.76953 V 310 h -70 z"
       sodipodi:nodetypes="cccccc" />
    <path
       style="fill:#62a0ea;stroke:none;stroke-width:1px;stroke-linecap:butt;stroke-linejoin:miter;stroke-opacity:1"
       d="m 1130,250 h -30 v -30 z"
       id="path23465" />
  </g>
  <g
     id="g23479"
     transform="matrix(0.41718343,0,0,0.41718343,0,60.062012)">
    <path
       id="path23475"
       style="opacity:1;fill:#ffffff;stroke:none;stroke-width:2;stroke-linecap:round;stroke-linejoin:round;stroke-dasharray:2, 4;stop-color:#000000"
       d="m 1060,220 h 40 l 30,30.76953 V 310 h -70 z"
       sodipodi:nodetypes="cccccc" />
    <path
       style="fill:#62a0ea;stroke:none;stroke-width:1px;stroke-linecap:butt;stroke-linejoin:miter;stroke-opacity:1"
       d="m 1130,250 h -30 v -30 z"
       id="path23477" />
  </g>
  <g
     id="g23485"
     transform="matrix(0.41718343,0,0,0.41718343,50.062012,60.062012)">
    <path
       id="path23481"
       style="opacity:1;fill:#ffffff;stroke:none;stroke-width:2;stroke-linecap:round;stroke-linejoin:round;stroke-dasharray:2, 4;stop-color:#000000"
       d="m 1060,220 h 40 l 30,30.76953 V 310 h -70 z"
       sodipodi:nodetypes="cccccc" />
    <path
       style="fill:#62a0ea;stroke:none;stroke-width:1px;stroke-linecap:butt;stroke-linejoin:miter;stroke-opacity:1"
       d="m 1130,250 h -30 v -30 z"
       id="path23483" />
  </g>
  <g
     id="g23491"
     transform="matrix(0.41718343,0,0,0.41718343,100.12402,60.062012)">
    <path
       id="path23487"
       style="opacity:1;fill:#ffffff;stroke:none;stroke-width:2;stroke-linecap:round;stroke-linejoin:round;stroke-dasharray:2, 4;stop-color:#000000"
       d="m 1060,220 h 40 l 30,30.76953 V 310 h -70 z"
       sodipodi:nodetypes="cccccc" />
    <path
       style="fill:#62a0ea;stroke:none;stroke-width:1px;stroke-linecap:butt;stroke-linejoin:miter;stroke-opacity:1"
       d="m 1130,250 h -30 v -30 z"
       id="path23489" />
  </g>
  <g
     id="g23497"
     transform="matrix(0.41718343,0,0,0.41718343,150.18604,60.062012)">
    <path
       id="path23493"
       style="opacity:1;fill:#ffffff;stroke:none;stroke-width:2;stroke-linecap:round;stroke-linejoin:round;stroke-dasharray:2, 4;stop-color:#000000"
       d="m 1060,220 h 40 l 30,30.76953 V 310 h -70 z"
       sodipodi:nodetypes="cccccc" />
    <path
       style="fill:#62a0ea;stroke:none;stroke-width:1px;stroke-linecap:butt;stroke-linejoin:miter;stroke-opacity:1"
       d="m 1130,250 h -30 v -30 z"
       id="path23495" />
  </g>
  <rect
     style="opacity:1;fill:#ffffff;fill-opacity:1;stroke:none;stroke-width:0.834367;stroke-linecap:round;stroke-linejoin:round;stroke-miterlimit:4;stroke-dasharray:0.834367, 1.66873;stroke-dashoffset:0;stop-color:#000000"
     id="rect23667"
     width="29.202841"
     height="29.202841"
     x="592.40045"
     y="110.12402"
     rx="4.9540534"
     ry="4.9540534" />
  <path
     style="fill:#99c1f1;fill-opacity:1;stroke:none;stroke-width:0.417183px;stroke-linecap:butt;stroke-linejoin:miter;stroke-opacity:1"
     d="m 606.30657,135.15503 h 11.12491 l -5.56243,-8.34367 z"
     id="path28819" />
  <path
     style="fill:#62a0ea;fill-opacity:1;stroke:none;stroke-width:0.417183px;stroke-linecap:butt;stroke-linejoin:miter;stroke-opacity:1"
     d="m 596.57231,135.15503 h 16.68733 l -8.34366,-12.5155 z"
     id="path24642" />
  <circle
     style="opacity:1;fill:#99c1f1;fill-opacity:1;stroke:none;stroke-width:0.834367;stroke-linecap:round;stroke-linejoin:round;stroke-miterlimit:4;stroke-dasharray:0.834367, 1.66873;stroke-dashoffset:0;stop-color:#000000"
     id="path29018"
     cx="611.59088"
     cy="118.46769"
     r="4.1718345" />
  <g
     style="display:inline;stroke-width:0.246154;enable-background:new"
     id="g81587"
     transform="matrix(2,0,0,2,726.9651,-466.99084)"
     inkscape:label="buffer clipboard cut scissors">
    <title
       id="title81579">cut</title>
    <rect
       y="279.99542"
       x="8.0174503"
       height="16"
       width="16"
       id="rect81581"
       style="opacity:0.02;fill:none;stroke:none;stroke-width:0.246154" />
    <g
       id="g8568"
       transform="translate(-1533.7749,-2869.9187)"
       style="stroke-width:0.246154">
      <path
         d="m 1546.2924,3151.9141 a 2.5,2.5 0 0 0 0,5 c 0.446,0 0.856,-0.14 1.218,-0.344 l 1.97,1.844 -1.97,1.843 a 2.473,2.473 0 0 0 -1.218,-0.343 2.5,2.5 0 1 0 2.5,2.5 c 0,-0.23 -0.036,-0.446 -0.094,-0.657 l 2.124,-2.062 4.469,4.219 h 1.501 v -1 l -8.094,-7.844 a 2.46,2.46 0 0 0 0.094,-0.656 2.5,2.5 0 0 0 -2.5,-2.5 z m 0,1.5 a 1,1 0 1 1 0,2 1,1 0 0 1 0,-2 z m 9,-0.5 -3.938,3.718 1.313,1.282 4.125,-4 v -1 z m -9,8.5 a 1,1 0 1 1 0,2 1,1 0 0 1 0,-2 z"
         style="isolation:auto;mix-blend-mode:normal;fill:#ffffff;fill-opacity:1;stroke-width:0.0615385"
         color="#000000"
         overflow="visible"
         fill="#474747"
         id="path8488" />
    </g>
  </g>
  <g
     style="display:inline;stroke-width:0.246154;enable-background:new"
     inkscape:label="buffer clipboard paste"
     id="g41006"
     transform="matrix(2,0,0,2,546,-942.99999)">
    <title
       id="title91430">clipboard</title>
    <rect
       width="16"
       height="16"
       x="-96"
       y="518"
       id="rect41008"
       style="color:#bebebe;display:inline;overflow:visible;visibility:visible;fill:none;stroke:none;stroke-width:0.246154;marker:none;enable-background:new"
       transform="scale(-1,1)" />
    <path
       sodipodi:nodetypes="ccccccc"
       id="rect4897"
       d="m 84.031245,523.03127 v 6.96874 h 5.000005 l 1.990842,-1.98705 -0.0221,-4.98168 h -6.96875 z"
       style="fill:#ffffff;fill-opacity:1;stroke:none;stroke-width:0.246154"
       inkscape:connector-curvature="0" />
    <rect
       style="fill:#ffffff;fill-opacity:1;stroke:none;stroke-width:0.246154"
       id="rect4899"
       width="5.0625052"
       height="4"
       x="84.999992"
       y="518"
       rx="0.1305429"
       ry="0.1305429" />
    <path
       style="color:#000000;fill:#ffffff;stroke-width:0.246154;-inkscape-stroke:none"
       d="m 82.5,519 c -0.293087,0 -0.65845,0.038 -1.011719,0.31445 -0.353268,0.27647 -0.519531,0.7668 -0.519531,1.12305 v 12.03125 c 0,0.384 0.131596,0.80345 0.441406,1.11328 0.309811,0.30983 0.780262,0.4531 1.189453,0.41211 L 82.5,534 h 9.96875 c 0.362847,0 0.746251,-0.12202 1.048828,-0.40039 C 93.820155,533.32124 94,532.88305 94,532.46875 V 520.375 c 0,-0.33333 -0.132606,-0.73935 -0.419922,-1.00977 C 93.292763,519.09482 92.924851,519 92.625,519 h -1.65625 v 2 H 92 v 11 h -9.03125 v -11 h 0.96875 v -2 z"
       id="path41043" />
  </g>
  <g
     style="display:inline;stroke-width:0.246154;enable-background:new"
     transform="matrix(2,0,0,2,509,-943)"
     id="g41067"
     inkscape:label="copy clipboard buffer">
    <title
       id="title91432">copy</title>
    <rect
       transform="scale(-1,1)"
       style="color:#bebebe;display:inline;overflow:visible;visibility:visible;fill:none;stroke:none;stroke-width:0.246154;marker:none;enable-background:new"
       id="rect41069"
       y="518"
       x="-96"
       height="16"
       width="16" />
    <path
       inkscape:connector-curvature="0"
       style="fill:#ffffff;fill-opacity:1;stroke:none;stroke-width:0.246154"
       d="m 86.99415,533.00001 h 5 l 2,-2 v -6 h -7 z"
       id="path41071"
       sodipodi:nodetypes="cccccc" />
    <path
       sodipodi:nodetypes="ccccccc"
       id="path41077"
       d="m 81.99415,528.00001 h 4 v -4 h 3 v -4 L 82.000001,520 Z"
       style="fill:#ffffff;fill-opacity:1;stroke:none;stroke-width:0.246154"
       inkscape:connector-curvature="0" />
  </g>
  <path
     style="fill:none;stroke:#3584e4;stroke-width:1.00112px;stroke-linecap:butt;stroke-linejoin:miter;stroke-opacity:1"
     d="M 11,20.460521 H 239.30591"
     id="path6063" />
  <path
     style="fill:none;stroke:#3584e4;stroke-width:0.944008px;stroke-linecap:butt;stroke-linejoin:miter;stroke-opacity:1"
     d="M 435,74.5 H 638"
     id="path7744" />
  <path
     id="rect7848"
     style="fill:#3584e4;stroke-linecap:round;stroke-linejoin:round;stop-color:#000000"
     d="m 437.0423,71.528852 v 5.826176 l -2.91308,-2.913084 z"
     sodipodi:nodetypes="cccc" />
  <path
     id="path8130"
     style="fill:#3584e4;stroke-linecap:round;stroke-linejoin:round;stop-color:#000000"
     d="m 636.12922,71.528852 v 5.826176 l 2.91308,-2.913084 z"
     sodipodi:nodetypes="cccc" />
  <path
     id="rect7848-3"
     style="fill:#3584e4;stroke-linecap:round;stroke-linejoin:round;stop-color:#000000"
     d="m 13.0423,17.528852 v 5.826176 l -2.91308,-2.913084 z"
     sodipodi:nodetypes="cccc" />
  <path
     id="rect7848-6"
     style="fill:#3584e4;stroke-linecap:round;stroke-linejoin:round;stop-color:#000000"
     d="m 236.94117,17.528852 v 5.826176 l 2.91308,-2.913084 z"
     sodipodi:nodetypes="cccc" />
  <path
     style="fill:none;stroke:#3584e4;stroke-width:1;stroke-linecap:butt;stroke-linejoin:miter;stroke-miterlimit:4;stroke-dasharray:none;stroke-opacity:1"
     d="m 264.5,182.00001 -2e-5,-104.516504"
     id="path8252"
     sodipodi:nodetypes="cc" />
  <path
     id="rect7848-7"
     style="fill:#3584e4;stroke-linecap:round;stroke-linejoin:round;stop-color:#000000"
     d="m 267.44795,79.999996 -5.82618,4e-6 2.91309,-2.913079 z"
     sodipodi:nodetypes="cccc" />
  <path
     id="rect7848-7-5"
     style="fill:#3584e4;stroke-linecap:round;stroke-linejoin:round;stop-color:#000000"
     d="m 267.44795,179.99317 h -5.82618 l 2.91309,2.91308 z"
     sodipodi:nodetypes="cccc" />
</svg>
