<?xml version="1.0" encoding="UTF-8" standalone="no"?>
<svg
   inkscape:version="1.1 (c68e22c387, 2021-05-23)"
   id="svg8"
   version="1.1"
   viewBox="0 0 230 140"
   height="140"
   width="230"
   sodipodi:docname="guidelines-accessibility.svg"
   xmlns:inkscape="http://www.inkscape.org/namespaces/inkscape"
   xmlns:sodipodi="http://sodipodi.sourceforge.net/DTD/sodipodi-0.dtd"
   xmlns="http://www.w3.org/2000/svg"
   xmlns:svg="http://www.w3.org/2000/svg"
   xmlns:rdf="http://www.w3.org/1999/02/22-rdf-syntax-ns#">
  <defs
     id="defs2">
    <clipPath
       clipPathUnits="userSpaceOnUse"
       id="clipPath28924">
      <rect
         style="fill:#99c1f1;stroke:none;stroke-width:4.7625;stroke-linecap:round;stroke-dashoffset:26.4"
         id="rect28926"
         width="60.854164"
         height="37.041683"
         x="223.57289"
         y="113.77081"
         ry="2.1166666"
         rx="2.1166666" />
    </clipPath>
    <inkscape:path-effect
       effect="fillet_chamfer"
       id="path-effect51438"
       is_visible="true"
       lpeversion="1"
       satellites_param="F,0,0,1,0,0,0,1 @ F,0,0,1,0,0,0,1 @ F,0,0,1,0,0,0,1 @ F,0,0,1,0,2,0,1"
       unit="px"
       method="auto"
       mode="F"
       radius="8"
       chamfer_steps="1"
       flexible="false"
       use_knot_distance="true"
       apply_no_radius="true"
       apply_with_radius="true"
       only_selected="false"
       hide_knots="false" />
    <clipPath
       clipPathUnits="userSpaceOnUse"
       id="clipPath40461">
      <rect
         style="fill:#99c1f1;stroke:none;stroke-width:4.7625;stroke-linecap:round;stroke-dashoffset:26.4"
         id="rect40463"
         width="60.854164"
         height="37.041683"
         x="223.57289"
         y="163.24783"
         ry="2.1166666"
         rx="2.1166666" />
    </clipPath>
    <clipPath
       clipPathUnits="userSpaceOnUse"
       id="clipPath53720">
      <rect
         style="fill:#99c1f1;stroke:none;stroke-width:4.7625;stroke-linecap:round;stroke-dashoffset:26.4"
         id="rect53722"
         width="60.854168"
         height="37.041683"
         x="-47.603741"
         y="164.65617"
         ry="2.1166666"
         rx="2.1166666" />
    </clipPath>
    <clipPath
       id="c-9">
      <path
         d="M 0,0 H 1024 V 800 H 0 Z"
         id="path64878" />
    </clipPath>
    <mask
       id="b-90">
      <g
         filter="url(#a)"
         id="g64875"
         style="filter:url(#a-4)">
        <path
           d="M 0,0 H 16 V 16 H 0 Z"
           fill-opacity="0.3"
           id="path64873" />
      </g>
    </mask>
    <filter
       id="a-4"
       height="1"
       width="1"
       x="0"
       y="0">
      <feColorMatrix
         in="SourceGraphic"
         type="matrix"
         values="0 0 0 0 1 0 0 0 0 1 0 0 0 0 1 0 0 0 1 0"
         id="feColorMatrix64870" />
    </filter>
    <clipPath
       id="e-7">
      <path
         d="M 0,0 H 1024 V 800 H 0 Z"
         id="path64886" />
    </clipPath>
    <mask
       id="d-1">
      <g
         filter="url(#a)"
         id="g64883"
         style="filter:url(#a-4)">
        <path
           d="M 0,0 H 16 V 16 H 0 Z"
           fill-opacity="0.05"
           id="path64881" />
      </g>
    </mask>
    <filter
       id="filter7691"
       height="1"
       width="1"
       x="0"
       y="0">
      <feColorMatrix
         in="SourceGraphic"
         type="matrix"
         values="0 0 0 0 1 0 0 0 0 1 0 0 0 0 1 0 0 0 1 0"
         id="feColorMatrix7689" />
    </filter>
    <clipPath
       id="g-1">
      <path
         d="M 0,0 H 1024 V 800 H 0 Z"
         id="path64894" />
    </clipPath>
    <mask
       id="f-7">
      <g
         filter="url(#a)"
         id="g64891"
         style="filter:url(#a-4)">
        <path
           d="M 0,0 H 16 V 16 H 0 Z"
           fill-opacity="0.05"
           id="path64889" />
      </g>
    </mask>
    <filter
       id="filter7700"
       height="1"
       width="1"
       x="0"
       y="0">
      <feColorMatrix
         in="SourceGraphic"
         type="matrix"
         values="0 0 0 0 1 0 0 0 0 1 0 0 0 0 1 0 0 0 1 0"
         id="feColorMatrix7698" />
    </filter>
    <clipPath
       id="i-5">
      <path
         d="M 0,0 H 1024 V 800 H 0 Z"
         id="path64902" />
    </clipPath>
    <mask
       id="h-1">
      <g
         filter="url(#a)"
         id="g64899"
         style="filter:url(#a-4)">
        <path
           d="M 0,0 H 16 V 16 H 0 Z"
           fill-opacity="0.05"
           id="path64897" />
      </g>
    </mask>
    <filter
       id="filter7709"
       height="1"
       width="1"
       x="0"
       y="0">
      <feColorMatrix
         in="SourceGraphic"
         type="matrix"
         values="0 0 0 0 1 0 0 0 0 1 0 0 0 0 1 0 0 0 1 0"
         id="feColorMatrix7707" />
    </filter>
    <clipPath
       id="k-77">
      <path
         d="M 0,0 H 1024 V 800 H 0 Z"
         id="path64910" />
    </clipPath>
    <mask
       id="j-9">
      <g
         filter="url(#a)"
         id="g64907"
         style="filter:url(#a-4)">
        <path
           d="M 0,0 H 16 V 16 H 0 Z"
           fill-opacity="0.05"
           id="path64905" />
      </g>
    </mask>
    <filter
       id="filter7718"
       height="1"
       width="1"
       x="0"
       y="0">
      <feColorMatrix
         in="SourceGraphic"
         type="matrix"
         values="0 0 0 0 1 0 0 0 0 1 0 0 0 0 1 0 0 0 1 0"
         id="feColorMatrix7716" />
    </filter>
    <clipPath
       id="m-7">
      <path
         d="M 0,0 H 1024 V 800 H 0 Z"
         id="path64918" />
    </clipPath>
    <mask
       id="l-6">
      <g
         filter="url(#a)"
         id="g64915"
         style="filter:url(#a-4)">
        <path
           d="M 0,0 H 16 V 16 H 0 Z"
           fill-opacity="0.05"
           id="path64913" />
      </g>
    </mask>
    <filter
       id="filter7727"
       height="1"
       width="1"
       x="0"
       y="0">
      <feColorMatrix
         in="SourceGraphic"
         type="matrix"
         values="0 0 0 0 1 0 0 0 0 1 0 0 0 0 1 0 0 0 1 0"
         id="feColorMatrix7725" />
    </filter>
    <clipPath
       id="o-5">
      <path
         d="M 0,0 H 1024 V 800 H 0 Z"
         id="path64926" />
    </clipPath>
    <mask
       id="n-36">
      <g
         filter="url(#a)"
         id="g64923"
         style="filter:url(#a-4)">
        <path
           d="M 0,0 H 16 V 16 H 0 Z"
           fill-opacity="0.05"
           id="path64921" />
      </g>
    </mask>
    <filter
       id="filter7736"
       height="1"
       width="1"
       x="0"
       y="0">
      <feColorMatrix
         in="SourceGraphic"
         type="matrix"
         values="0 0 0 0 1 0 0 0 0 1 0 0 0 0 1 0 0 0 1 0"
         id="feColorMatrix7734" />
    </filter>
    <clipPath
       id="q-9">
      <path
         d="M 0,0 H 1024 V 800 H 0 Z"
         id="path64934" />
    </clipPath>
    <mask
       id="p-63">
      <g
         filter="url(#a)"
         id="g64931"
         style="filter:url(#a-4)">
        <path
           d="M 0,0 H 16 V 16 H 0 Z"
           fill-opacity="0.3"
           id="path64929" />
      </g>
    </mask>
    <filter
       id="filter7745"
       height="1"
       width="1"
       x="0"
       y="0">
      <feColorMatrix
         in="SourceGraphic"
         type="matrix"
         values="0 0 0 0 1 0 0 0 0 1 0 0 0 0 1 0 0 0 1 0"
         id="feColorMatrix7743" />
    </filter>
    <clipPath
       id="s-8">
      <path
         d="M 0,0 H 1024 V 800 H 0 Z"
         id="path64942" />
    </clipPath>
    <mask
       id="r-4">
      <g
         filter="url(#a)"
         id="g64939"
         style="filter:url(#a-4)">
        <path
           d="M 0,0 H 16 V 16 H 0 Z"
           fill-opacity="0.5"
           id="path64937" />
      </g>
    </mask>
    <filter
       id="filter7754"
       height="1"
       width="1"
       x="0"
       y="0">
      <feColorMatrix
         in="SourceGraphic"
         type="matrix"
         values="0 0 0 0 1 0 0 0 0 1 0 0 0 0 1 0 0 0 1 0"
         id="feColorMatrix7752" />
    </filter>
    <clipPath
       id="u-9">
      <path
         d="M 0,0 H 1024 V 800 H 0 Z"
         id="path64950" />
    </clipPath>
    <mask
       id="t-12">
      <g
         filter="url(#a)"
         id="g64947"
         style="filter:url(#a-4)">
        <path
           d="M 0,0 H 16 V 16 H 0 Z"
           fill-opacity="0.4"
           id="path64945" />
      </g>
    </mask>
    <filter
       id="filter7763"
       height="1"
       width="1"
       x="0"
       y="0">
      <feColorMatrix
         in="SourceGraphic"
         type="matrix"
         values="0 0 0 0 1 0 0 0 0 1 0 0 0 0 1 0 0 0 1 0"
         id="feColorMatrix7761" />
    </filter>
    <clipPath
       id="w-90">
      <path
         d="M 0,0 H 1024 V 800 H 0 Z"
         id="path64958" />
    </clipPath>
    <mask
       id="v-3">
      <g
         filter="url(#a)"
         id="g64955"
         style="filter:url(#a-4)">
        <path
           d="M 0,0 H 16 V 16 H 0 Z"
           fill-opacity="0.4"
           id="path64953" />
      </g>
    </mask>
    <filter
       id="filter7772"
       height="1"
       width="1"
       x="0"
       y="0">
      <feColorMatrix
         in="SourceGraphic"
         type="matrix"
         values="0 0 0 0 1 0 0 0 0 1 0 0 0 0 1 0 0 0 1 0"
         id="feColorMatrix7770" />
    </filter>
    <clipPath
       id="y-8">
      <path
         d="M 0,0 H 1024 V 800 H 0 Z"
         id="path64966" />
    </clipPath>
    <mask
       id="x-8">
      <g
         filter="url(#a)"
         id="g64963"
         style="filter:url(#a-4)">
        <path
           d="M 0,0 H 16 V 16 H 0 Z"
           fill-opacity="0.5"
           id="path64961" />
      </g>
    </mask>
    <filter
       id="filter7781"
       height="1"
       width="1"
       x="0"
       y="0">
      <feColorMatrix
         in="SourceGraphic"
         type="matrix"
         values="0 0 0 0 1 0 0 0 0 1 0 0 0 0 1 0 0 0 1 0"
         id="feColorMatrix7779" />
    </filter>
    <clipPath
       id="A-0">
      <path
         d="M 0,0 H 1024 V 800 H 0 Z"
         id="path64974" />
    </clipPath>
    <mask
       id="z-5">
      <g
         filter="url(#a)"
         id="g64971"
         style="filter:url(#a-4)">
        <path
           d="M 0,0 H 16 V 16 H 0 Z"
           fill-opacity="0.5"
           id="path64969" />
      </g>
    </mask>
    <filter
       id="filter7790"
       height="1"
       width="1"
       x="0"
       y="0">
      <feColorMatrix
         in="SourceGraphic"
         type="matrix"
         values="0 0 0 0 1 0 0 0 0 1 0 0 0 0 1 0 0 0 1 0"
         id="feColorMatrix7788" />
    </filter>
  </defs>
  <sodipodi:namedview
     units="px"
     borderlayer="true"
     inkscape:showpageshadow="false"
     showgrid="true"
     inkscape:document-rotation="0"
     inkscape:current-layer="layer1"
     inkscape:document-units="px"
     inkscape:cy="560"
     inkscape:cx="400"
     inkscape:zoom="0.35"
     inkscape:pageshadow="2"
     inkscape:pageopacity="0"
     borderopacity="1"
     bordercolor="#383838"
     pagecolor="#1f1f1f"
     id="base"
     inkscape:pagecheckerboard="1"
     width="230px">
    <inkscape:grid
       type="xygrid"
       id="grid1900" />
  </sodipodi:namedview>
  <metadata
     id="metadata5">
    <rdf:RDF />
  </metadata>
  <g
     id="layer1"
     inkscape:groupmode="layer"
     inkscape:label="Layer 1">
    <rect
       style="fill:#99c1f1;stroke:none;stroke-width:18;stroke-linecap:round;stroke-dashoffset:26.4"
       id="rect1098"
       width="229.99998"
       height="140.00005"
       x="0.0010986328"
       y="-5.7220459e-05"
       ry="7.999999"
       rx="7.999999" />
    <g
       id="g3764"
       transform="translate(-32.65979,-39.999229)">
      <circle
         style="fill:#ffffff;fill-opacity:1;stroke:none;stroke-width:2.6809;stroke-linecap:round;stroke-linejoin:round;stroke-dashoffset:26.4;stroke-opacity:1"
         id="path101188"
         cx="147.65979"
         cy="109.99923"
         r="34.999081" />
      <g
         id="g101164-4"
         transform="matrix(1.8897617,0,0,1.8897617,-214.33982,-425.9993)"
         style="fill:#99c1f1;fill-opacity:1">
        <rect
           style="fill:#99c1f1;fill-opacity:1;stroke:none;stroke-width:1.05833;stroke-linecap:round;stroke-linejoin:round;stroke-dashoffset:26.4;stroke-opacity:1"
           id="rect100281-3"
           width="18.520853"
           height="2.6458435"
           x="182.5625"
           y="280.45834"
           rx="1.3229218"
           ry="1.3229218" />
        <rect
           style="fill:#99c1f1;fill-opacity:1;stroke:none;stroke-width:1.05833;stroke-linecap:round;stroke-linejoin:round;stroke-dashoffset:26.4;stroke-opacity:1"
           id="rect100587-5"
           width="10.583347"
           height="2.6458309"
           x="284.42709"
           y="-195.79167"
           rx="1.3229154"
           ry="1.3229154"
           transform="rotate(90)" />
        <rect
           style="fill:#99c1f1;fill-opacity:1;stroke:none;stroke-width:1.05833;stroke-linecap:round;stroke-linejoin:round;stroke-dashoffset:26.4;stroke-opacity:1"
           id="rect100589-1"
           width="7.4083257"
           height="7.937541"
           x="280.98752"
           y="-195.79172"
           transform="rotate(90)" />
        <circle
           style="fill:#99c1f1;fill-opacity:1;stroke:none;stroke-width:1.05833;stroke-linecap:round;stroke-linejoin:round;stroke-dashoffset:26.4;stroke-opacity:1"
           id="path100715-7"
           cx="191.82291"
           cy="275.82816"
           r="3.3072908" />
        <rect
           style="fill:#99c1f1;fill-opacity:1;stroke:none;stroke-width:1.05833;stroke-linecap:round;stroke-linejoin:round;stroke-dashoffset:26.4;stroke-opacity:1"
           id="rect101119-4"
           width="10.583347"
           height="2.6458309"
           x="284.42709"
           y="-190.50002"
           rx="1.3229154"
           ry="1.3229154"
           transform="rotate(90)" />
      </g>
    </g>
  </g>
</svg>
