<?xml version="1.0" encoding="UTF-8" standalone="no"?>
<svg
   id="svg4749"
   version="1.1"
   viewBox="0 0 640 639.99997"
   height="639.99994"
   width="640"
   xmlns:xlink="http://www.w3.org/1999/xlink"
   xmlns="http://www.w3.org/2000/svg"
   xmlns:svg="http://www.w3.org/2000/svg"
   xmlns:rdf="http://www.w3.org/1999/02/22-rdf-syntax-ns#"
   xmlns:cc="http://creativecommons.org/ns#"
   xmlns:dc="http://purl.org/dc/elements/1.1/">
  <defs
     id="defs4743">
    <linearGradient
       id="linearGradient7499">
      <stop
         id="stop7493"
         offset="0"
         style="stop-color:#ffffff;stop-opacity:1" />
      <stop
         style="stop-color:#ffffff;stop-opacity:1"
         offset="0.51911587"
         id="stop7501" />
      <stop
         style="stop-color:#cfcfcf;stop-opacity:1"
         offset="0.73353505"
         id="stop7495" />
      <stop
         id="stop7497"
         offset="1"
         style="stop-color:#dcdcdc;stop-opacity:1" />
    </linearGradient>
    <linearGradient
       xlink:href="#linearGradient963"
       id="linearGradient965"
       x1="85"
       y1="107.16245"
       x2="85"
       y2="86"
       gradientUnits="userSpaceOnUse"
       gradientTransform="matrix(-4.2685269,0,0,4.2685269,5064.2593,-5723.5108)" />
    <linearGradient
       id="linearGradient963">
      <stop
         style="stop-color:#eef4fc;stop-opacity:1"
         offset="0"
         id="stop959" />
      <stop
         style="stop-color:#ffffff;stop-opacity:1"
         offset="1"
         id="stop961" />
    </linearGradient>
    <clipPath
       id="clipPath11198"
       clipPathUnits="userSpaceOnUse">
      <path
         id="path11200"
         d="m 65,177 c -18.50154,0 -33.5,14.99846 -33.5,33.5 0.008,7.37145 4.131082,15.80669 11.38849,23.52632 l 12.616916,13.17089 h 19.513512 l 12.137511,-13.2457 C 93.791834,226.89349 98.485152,217.83546 98.499997,210.5 98.499997,191.99846 83.50154,177 65,177 Z"
         style="display:inline;opacity:1;vector-effect:none;fill:#ffffff;fill-opacity:1;stroke:none;stroke-width:2;stroke-linecap:butt;stroke-linejoin:miter;stroke-miterlimit:4;stroke-dasharray:none;stroke-dashoffset:0;stroke-opacity:1;marker:none;marker-start:none;marker-mid:none;marker-end:none;paint-order:normal;enable-background:new" />
    </clipPath>
    <radialGradient
       r="33.5"
       fy="48.406059"
       fx="79.090805"
       cy="48.406059"
       cx="79.090805"
       gradientTransform="matrix(0.00475673,1.6222755,-1.4341897,0.00421844,141.70247,-82.046953)"
       gradientUnits="userSpaceOnUse"
       id="radialGradient11187"
       xlink:href="#linearGradient7499" />
    <radialGradient
       r="12"
       fy="54.101654"
       fx="71.474297"
       cy="54.101654"
       cx="71.474297"
       gradientTransform="matrix(4.5060711,0,0,4.7666112,-259.30571,-59.705663)"
       gradientUnits="userSpaceOnUse"
       id="radialGradient11189"
       xlink:href="#linearGradient5325" />
    <linearGradient
       id="linearGradient5325">
      <stop
         style="stop-color:#ed686f;stop-opacity:1"
         offset="0"
         id="stop5321" />
      <stop
         id="stop5327"
         offset="0.86538714"
         style="stop-color:#a51d2d;stop-opacity:1" />
      <stop
         style="stop-color:#e01b24;stop-opacity:1"
         offset="1"
         id="stop5323" />
    </linearGradient>
    <radialGradient
       r="14.583125"
       fy="49.776543"
       fx="40.152252"
       cy="49.776543"
       cx="40.152252"
       gradientTransform="matrix(0.87016394,4.2786854,-2.5669336,0.52203845,148.39434,-163.30572)"
       gradientUnits="userSpaceOnUse"
       id="radialGradient11191"
       xlink:href="#linearGradient7489" />
    <linearGradient
       id="linearGradient7489">
      <stop
         style="stop-color:#ed686f;stop-opacity:1"
         offset="0"
         id="stop7483" />
      <stop
         id="stop7485"
         offset="0.91122276"
         style="stop-color:#a51d2d;stop-opacity:1" />
      <stop
         style="stop-color:#e01b24;stop-opacity:1"
         offset="1"
         id="stop7487" />
    </linearGradient>
    <radialGradient
       r="14.583125"
       fy="49.776543"
       fx="40.152252"
       cy="49.776543"
       cx="40.152252"
       gradientTransform="matrix(0.87016394,4.2786854,-2.5669336,0.52203845,148.39434,-163.30572)"
       gradientUnits="userSpaceOnUse"
       id="radialGradient11193"
       xlink:href="#linearGradient7489" />
  </defs>
  <metadata
     id="metadata4746">
    <rdf:RDF>
      <cc:Work
         rdf:about="">
        <dc:format>image/svg+xml</dc:format>
        <dc:type
           rdf:resource="http://purl.org/dc/dcmitype/StillImage" />
      </cc:Work>
    </rdf:RDF>
  </metadata>
  <g
     style="display:inline;opacity:1"
     id="layer2"
     transform="translate(-4480,-1160.0001)">
    <rect
       style="opacity:1;fill:#3584e4;fill-opacity:1;stroke:none;stroke-width:4.11145;stroke-linecap:round;stroke-linejoin:miter;stroke-miterlimit:4;stroke-dasharray:none;stroke-dashoffset:0;stroke-opacity:1;marker:none;marker-start:none;marker-mid:none;marker-end:none;paint-order:normal"
       id="rect29492"
       width="640"
       height="640"
       x="4480"
       y="1160" />
  </g>
  <g
     style="opacity:1"
     transform="translate(-4480,5717.4802)"
     id="layer1">
    <path
       style="display:inline;opacity:1;fill:url(#linearGradient965);fill-opacity:1;stroke:none;stroke-width:2.56111;stroke-linecap:round;stroke-linejoin:round;stroke-miterlimit:4;stroke-dasharray:none;stroke-dashoffset:1;stroke-opacity:1;enable-background:new"
       d="m 4654.4809,-5450.3253 c 33.3461,0.051 63.6157,19.4905 77.5086,49.8046 9.0315,-4.6558 19.0435,-7.0978 29.2045,-7.1196 33.6813,0.051 61.5712,26.1609 63.8112,59.7681 0.07,0 0.1451,0 0.2168,0 23.5744,0 42.6852,19.1104 42.6852,42.6848 0,23.5746 -19.1108,42.6854 -42.6852,42.6854 h -239.0375 a 51.222319,51.222319 0 0 1 -51.2224,-51.2224 51.222319,51.222319 0 0 1 34.2983,-48.288 c -0.066,-0.9762 -0.1174,-1.956 -0.1494,-2.9341 0,-47.1491 38.2219,-85.3705 85.3707,-85.3705 z"
       id="path1781" />
    <path
       id="path11173"
       d="m 4836.7885,-5204.0484 v 35.7169 c 0,9.9226 7.9846,17.907 17.9072,17.907 h 48.4755 c 9.9226,0 15.8257,-8.2052 17.9072,-17.907 v -35.7169 z"
       style="display:inline;opacity:1;vector-effect:none;fill:#e5a50a;fill-opacity:1;stroke:none;stroke-width:6.2249;stroke-linecap:butt;stroke-linejoin:miter;stroke-miterlimit:4;stroke-dasharray:none;stroke-dashoffset:0;stroke-opacity:1;marker:none;marker-start:none;marker-mid:none;marker-end:none;paint-order:normal;enable-background:new" />
    <g
       transform="matrix(5.7475484,0,0,5.4034103,4505.3429,-6570.4147)"
       id="g11185"
       clip-path="url(#clipPath11198)"
       style="display:inline;enable-background:new">
      <path
         clip-path="none"
         id="path11177"
         transform="translate(-8,156)"
         d="M 73,21 C 54.498461,21 39.5,35.998461 39.5,54.5 39.508,61.871447 43,68.921599 46.439453,74.878906 L 58,98 H 88 L 99.605469,74.789062 C 103,68.909562 106.48515,61.835464 106.5,54.5 106.5,35.998461 91.501539,21 73,21 Z"
         style="display:inline;opacity:1;vector-effect:none;fill:url(#radialGradient11187);fill-opacity:1;stroke:none;stroke-width:2;stroke-linecap:butt;stroke-linejoin:miter;stroke-miterlimit:4;stroke-dasharray:none;stroke-dashoffset:0;stroke-opacity:1;marker:none;marker-start:none;marker-mid:none;marker-end:none;paint-order:normal;enable-background:new" />
      <path
         style="display:inline;fill:url(#radialGradient11189);fill-opacity:1;stroke:none;stroke-width:1px;stroke-linecap:butt;stroke-linejoin:miter;stroke-opacity:1;enable-background:new"
         d="m 64,177 c 0,0 -18.331617,12.13179 -18.331617,30.98893 0,14.57143 16.174111,46.01107 16.174111,46.01107 h 5.157325 c 0,0 1.333167,-31.43964 1.333167,-46.01107 C 68.333034,189.13179 64,177 64,177 Z"
         id="path11179" />
      <path
         transform="translate(-7.9999999,156)"
         style="display:inline;opacity:1;vector-effect:none;fill:url(#radialGradient11191);fill-opacity:1;stroke:none;stroke-width:1px;stroke-linecap:butt;stroke-linejoin:miter;stroke-miterlimit:4;stroke-dasharray:none;stroke-dashoffset:0;stroke-opacity:1;enable-background:new"
         d="M 71.982571,21.106094 C 63.776022,21.25323 55.655484,24.39116 49.482387,29.800593 43.309289,35.210025 39.132344,42.848276 37.90901,50.964466 c -1.239689,8.224699 0.566762,16.873559 4.994909,23.91444 L 61.901879,98 h 6.431867 L 55.001598,81.27034 C 50.701984,75.87503 46.529808,70.200459 44.406477,63.636351 42.283145,57.072243 42.239978,49.836938 44.408707,43.287689 46.368498,37.369404 50.067116,32.03858 54.924765,28.13088 59.782414,24.223179 65.78184,21.752481 71.982571,21.106094 Z"
         id="path11181" />
      <path
         transform="matrix(-1,0,0,1,137.15979,155.82322)"
         style="display:inline;opacity:1;vector-effect:none;fill:url(#radialGradient11193);fill-opacity:1;stroke:none;stroke-width:1px;stroke-linecap:butt;stroke-linejoin:miter;stroke-miterlimit:4;stroke-dasharray:none;stroke-dashoffset:0;stroke-opacity:1;enable-background:new"
         d="m 73.003296,21.3035 c -7.708847,-1.547515 -15.970879,-0.154829 -22.746454,3.834246 -6.775574,3.989075 -12.00209,10.537683 -14.389282,18.029175 -1.722287,5.404886 -1.986649,11.266801 -0.757865,16.804775 1.228784,5.537974 3.947599,10.737973 7.794224,14.90721 L 54.110913,98 H 67.493541 L 54.161393,74.356491 C 51.292915,69.269472 48.603997,63.949926 47.734189,58.175035 46.864381,52.400144 47.7702,46.403902 50.108455,41.052408 54.28139,31.501939 62.943857,24.029764 73.003296,21.3035 Z"
         id="path11183" />
    </g>
    <path
       id="path14907"
       d="m 4836.7885,-5211.7111 v 35.7169 c 0,9.9225 7.9846,17.907 17.9072,17.907 h 48.4755 c 9.9226,0 15.8257,-8.2053 17.9072,-17.907 v -35.7169 z"
       style="display:inline;opacity:1;vector-effect:none;fill:#e5a50a;fill-opacity:1;stroke:none;stroke-width:6.2249;stroke-linecap:butt;stroke-linejoin:miter;stroke-miterlimit:4;stroke-dasharray:none;stroke-dashoffset:0;stroke-opacity:1;marker:none;marker-start:none;marker-mid:none;marker-end:none;paint-order:normal;enable-background:new" />
    <path
       id="rect14909"
       d="m 4890.4275,-5211.7111 v 53.6239 h 12.7437 c 9.9226,0 15.8257,-8.2053 17.9072,-17.907 v -35.7169 z"
       style="display:inline;opacity:1;vector-effect:none;fill:#f3af0b;fill-opacity:1;stroke:none;stroke-width:7.66272;stroke-linecap:butt;stroke-linejoin:miter;stroke-miterlimit:4;stroke-dasharray:none;stroke-dashoffset:0;stroke-opacity:1;marker:none;marker-start:none;marker-mid:none;marker-end:none;paint-order:normal;enable-background:new" />
  </g>
</svg>
