<?xml version="1.0" encoding="UTF-8" standalone="no"?>
<!-- Created with Inkscape (http://www.inkscape.org/) -->

<svg
   xmlns:dc="http://purl.org/dc/elements/1.1/"
   xmlns:cc="http://creativecommons.org/ns#"
   xmlns:rdf="http://www.w3.org/1999/02/22-rdf-syntax-ns#"
   xmlns:svg="http://www.w3.org/2000/svg"
   xmlns="http://www.w3.org/2000/svg"
   xmlns:sodipodi="http://sodipodi.sourceforge.net/DTD/sodipodi-0.dtd"
   xmlns:inkscape="http://www.inkscape.org/namespaces/inkscape"
   width="1200"
   height="800"
   viewBox="0 0 1200 800"
   version="1.1"
   id="svg1151"
   inkscape:version="0.92.2 2405546, 2018-03-11"
   sodipodi:docname="initial-setup-welcome.svg"
   inkscape:export-filename="/home/jimmac/SparkleShare/app-illustrations/initial-setup-welcome.png"
   inkscape:export-xdpi="96"
   inkscape:export-ydpi="96">
  <defs
     id="defs1145" />
  <sodipodi:namedview
     id="base"
     pagecolor="#ffffff"
     bordercolor="#666666"
     borderopacity="1.0"
     inkscape:pageopacity="0.0"
     inkscape:pageshadow="2"
     inkscape:zoom="1"
     inkscape:cx="599.29248"
     inkscape:cy="386.78033"
     inkscape:document-units="px"
     inkscape:current-layer="layer2"
     showgrid="false"
     units="px"
     borderlayer="true"
     inkscape:showpageshadow="false"
     inkscape:window-width="2560"
     inkscape:window-height="1403"
     inkscape:window-x="3440"
     inkscape:window-y="0"
     inkscape:window-maximized="1"
     inkscape:snap-nodes="false" />
  <metadata
     id="metadata1148">
    <rdf:RDF>
      <cc:Work
         rdf:about="">
        <dc:format>image/svg+xml</dc:format>
        <dc:type
           rdf:resource="http://purl.org/dc/dcmitype/StillImage" />
        <dc:title></dc:title>
      </cc:Work>
    </rdf:RDF>
  </metadata>
  <g
     inkscape:groupmode="layer"
     id="layer4"
     inkscape:label="window">
    <path
       sodipodi:nodetypes="ccccc"
       inkscape:connector-curvature="0"
       id="path4434"
       d="m 91.5,100.49998 h 1008 V 756.5 H 91.5 Z"
       style="color:#000000;display:inline;overflow:visible;visibility:visible;fill:#f2f2f2;fill-opacity:1;stroke:#bababa;stroke-width:1;stroke-opacity:1;marker:none;enable-background:accumulate" />
    <path
       style="color:#000000;display:inline;overflow:visible;visibility:visible;fill:#f2f2f2;fill-opacity:1;fill-rule:nonzero;stroke:#bababa;stroke-opacity:1;marker:none;enable-background:accumulate"
       d="m 99.5,53.500001 c 0,0 -8,0 -8,8.5 V 100.5 h 1008 V 63.500001 c 0,0 0,-10 -10,-10 z"
       id="rect9847"
       inkscape:connector-curvature="0"
       sodipodi:nodetypes="cccccsc" />
    <g
       id="g11282"
       transform="translate(375,-560)">
      <rect
         style="color:#000000;display:inline;overflow:visible;visibility:visible;opacity:1;fill:#4a90d9;fill-opacity:1;fill-rule:nonzero;stroke:#20568d;stroke-width:1;stroke-linecap:butt;stroke-linejoin:miter;stroke-miterlimit:4;stroke-dasharray:none;stroke-dashoffset:0;stroke-opacity:1;marker:none;enable-background:accumulate"
         id="rect1962"
         width="143"
         height="33"
         x="523.5"
         y="620.49994"
         rx="2.9999998"
         ry="3"
         inkscape:export-filename="/home/lapo.fedora/SparkleShare/gnome-mockups/content selection/content-selection.png"
         inkscape:export-xdpi="90"
         inkscape:export-ydpi="90" />
      <text
         id="text1966"
         y="641.77399"
         x="595.1275"
         style="font-style:normal;font-variant:normal;font-weight:normal;font-stretch:normal;font-size:14px;line-height:125%;font-family:Cantarell;-inkscape-font-specification:Cantarell;text-align:center;letter-spacing:0px;word-spacing:0px;text-anchor:middle;display:inline;opacity:1;fill:#ffffff;fill-opacity:1;stroke:none"
         xml:space="preserve"><tspan
           y="641.77399"
           x="595.1275"
           id="tspan1964"
           sodipodi:role="line">Get started</tspan></text>
    </g>
    <g
       style="display:inline;fill:#888a85"
       transform="translate(1067,69.000001)"
       id="g5223">
      <g
         transform="translate(-60,-518)"
         id="g5225"
         style="display:inline;fill:#888a85" />
      <g
         style="fill:#888a85"
         transform="translate(-60,-518)"
         id="g5227" />
      <g
         style="fill:#888a85"
         transform="translate(-60,-518)"
         id="g5229" />
      <g
         style="fill:#888a85"
         transform="translate(-60,-518)"
         id="g5231">
        <g
           transform="translate(19,-242)"
           id="g5233"
           style="display:inline;fill:#888a85">
          <path
             inkscape:connector-curvature="0"
             d="m 45,764 h 1 c 0.01037,-1.2e-4 0.02079,-4.6e-4 0.03125,0 0.254951,0.0112 0.50987,0.12858 0.6875,0.3125 L 49,766.59375 51.3125,764.3125 C 51.578125,764.082 51.759172,764.007 52,764 h 1 v 1 c 0,0.28647 -0.03434,0.55065 -0.25,0.75 l -2.28125,2.28125 2.25,2.25 C 52.906938,770.46942 52.999992,770.7347 53,771 v 1 h -1 c -0.265301,-10e-6 -0.530586,-0.0931 -0.71875,-0.28125 L 49,769.4375 46.71875,771.71875 C 46.530586,771.90694 46.26529,772 46,772 h -1 v -1 c -3e-6,-0.26529 0.09306,-0.53058 0.28125,-0.71875 l 2.28125,-2.25 L 45.28125,765.75 C 45.070508,765.55537 44.97809,765.28075 45,765 Z"
             id="path5235"
             style="color:#bebebe;font-style:normal;font-variant:normal;font-weight:normal;font-stretch:normal;font-size:medium;line-height:normal;font-family:'Andale Mono';-inkscape-font-specification:'Andale Mono';text-indent:0;text-align:start;text-decoration:none;text-decoration-line:none;letter-spacing:normal;word-spacing:normal;text-transform:none;writing-mode:lr-tb;direction:ltr;text-anchor:start;display:inline;overflow:visible;visibility:visible;fill:#2e3436;fill-opacity:1;fill-rule:nonzero;stroke:none;stroke-width:1.78124988;marker:none;enable-background:new" />
        </g>
      </g>
      <g
         style="fill:#888a85"
         transform="translate(-60,-518)"
         id="g5237" />
      <g
         style="fill:#888a85"
         transform="translate(-60,-518)"
         id="g5239" />
      <g
         style="fill:#888a85"
         transform="translate(-60,-518)"
         id="g5241" />
    </g>
    <path
       style="display:inline;opacity:0.1;fill:none;fill-rule:evenodd;stroke:#000000;stroke-width:1px;stroke-linecap:butt;stroke-linejoin:miter;stroke-opacity:1"
       d="M 1051.5,61.000001 V 93"
       id="path5738"
       inkscape:connector-curvature="0"
       sodipodi:nodetypes="cc" />
    <text
       xml:space="preserve"
       style="font-style:normal;font-weight:normal;font-size:40px;line-height:25px;font-family:sans-serif;letter-spacing:0px;word-spacing:0px;display:inline;fill:#2e3436;fill-opacity:1;stroke:none;stroke-width:1px;stroke-linecap:butt;stroke-linejoin:miter;stroke-opacity:1"
       x="595.72949"
       y="83"
       id="text5622"><tspan
         sodipodi:role="line"
         id="tspan5620"
         x="595.72949"
         y="83"
         style="font-style:normal;font-variant:normal;font-weight:bold;font-stretch:normal;font-size:14.66666698px;font-family:Cantarell;-inkscape-font-specification:Cantarell;text-align:center;text-anchor:middle;fill:#2e3436;fill-opacity:1">Welcome to GNOME</tspan></text>
  </g>
  <g
     inkscape:groupmode="layer"
     id="layer3"
     inkscape:label="bg"
     style="display:inline" />
  <g
     inkscape:groupmode="layer"
     id="layer2"
     inkscape:label="fills"
     style="display:inline;opacity:1">
    <text
       xml:space="preserve"
       style="font-style:normal;font-variant:normal;font-weight:800;font-stretch:normal;font-size:25.23888016px;line-height:1.25;font-family:Cantarell;-inkscape-font-specification:'Cantarell Ultra-Bold';font-variant-ligatures:normal;font-variant-caps:normal;font-variant-numeric:normal;font-feature-settings:normal;text-align:start;letter-spacing:4.84462452px;word-spacing:0px;writing-mode:lr-tb;text-anchor:start;display:inline;fill:#000000;fill-opacity:1;stroke:none;stroke-width:0.30278903"
       x="534.37946"
       y="571.66443"
       id="text12661"><tspan
         sodipodi:role="line"
         id="tspan12659"
         x="534.37946"
         y="571.66443"
         style="stroke-width:0.30278903">WELCOME</tspan></text>
    <circle
       r="135.23183"
       cy="381.31506"
       cx="609"
       id="circle12665"
       style="display:inline;opacity:1;vector-effect:none;fill:#cef8d7;fill-opacity:1;stroke:none;stroke-width:18.91353416;stroke-linecap:butt;stroke-linejoin:miter;stroke-miterlimit:4;stroke-dasharray:none;stroke-dashoffset:0;stroke-opacity:1;marker:none;marker-start:none;marker-mid:none;marker-end:none;paint-order:normal" />
    <circle
       style="display:inline;opacity:1;vector-effect:none;fill:#8ff0a4;fill-opacity:1;stroke:none;stroke-width:17.15414429;stroke-linecap:butt;stroke-linejoin:miter;stroke-miterlimit:4;stroke-dasharray:none;stroke-dashoffset:0;stroke-opacity:1;marker:none;marker-start:none;marker-mid:none;marker-end:none;paint-order:normal"
       id="path12663"
       cx="609"
       cy="381.31506"
       r="122.65213" />
    <rect
       style="opacity:1;vector-effect:none;fill:#26a269;fill-opacity:1;stroke:none;stroke-width:0.52951545px;stroke-linecap:butt;stroke-linejoin:miter;stroke-miterlimit:4;stroke-dasharray:none;stroke-dashoffset:0;stroke-opacity:1;marker:none;marker-start:none;marker-mid:none;marker-end:none;paint-order:normal"
       id="rect12397"
       width="68.836998"
       height="155.14801"
       x="575.97534"
       y="296.40207"
       rx="28.064318"
       ry="28.064318" />
    <path
       style="opacity:1;vector-effect:none;fill:#ffffff;fill-opacity:1;stroke:none;stroke-width:0.52951545px;stroke-linecap:butt;stroke-linejoin:miter;stroke-miterlimit:4;stroke-dasharray:none;stroke-dashoffset:0;stroke-opacity:1;marker:none;marker-start:none;marker-mid:none;marker-end:none;paint-order:normal"
       d="m 587.9526,320.75977 c -1.32545,0 -2.51155,1.1253 -2.51155,2.71385 l 0.0512,38.05884 c 0.65625,8.36739 7.63613,14.82352 16.02923,14.82643 8.3899,-0.007 15.03399,-6.46221 15.68999,-14.82643 h 0.0631 v -1.2576 l -0.0662,-21.99219 c 2.92645,-1.39751 5.94074,-2.72913 7.94274,-4.81998 l 0.0565,-9.98919 c 0,-1.8533 -1.44473,-2.71373 -2.70407,-2.71373 z"
       id="rect12399"
       inkscape:connector-curvature="0"
       sodipodi:nodetypes="cccccccccccc" />
    <g
       id="g12562"
       transform="matrix(0.35706304,0,0,0.35706304,465.43334,246.47362)">
      <circle
         r="10.69703"
         cy="255.59259"
         cx="516.45148"
         id="path12408"
         style="opacity:1;vector-effect:none;fill:#26a269;fill-opacity:1;stroke:none;stroke-width:44.27673721;stroke-linecap:butt;stroke-linejoin:miter;stroke-miterlimit:4;stroke-dasharray:none;stroke-dashoffset:0;stroke-opacity:1;marker:none;marker-start:none;marker-mid:none;marker-end:none;paint-order:normal" />
      <path
         sodipodi:nodetypes="cccccccc"
         inkscape:connector-curvature="0"
         id="path12410"
         d="m 516.22595,244.98115 h -55.53041 v 54.17264 h 9.40881 l 49.36927,-26.3731 c 4.12318,-2.38052 7.45874,-6.25438 7.45874,-12.91892 v -3.44247 z"
         style="opacity:1;vector-effect:none;fill:#26a269;fill-opacity:1;stroke:none;stroke-width:44.27673721;stroke-linecap:butt;stroke-linejoin:miter;stroke-miterlimit:4;stroke-dasharray:none;stroke-dashoffset:0;stroke-opacity:1;marker:none;marker-start:none;marker-mid:none;marker-end:none;paint-order:normal" />
    </g>
    <circle
       style="opacity:1;vector-effect:none;fill:#26a269;fill-opacity:1;stroke:none;stroke-width:2.88553047;stroke-linecap:butt;stroke-linejoin:miter;stroke-miterlimit:4;stroke-dasharray:none;stroke-dashoffset:0;stroke-opacity:1;marker:none;marker-start:none;marker-mid:none;marker-end:none;paint-order:normal"
       id="path12448"
       cx="594.22351"
       cy="332.33728"
       r="3.5069001" />
    <circle
       style="opacity:1;vector-effect:none;fill:#26a269;fill-opacity:1;stroke:none;stroke-width:0.92089635;stroke-linecap:butt;stroke-linejoin:miter;stroke-miterlimit:4;stroke-dasharray:none;stroke-dashoffset:0;stroke-opacity:1;marker:none;marker-start:none;marker-mid:none;marker-end:none;paint-order:normal"
       id="path12452"
       cx="602.45111"
       cy="425.07428"
       r="42.361233" />
    <path
       sodipodi:nodetypes="cccccccccccccccc"
       inkscape:connector-curvature="0"
       id="path12460"
       d="m 561.79216,388.04235 c -1.49021,-0.0774 -2.95804,0.0889 -4.33437,0.50057 -5.5053,1.64651 -9.85764,6.61532 -10.0732,12.86659 l -0.003,0.091 v 59.58083 h -4.50075 c -5.03017,-0.13237 -8.33964,5.42754 -8.33964,10.59031 h 23.43106 V 401.7601 c 0.0566,-1.42044 1.16981,-2.66664 2.52037,-3.07056 1.34762,-0.40306 2.61339,-0.55302 4.47502,2.30007 l 32.17014,57.14631 c 3.09158,-2.48835 6.0161,-5.42905 8.44328,-9.13415 l -31.61889,-53.6155 -0.0734,-0.11273 c -2.95913,-4.57319 -7.62548,-6.99891 -12.09612,-7.2312 z"
       style="color:#000000;font-style:normal;font-variant:normal;font-weight:normal;font-stretch:normal;font-size:medium;line-height:normal;font-family:sans-serif;font-variant-ligatures:normal;font-variant-position:normal;font-variant-caps:normal;font-variant-numeric:normal;font-variant-alternates:normal;font-feature-settings:normal;text-indent:0;text-align:start;text-decoration:none;text-decoration-line:none;text-decoration-style:solid;text-decoration-color:#000000;letter-spacing:normal;word-spacing:normal;text-transform:none;writing-mode:lr-tb;direction:ltr;text-orientation:mixed;dominant-baseline:auto;baseline-shift:baseline;text-anchor:start;white-space:normal;shape-padding:0;clip-rule:nonzero;display:inline;overflow:visible;visibility:visible;opacity:1;isolation:auto;mix-blend-mode:normal;color-interpolation:sRGB;color-interpolation-filters:linearRGB;solid-color:#000000;solid-opacity:1;vector-effect:none;fill:#26a269;fill-opacity:1;fill-rule:nonzero;stroke:none;stroke-width:10.59030819;stroke-linecap:butt;stroke-linejoin:miter;stroke-miterlimit:4;stroke-dasharray:none;stroke-dashoffset:0;stroke-opacity:1;marker:none;paint-order:normal;color-rendering:auto;image-rendering:auto;shape-rendering:auto;text-rendering:auto;enable-background:accumulate" />
    <path
       style="color:#000000;font-style:normal;font-variant:normal;font-weight:normal;font-stretch:normal;font-size:medium;line-height:normal;font-family:sans-serif;font-variant-ligatures:normal;font-variant-position:normal;font-variant-caps:normal;font-variant-numeric:normal;font-variant-alternates:normal;font-feature-settings:normal;text-indent:0;text-align:start;text-decoration:none;text-decoration-line:none;text-decoration-style:solid;text-decoration-color:#000000;letter-spacing:normal;word-spacing:normal;text-transform:none;writing-mode:lr-tb;direction:ltr;text-orientation:mixed;dominant-baseline:auto;baseline-shift:baseline;text-anchor:start;white-space:normal;shape-padding:0;clip-rule:nonzero;display:inline;overflow:visible;visibility:visible;opacity:1;isolation:auto;mix-blend-mode:normal;color-interpolation:sRGB;color-interpolation-filters:linearRGB;solid-color:#000000;solid-opacity:1;vector-effect:none;fill:#2ec27e;fill-opacity:1;fill-rule:nonzero;stroke:none;stroke-width:10.59030819;stroke-linecap:butt;stroke-linejoin:miter;stroke-miterlimit:4;stroke-dasharray:none;stroke-dashoffset:0;stroke-opacity:1;marker:none;paint-order:normal;color-rendering:auto;image-rendering:auto;shape-rendering:auto;text-rendering:auto;enable-background:accumulate"
       d="m 593.56309,388.04235 c -1.49022,-0.0774 -2.95805,0.0889 -4.33437,0.50057 -5.5053,1.64651 -9.85764,6.61532 -10.07321,12.86659 l -0.003,0.091 v 59.58083 h -4.50075 c -5.0304,-0.13237 -8.33987,5.42754 -8.33987,10.59031 h 23.43105 V 401.7601 c 0.0565,-1.42044 1.16982,-2.66664 2.52038,-3.07056 1.34762,-0.40306 2.61339,-0.55302 4.47503,2.30007 l 32.17012,57.14631 c 3.09159,-2.48835 6.01611,-5.42905 8.44329,-9.13415 l -31.6189,-53.6155 -0.0734,-0.11273 c -2.95912,-4.57319 -7.62547,-6.99891 -12.09612,-7.2312 z"
       id="path12454"
       inkscape:connector-curvature="0"
       sodipodi:nodetypes="cccccccccccccccc" />
    <circle
       r="3.5069001"
       cy="332.33728"
       cx="605.59247"
       id="circle12568"
       style="opacity:1;vector-effect:none;fill:#26a269;fill-opacity:1;stroke:none;stroke-width:2.88553047;stroke-linecap:butt;stroke-linejoin:miter;stroke-miterlimit:4;stroke-dasharray:none;stroke-dashoffset:0;stroke-opacity:1;marker:none;marker-start:none;marker-mid:none;marker-end:none;paint-order:normal" />
    <path
       style="opacity:1;vector-effect:none;fill:none;fill-opacity:1;stroke:#26a269;stroke-width:0.71755344;stroke-linecap:butt;stroke-linejoin:miter;stroke-miterlimit:4;stroke-dasharray:none;stroke-dashoffset:0;stroke-opacity:1;marker:none;marker-start:none;marker-mid:none;marker-end:none;paint-order:normal"
       id="path12570"
       sodipodi:type="arc"
       sodipodi:cx="600.97443"
       sodipodi:cy="298.47107"
       sodipodi:rx="43.127888"
       sodipodi:ry="43.127888"
       sodipodi:start="1.023769"
       sodipodi:end="2.1688742"
       sodipodi:open="true"
       d="m 623.40742,335.3055 a 43.127888,43.127888 0 0 1 -46.71637,-1.19271" />
    <path
       style="opacity:1;vector-effect:none;fill:none;fill-opacity:1;stroke:#26a269;stroke-width:10.7633009;stroke-linecap:butt;stroke-linejoin:miter;stroke-miterlimit:4;stroke-dasharray:none;stroke-dashoffset:0;stroke-opacity:1;marker:none;marker-start:none;marker-mid:none;marker-end:none;paint-order:normal"
       d="m 635.44669,374.97416 h 14.25654 c 3.28901,0 5.83496,3.09976 5.83496,5.84529 v 37.48572 c 0,4.31465 3.67087,7.61529 7.10341,7.61529 h 5.04678 c 3.55171,0 7.9413,-2.91196 7.9413,-7.61081 v -49.79347"
       id="path12615"
       inkscape:connector-curvature="0"
       sodipodi:nodetypes="cccccccc" />
    <path
       style="color:#000000;font-style:normal;font-variant:normal;font-weight:normal;font-stretch:normal;font-size:medium;line-height:normal;font-family:sans-serif;font-variant-ligatures:normal;font-variant-position:normal;font-variant-caps:normal;font-variant-numeric:normal;font-variant-alternates:normal;font-feature-settings:normal;text-indent:0;text-align:start;text-decoration:none;text-decoration-line:none;text-decoration-style:solid;text-decoration-color:#000000;letter-spacing:normal;word-spacing:normal;text-transform:none;writing-mode:lr-tb;direction:ltr;text-orientation:mixed;dominant-baseline:auto;baseline-shift:baseline;text-anchor:start;white-space:normal;shape-padding:0;clip-rule:nonzero;display:inline;overflow:visible;visibility:visible;opacity:1;isolation:auto;mix-blend-mode:normal;color-interpolation:sRGB;color-interpolation-filters:linearRGB;solid-color:#000000;solid-opacity:1;vector-effect:none;fill:#26a269;fill-opacity:1;fill-rule:nonzero;stroke:none;stroke-width:7.17553473;stroke-linecap:butt;stroke-linejoin:miter;stroke-miterlimit:4;stroke-dasharray:none;stroke-dashoffset:0;stroke-opacity:1;marker:none;paint-order:normal;color-rendering:auto;image-rendering:auto;shape-rendering:auto;text-rendering:auto;enable-background:accumulate"
       d="m 675.62968,338.19955 c -2.69232,0 -4.66409,2.06172 -4.66409,5.29196 v 14.88923 h -1.7042 v -6.5694 c 0,-3.10839 -2.92427,-5.89809 -7.17553,-5.89809 v 16.8625 c 0,2.54587 0.88021,5.02525 2.63407,6.71515 1.75386,1.6899 4.14988,2.43366 6.51474,2.43366 h 11.92792 c 3.90045,0 6.42185,-3.67689 6.46499,-7.08654 h 0.021 v -26.63847 z"
       id="path12617"
       inkscape:connector-curvature="0" />
  </g>
</svg>
