<?xml version="1.0" encoding="UTF-8" standalone="no"?>
<svg
   inkscape:version="1.1 (c68e22c387, 2021-05-23)"
   id="svg8"
   version="1.1"
   viewBox="0 0 1920 1080"
   height="1080"
   width="1920"
   sodipodi:docname="hig.svg"
   inkscape:export-filename="/var/home/jimmac/SparkleShare/app-illustrations/assets/hig/hig-splash.png"
   inkscape:export-xdpi="48"
   inkscape:export-ydpi="48"
   xmlns:inkscape="http://www.inkscape.org/namespaces/inkscape"
   xmlns:sodipodi="http://sodipodi.sourceforge.net/DTD/sodipodi-0.dtd"
   xmlns:xlink="http://www.w3.org/1999/xlink"
   xmlns="http://www.w3.org/2000/svg"
   xmlns:svg="http://www.w3.org/2000/svg"
   xmlns:rdf="http://www.w3.org/1999/02/22-rdf-syntax-ns#"
   xmlns:cc="http://creativecommons.org/ns#"
   xmlns:dc="http://purl.org/dc/elements/1.1/">
  <defs
     id="defs2">
    <inkscape:perspective
       sodipodi:type="inkscape:persp3d"
       inkscape:vp_x="0 : 540 : 1"
       inkscape:vp_y="0 : 1000 : 0"
       inkscape:vp_z="1920 : 540 : 1"
       inkscape:persp3d-origin="960 : 360 : 1"
       id="perspective33865" />
    <marker
       style="overflow:visible"
       id="TriangleInM"
       refX="0.0"
       refY="0.0"
       orient="auto"
       inkscape:stockid="TriangleInM"
       inkscape:isstock="true">
      <path
         transform="scale(-0.4)"
         style="fill-rule:evenodd;stroke:#1a5fb4;stroke-width:1pt;stroke-opacity:1;fill:#1a5fb4;fill-opacity:1"
         d="M 5.77,0.0 L -2.88,5.0 L -2.88,-5.0 L 5.77,0.0 z "
         id="path4327" />
    </marker>
    <marker
       style="overflow:visible"
       id="TriangleOutM"
       refX="0.0"
       refY="0.0"
       orient="auto"
       inkscape:stockid="TriangleOutM"
       inkscape:isstock="true">
      <path
         transform="scale(0.4)"
         style="fill-rule:evenodd;stroke:#1a5fb4;stroke-width:1pt;stroke-opacity:1;fill:#1a5fb4;fill-opacity:1"
         d="M 5.77,0.0 L -2.88,5.0 L -2.88,-5.0 L 5.77,0.0 z "
         id="path4336" />
    </marker>
    <clipPath
       clipPathUnits="userSpaceOnUse"
       id="clipPath984">
      <circle
         style="font-variation-settings:normal;display:none;opacity:1;vector-effect:none;fill:#77767b;fill-opacity:1;stroke:none;stroke-width:5.04302;stroke-linecap:round;stroke-linejoin:miter;stroke-miterlimit:4;stroke-dasharray:none;stroke-dashoffset:0;stroke-opacity:1;marker:none;marker-start:none;marker-mid:none;marker-end:none;paint-order:normal;stop-color:#000000;stop-opacity:1"
         id="circle986"
         cx="541.88373"
         cy="647.72638"
         r="73.975525" />
      <path
         id="lpe_path-effect988"
         style="font-variation-settings:normal;display:block;opacity:1;vector-effect:none;fill:#77767b;fill-opacity:1;stroke:none;stroke-width:5.04302;stroke-linecap:round;stroke-linejoin:miter;stroke-miterlimit:4;stroke-dasharray:none;stroke-dashoffset:0;stroke-opacity:1;marker:none;marker-start:none;marker-mid:none;marker-end:none;paint-order:normal;stop-color:#000000;stop-opacity:1"
         class="powerclip"
         d="m 399.30566,389.6405 h 285.1561 v 401.98026 h -285.1561 z m 216.55359,258.08588 a 73.975525,73.975525 0 0 0 -73.97552,-73.97553 73.975525,73.975525 0 0 0 -73.97553,73.97553 73.975525,73.975525 0 0 0 73.97553,73.97552 73.975525,73.975525 0 0 0 73.97552,-73.97552 z" />
    </clipPath>
    <inkscape:path-effect
       effect="powerclip"
       id="path-effect988"
       is_visible="true"
       lpeversion="1"
       inverse="true"
       flatten="false"
       hide_clip="false"
       message="Use fill-rule evenodd on &lt;b&gt;fill and stroke&lt;/b&gt; dialog if no flatten result after convert clip to paths." />
    <inkscape:path-effect
       effect="fillet_chamfer"
       id="path-effect259"
       is_visible="true"
       lpeversion="1"
       satellites_param="F,0,0,1,0,8,0,1 @ F,0,0,1,0,8,0,1 @ F,0,0,1,0,8,0,1 @ F,0,0,1,0,8,0,1"
       unit="px"
       method="auto"
       mode="F"
       radius="8"
       chamfer_steps="1"
       flexible="false"
       use_knot_distance="true"
       apply_no_radius="true"
       apply_with_radius="true"
       only_selected="false"
       hide_knots="false" />
    <marker
       id="o"
       refX="0"
       refY="0"
       orient="auto"
       overflow="visible">
      <path
         d="m -2.308,0 3.46,-2 v 4 z"
         fill="#ffffff"
         fill-rule="evenodd"
         stroke="#ffffff"
         stroke-width="0.4pt"
         id="path44" />
    </marker>
    <marker
       id="p"
       refX="0"
       refY="0"
       orient="auto"
       overflow="visible">
      <path
         d="m 2.308,0 -3.46,2 v -4 z"
         fill="#ffffff"
         fill-rule="evenodd"
         stroke="#ffffff"
         stroke-width="0.4pt"
         id="path47" />
    </marker>
    <marker
       id="q"
       refX="0"
       refY="0"
       orient="auto"
       overflow="visible">
      <path
         d="m 2.308,0 -3.46,2 v -4 z"
         fill="#ffffff"
         fill-rule="evenodd"
         stroke="#ffffff"
         stroke-width="0.4pt"
         id="path50" />
    </marker>
    <marker
       id="r"
       refX="0"
       refY="0"
       orient="auto"
       overflow="visible">
      <path
         d="m 2.308,0 -3.46,2 v -4 z"
         fill="#ffffff"
         fill-rule="evenodd"
         stroke="#ffffff"
         stroke-width="0.4pt"
         id="path53" />
    </marker>
    <marker
       id="s"
       refX="0"
       refY="0"
       orient="auto"
       overflow="visible">
      <path
         d="m 2.308,0 -3.46,2 v -4 z"
         fill="#ffffff"
         fill-rule="evenodd"
         stroke="#ffffff"
         stroke-width="0.4pt"
         id="path56" />
    </marker>
    <marker
       id="t"
       refX="0"
       refY="0"
       orient="auto"
       overflow="visible">
      <path
         d="m 2.308,0 -3.46,2 v -4 z"
         fill="#ffffff"
         fill-rule="evenodd"
         stroke="#ffffff"
         stroke-width="0.4pt"
         id="path59" />
    </marker>
    <marker
       id="u"
       refX="0"
       refY="0"
       orient="auto"
       overflow="visible">
      <path
         d="m -2.308,0 3.46,-2 v 4 z"
         fill="#ffffff"
         fill-rule="evenodd"
         stroke="#ffffff"
         stroke-width="0.4pt"
         id="path62" />
    </marker>
    <marker
       id="v"
       refX="0"
       refY="0"
       orient="auto"
       overflow="visible">
      <path
         d="m 2.308,0 -3.46,2 v -4 z"
         fill="#ffffff"
         fill-rule="evenodd"
         stroke="#ffffff"
         stroke-width="0.4pt"
         id="path65" />
    </marker>
    <marker
       id="w"
       refX="0"
       refY="0"
       orient="auto"
       overflow="visible">
      <path
         d="m -2.308,0 3.46,-2 v 4 z"
         fill="#ffffff"
         fill-rule="evenodd"
         stroke="#ffffff"
         stroke-width="0.4pt"
         id="path68" />
    </marker>
    <marker
       id="x"
       refX="0"
       refY="0"
       orient="auto"
       overflow="visible">
      <path
         d="m 2.308,0 -3.46,2 v -4 z"
         fill="#ffffff"
         fill-rule="evenodd"
         stroke="#ffffff"
         stroke-width="0.4pt"
         id="path71" />
    </marker>
    <marker
       id="y"
       refX="0"
       refY="0"
       orient="auto"
       overflow="visible">
      <path
         d="m -2.308,0 3.46,-2 v 4 z"
         fill="#ffffff"
         fill-rule="evenodd"
         stroke="#ffffff"
         stroke-width="0.4pt"
         id="path74" />
    </marker>
    <marker
       id="z"
       refX="0"
       refY="0"
       orient="auto"
       overflow="visible">
      <path
         d="m 2.308,0 -3.46,2 v -4 z"
         fill="#ffffff"
         fill-rule="evenodd"
         stroke="#ffffff"
         stroke-width="0.4pt"
         id="path77" />
    </marker>
  </defs>
  <sodipodi:namedview
     units="px"
     borderlayer="true"
     inkscape:showpageshadow="false"
     showgrid="false"
     inkscape:document-rotation="0"
     inkscape:current-layer="g224"
     inkscape:document-units="px"
     inkscape:cy="560"
     inkscape:cx="400"
     inkscape:zoom="0.35"
     inkscape:pageshadow="2"
     inkscape:pageopacity="0"
     borderopacity="1"
     bordercolor="#383838"
     pagecolor="#ffffff"
     id="base"
     showguides="true"
     inkscape:guide-bbox="true"
     inkscape:snap-global="true"
     inkscape:object-nodes="false"
     inkscape:snap-bbox="true"
     inkscape:snap-bbox-midpoints="true"
     inkscape:bbox-nodes="true"
     inkscape:bbox-paths="true"
     inkscape:pagecheckerboard="1">
    <sodipodi:guide
       position="466,96"
       orientation="0,-1"
       id="guide3203" />
    <sodipodi:guide
       position="110,452"
       orientation="1,0"
       id="guide3205" />
    <sodipodi:guide
       position="1232,974"
       orientation="0,-1"
       id="guide3209" />
    <inkscape:grid
       type="xygrid"
       id="grid3335" />
  </sodipodi:namedview>
  <metadata
     id="metadata5">
    <rdf:RDF>
      <cc:Work
         rdf:about="">
        <dc:format>image/svg+xml</dc:format>
        <dc:type
           rdf:resource="http://purl.org/dc/dcmitype/StillImage" />
        <cc:license
           rdf:resource="http://creativecommons.org/licenses/by-sa/4.0/" />
      </cc:Work>
      <cc:License
         rdf:about="http://creativecommons.org/licenses/by-sa/4.0/">
        <cc:permits
           rdf:resource="http://creativecommons.org/ns#Reproduction" />
        <cc:permits
           rdf:resource="http://creativecommons.org/ns#Distribution" />
        <cc:requires
           rdf:resource="http://creativecommons.org/ns#Notice" />
        <cc:requires
           rdf:resource="http://creativecommons.org/ns#Attribution" />
        <cc:permits
           rdf:resource="http://creativecommons.org/ns#DerivativeWorks" />
        <cc:requires
           rdf:resource="http://creativecommons.org/ns#ShareAlike" />
      </cc:License>
    </rdf:RDF>
  </metadata>
  <g
     id="layer1"
     inkscape:groupmode="layer"
     inkscape:label="Layer 1">
    <g
       id="g24938"
       transform="translate(155.3644)">
      <g
         id="g973"
         clip-path="url(#clipPath984)"
         transform="matrix(0.88651867,0,0,0.88651867,417.93199,47.632597)"
         inkscape:path-effect="#path-effect988">
        <path
           style="font-variation-settings:normal;opacity:1;vector-effect:none;fill:#cee1f8;fill-opacity:1;stroke:none;stroke-width:5.04302;stroke-linecap:round;stroke-linejoin:miter;stroke-miterlimit:4;stroke-dasharray:none;stroke-dashoffset:0;stroke-opacity:1;marker:none;marker-start:none;marker-mid:none;marker-end:none;paint-order:normal;stop-color:#000000;stop-opacity:1"
           id="rect257"
           width="275.1561"
           height="310.64557"
           x="404.30566"
           y="475.97519"
           rx="20.958838"
           ry="20.958838"
           sodipodi:type="rect"
           d="m 425.2645,475.97519 h 233.23842 c 11.6112,0 20.95884,9.34764 20.95884,20.95884 v 268.72789 c 0,11.6112 -9.34764,20.95884 -20.95884,20.95884 H 425.2645 c -11.61119,0 -20.95884,-9.34764 -20.95884,-20.95884 V 496.93403 c 0,-11.6112 9.34765,-20.95884 20.95884,-20.95884 z" />
        <path
           style="fill:#99c1f1;fill-opacity:1;stroke-linecap:round;stop-color:#000000"
           id="rect101"
           width="275.1561"
           height="310.64557"
           x="404.30566"
           y="394.6405"
           rx="0"
           ry="0"
           sodipodi:type="rect"
           d="m 404.30566,394.6405 h 275.1561 v 310.64557 h -275.1561 z" />
      </g>
      <g
         transform="matrix(1.6138779,0,0,1.6138779,-911.2908,243.26047)"
         style="display:inline;stroke-width:0.972716;enable-background:new"
         id="g65">
        <path
           style="display:inline;opacity:1;vector-effect:none;fill:#1a5fb4;fill-opacity:1;stroke:none;stroke-width:0.047906px;stroke-linecap:butt;stroke-linejoin:miter;stroke-miterlimit:4;stroke-dasharray:none;stroke-dashoffset:0;stroke-opacity:1;marker:none;marker-start:none;marker-mid:none;marker-end:none;paint-order:normal;enable-background:new"
           d="M 1367.7351,-75.863459 V 221.75228 a 8,8 135 0 1 -8,8 H 872.26485 a 8,8 45 0 1 -8,-8 V -75.863459 a 8,8 135 0 1 8,-8 h 487.47025 a 8,8 45 0 1 8,8 z"
           id="path63"
           inkscape:connector-curvature="0"
           sodipodi:nodetypes="ccccc"
           inkscape:path-effect="#path-effect259"
           inkscape:original-d="M 1367.7351,-83.863459 V 229.75228 H 864.26485 V -83.863459 Z" />
      </g>
      <rect
         style="fill:#99c1f1;fill-opacity:1;stroke:none;stroke-width:1.64611;stroke-linecap:round;stop-color:#000000"
         id="rect1457"
         width="780.12268"
         height="470.00391"
         x="499.46835"
         y="124.65135" />
      <g
         id="g192"
         transform="matrix(0.43832528,0,0,0.43832528,462.71026,117.26868)">
        <g
           fill="none"
           stroke="#ffffff"
           id="g190">
          <g
             transform="matrix(3.34654,0,0,3.34654,-2287.12,-5943.066)"
             id="g152">
            <rect
               width="270"
               height="190"
               x="847.79199"
               y="1840.916"
               rx="6"
               ry="6"
               stroke-width="2"
               stroke-linecap="square"
               stroke-linejoin="round"
               stroke-dashoffset="26.4"
               id="rect112" />
            <path
               d="m 847.792,1864.916 h 270"
               stroke-width="2"
               id="path114" />
            <rect
               width="150"
               height="75"
               x="907.79199"
               y="1890.916"
               rx="4"
               ry="4"
               stroke-width="2"
               stroke-linecap="square"
               stroke-linejoin="round"
               stroke-dashoffset="26.4"
               id="rect116" />
            <path
               d="m 907.792,1880.916 h 40"
               stroke-width="4"
               id="path118" />
            <path
               d="m 907.792,1920.916 h 150 m -150,30 h 150"
               stroke-width="2"
               id="path120" />
            <path
               d="m 1057.792,2030.916 v -36 c 0,-2.216 -1.784,-4 -4,-4 h -142 c -2.216,0 -4,1.784 -4,4 v 36"
               stroke-width="2"
               stroke-linecap="square"
               stroke-linejoin="round"
               stroke-dashoffset="26.4"
               id="path122" />
            <path
               d="m 907.792,1980.916 h 40"
               stroke-width="4"
               id="path124" />
            <path
               d="m 907.792,2020.916 h 150"
               stroke-width="2"
               id="path126" />
            <rect
               width="14"
               height="12"
               x="853.79199"
               y="1846.916"
               rx="2"
               ry="2"
               stroke-width="2"
               stroke-linecap="square"
               stroke-linejoin="round"
               stroke-dashoffset="26.4"
               id="rect128" />
            <path
               stroke-width="2"
               stroke-linecap="square"
               stroke-linejoin="round"
               stroke-dashoffset="26.4"
               d="m 920.792,1840.916 h 40 v 24 h -40 z"
               id="path130" />
            <circle
               cx="929.79199"
               cy="1852.916"
               r="3"
               stroke-width="2"
               stroke-linecap="square"
               stroke-linejoin="round"
               stroke-dashoffset="26.4"
               id="circle132" />
            <path
               d="m 939.792,1852.916 h 15"
               stroke-width="2"
               id="path134" />
            <circle
               cx="973.79199"
               cy="1852.916"
               r="3"
               stroke-width="2"
               stroke-linecap="square"
               stroke-linejoin="round"
               stroke-dashoffset="26.4"
               id="circle136" />
            <path
               d="m 983.792,1852.916 h 15"
               stroke-width="2"
               id="path138" />
            <circle
               cx="1013.792"
               cy="1852.916"
               r="3"
               stroke-width="2"
               stroke-linecap="square"
               stroke-linejoin="round"
               stroke-dashoffset="26.4"
               id="circle140" />
            <path
               d="m 1023.792,1852.916 h 15"
               stroke-width="2"
               id="path142" />
            <rect
               width="14"
               height="12"
               x="1080.792"
               y="1846.916"
               rx="2"
               ry="2"
               stroke-width="2"
               stroke-linecap="square"
               stroke-linejoin="round"
               stroke-dashoffset="26.4"
               id="rect144" />
            <rect
               width="14"
               height="12"
               x="1060.792"
               y="1846.916"
               rx="2"
               ry="2"
               stroke-width="2"
               stroke-linecap="square"
               stroke-linejoin="round"
               stroke-dashoffset="26.4"
               id="rect146" />
            <circle
               cx="1105.792"
               cy="1852.916"
               r="3"
               stroke-width="2"
               stroke-linecap="square"
               stroke-linejoin="round"
               stroke-dashoffset="26.4"
               id="circle148" />
            <path
               d="m 847.792,1864.916 h 270"
               stroke-width="2"
               id="path150" />
          </g>
          <g
             stroke-width="2"
             id="g188">
            <path
               d="M 466.385,296.881 V 217.63 m -117.128,0 h 250.99 m -250.99,635.842 h 250.99"
               opacity="0.4"
               stroke-width="6.69308"
               id="path154" />
            <path
               d="m 797.792,1835.916 v 180"
               opacity="0.4"
               marker-start="url(#o)"
               marker-end="url(#p)"
               transform="matrix(3.34654,0,0,3.34654,-2287.12,-5909.6)"
               id="path156" />
            <path
               d="M 432.92,297.947 H 600.247"
               opacity="0.4"
               stroke-width="6.69308"
               id="path158" />
            <path
               d="m 822.792,1810.916 v 15"
               opacity="0.4"
               marker-end="url(#q)"
               transform="matrix(3.34654,0,0,3.34654,-2287.12,-5909.6)"
               id="path160" />
            <path
               d="m 822.792,1874.597 v -15"
               opacity="0.4"
               marker-end="url(#r)"
               transform="matrix(3.34654,0,0,3.34654,-2287.12,-5909.6)"
               id="path162" />
            <path
               d="m 1330.857,144.006 h 45.787 m 0,-34.608 v 147.248 m -46.852,-147.248 v 147.248"
               opacity="0.4"
               stroke-width="6.69308"
               id="path164" />
            <path
               d="m 1114.792,1808.916 h -15"
               opacity="0.4"
               marker-end="url(#s)"
               transform="matrix(3.34654,0,0,3.34654,-2287.12,-5909.6)"
               id="path166" />
            <path
               d="m 1061.11,1808.916 h 15"
               opacity="0.4"
               marker-end="url(#t)"
               transform="matrix(3.34654,0,0,3.34654,-2287.12,-5909.6)"
               id="path168" />
            <path
               d="M 1252.821,970.602 V 820.007 M 750.84,970.602 V 820.007"
               opacity="0.4"
               stroke-width="6.69308"
               id="path170" />
            <path
               d="m 1052.792,2045.916 h -140"
               opacity="0.4"
               marker-start="url(#u)"
               marker-end="url(#v)"
               transform="matrix(3.34654,0,0,3.34654,-2287.12,-5909.6)"
               id="path172" />
            <path
               d="M 928.208,110.54 V 261.135 M 794.346,110.54 v 150.595"
               opacity="0.4"
               stroke-width="6.69308"
               id="path174" />
            <path
               d="m 955.792,1808.916 h -30"
               opacity="0.4"
               marker-start="url(#w)"
               marker-end="url(#x)"
               transform="matrix(3.34654,0,0,3.34654,-2287.12,-5909.6)"
               id="path176" />
            <path
               d="m 1570.743,384.957 h -384.852 m 384.852,250.99 h -384.852"
               opacity="0.4"
               stroke-width="6.69308"
               id="path178" />
            <path
               d="m 1142.792,1885.916 v 65"
               opacity="0.4"
               marker-start="url(#y)"
               marker-end="url(#z)"
               transform="matrix(3.34654,0,0,3.34654,-2287.12,-5909.6)"
               id="path180" />
            <g
               id="path184"
               transform="matrix(3.34654,0,0,3.34654,-2287.12,-5909.6)"
               style="opacity:0.4">
              <g
                 id="g3127">
                <g
                   id="path3129"
                   style="opacity:1" />
              </g>
            </g>
          </g>
        </g>
      </g>
    </g>
    <g
       id="g1110"
       transform="matrix(-1,0,0,1,-263.94081,0)">
      <path
         d="M 584.32654,754.48609 H 439.4"
         stroke-width="11.4267"
         id="path3884-2"
         sodipodi:nodetypes="cc"
         style="font-variation-settings:normal;opacity:0.4;vector-effect:none;fill:none;fill-opacity:1;stroke:#1a5fb4;stroke-width:2.934;stroke-linecap:butt;stroke-linejoin:miter;stroke-miterlimit:4;stroke-dasharray:none;stroke-dashoffset:0;stroke-opacity:1;stop-color:#000000" />
      <path
         d="M 584.32654,982.54431 H 459.4"
         stroke-width="11.4267"
         id="path3882-0"
         sodipodi:nodetypes="cc"
         style="font-variation-settings:normal;opacity:0.4;vector-effect:none;fill:none;fill-opacity:1;stroke:#1a5fb4;stroke-width:2.934;stroke-linecap:butt;stroke-linejoin:miter;stroke-miterlimit:4;stroke-dasharray:none;stroke-dashoffset:0;stroke-opacity:1;stop-color:#000000" />
      <path
         d="M 577.10321,761.68993 V 975.95827"
         opacity="0.4"
         marker-start="url(#o-1)"
         marker-end="url(#p-7)"
         id="path3255-2"
         style="fill:none;stroke:#1a5fb4;stroke-width:2.93375;marker-start:url(#TriangleInM);marker-end:url(#TriangleOutM)"
         sodipodi:nodetypes="cc" />
    </g>
    <g
       id="g595"
       transform="translate(-3234.6674,6831.9139)">
      <path
         style="opacity:1;vector-effect:none;fill:#99c1f1;fill-opacity:1;stroke:none;stroke-width:15.2436;stroke-linecap:butt;stroke-linejoin:miter;stroke-miterlimit:4;stroke-dasharray:none;stroke-dashoffset:0;stroke-opacity:1;marker:none;marker-start:none;marker-mid:none;marker-end:none;paint-order:normal"
         d="m 2488.4781,-6039.9134 h 126.6357 c 3.2835,0 6.2438,3.8096 5.927,8.4926 l -11.9388,176.4786 c -0.2621,3.8754 -2.1877,7.0281 -4.9051,7.0281 H 2499.395 c -2.7175,0 -4.643,-3.1527 -4.9052,-7.0281 l -11.9388,-176.4786 c -0.3168,-4.683 2.6435,-8.4926 5.9271,-8.4926 z"
         id="path24476"
         inkscape:connector-curvature="0"
         sodipodi:nodetypes="sssssssss" />
      <path
         inkscape:connector-curvature="0"
         id="path24508"
         d="m 2488.4785,-6039.9139 c -3.2836,0 -6.2445,3.8092 -5.9277,8.4922 l 1.0117,14.9414 h 136.4668 l 1.0117,-14.9414 c 0.3168,-4.683 -2.6442,-8.4922 -5.9277,-8.4922 z"
         style="opacity:0.23;vector-effect:none;fill:#3584e4;fill-opacity:1;stroke:none;stroke-width:15.2436;stroke-linecap:butt;stroke-linejoin:miter;stroke-miterlimit:4;stroke-dasharray:none;stroke-dashoffset:0;stroke-opacity:1;marker:none;marker-start:none;marker-mid:none;marker-end:none;paint-order:normal" />
      <path
         sodipodi:nodetypes="cssccsscc"
         inkscape:connector-curvature="0"
         id="path24502"
         d="m 2494.4902,-5854.9412 c 0.2622,3.8754 2.1868,7.0273 4.9043,7.0273 h 104.8028 c 2.7174,0 4.6422,-3.1519 4.9043,-7.0273 l 0.8839,-13.303 c -0.2621,3.8754 -3.0708,6.8948 -5.7882,6.8948 h -104.8028 c -2.7175,0 -5.6144,-3.1078 -5.8766,-6.9832 z"
         style="opacity:1;vector-effect:none;fill:#62a0ea;fill-opacity:1;stroke:none;stroke-width:15.2436;stroke-linecap:butt;stroke-linejoin:miter;stroke-miterlimit:4;stroke-dasharray:none;stroke-dashoffset:0;stroke-opacity:1;marker:none;marker-start:none;marker-mid:none;marker-end:none;paint-order:normal" />
      <path
         inkscape:connector-curvature="0"
         id="path24490"
         d="m 2592.8839,-5991.4803 a 37,37 0 0 0 -37,37 37,37 0 0 0 37,37 37,37 0 0 0 21.0352,-6.6133 l 3.9023,-57.6601 a 37,37 0 0 0 -24.9375,-9.7266 z"
         style="opacity:1;vector-effect:none;fill:#3584e4;fill-opacity:1;stroke:none;stroke-width:16;stroke-linecap:butt;stroke-linejoin:miter;stroke-miterlimit:4;stroke-dasharray:none;stroke-dashoffset:0;stroke-opacity:1;marker:none;marker-start:none;marker-mid:none;marker-end:none;paint-order:normal" />
      <path
         inkscape:connector-curvature="0"
         id="path24495"
         d="m 2592.7843,-6011.3885 c -20.2764,0 -39.0435,10.8346 -49.1816,28.3945 l 13.8554,8 c 7.2929,-12.6317 20.7404,-20.3945 35.3262,-20.3945 9.3699,0 18.2594,3.2175 25.3594,8.8574 l 1.2343,-18.2383 c -8.061,-4.2737 -17.1635,-6.6191 -26.5937,-6.6191 z"
         style="color:#000000;font-style:normal;font-variant:normal;font-weight:normal;font-stretch:normal;font-size:medium;line-height:normal;font-family:sans-serif;font-variant-ligatures:normal;font-variant-position:normal;font-variant-caps:normal;font-variant-numeric:normal;font-variant-alternates:normal;font-feature-settings:normal;text-indent:0;text-align:start;text-decoration:none;text-decoration-line:none;text-decoration-style:solid;text-decoration-color:#000000;letter-spacing:normal;word-spacing:normal;text-transform:none;writing-mode:lr-tb;direction:ltr;text-orientation:mixed;dominant-baseline:auto;baseline-shift:baseline;text-anchor:start;white-space:normal;shape-padding:0;clip-rule:nonzero;display:inline;overflow:visible;visibility:visible;opacity:1;isolation:auto;mix-blend-mode:normal;color-interpolation:sRGB;color-interpolation-filters:linearRGB;solid-color:#000000;solid-opacity:1;vector-effect:none;fill:#3584e4;fill-opacity:1;fill-rule:nonzero;stroke:none;stroke-width:16;stroke-linecap:butt;stroke-linejoin:miter;stroke-miterlimit:4;stroke-dasharray:none;stroke-dashoffset:0;stroke-opacity:1;marker:none;paint-order:normal;color-rendering:auto;image-rendering:auto;shape-rendering:auto;text-rendering:auto;enable-background:accumulate" />
      <path
         sodipodi:nodetypes="ccccsccsc"
         inkscape:connector-curvature="0"
         id="path24513"
         d="m 2565.6162,-6039.9139 c 3.2835,0 6.2445,3.8092 5.9277,8.4922 l -2.3935,176.4805 c -0.2621,3.8754 -2.1869,7.0273 -4.9043,7.0273 h 39.9512 c 2.7174,0 4.6422,-3.1519 4.9043,-7.0273 l 11.9394,-176.4805 c 0.3168,-4.683 -2.6442,-8.4922 -5.9277,-8.4922 z"
         style="opacity:0.13;vector-effect:none;fill:#77767b;fill-opacity:1;stroke:none;stroke-width:15.2436;stroke-linecap:butt;stroke-linejoin:miter;stroke-miterlimit:4;stroke-dasharray:none;stroke-dashoffset:0;stroke-opacity:1;marker:none;marker-start:none;marker-mid:none;marker-end:none;paint-order:normal" />
      <path
         style="opacity:1;vector-effect:none;fill:#e7f0fc;fill-opacity:1;stroke:none;stroke-width:12.7347;stroke-linecap:butt;stroke-linejoin:miter;stroke-miterlimit:4;stroke-dasharray:none;stroke-dashoffset:0;stroke-opacity:1;marker:none;marker-start:none;marker-mid:none;marker-end:none;paint-order:normal"
         d="m 2496.4372,-6078.9746 h 105.9419 c 3.2835,0 5.3664,2.6917 5.927,5.9271 l 3.9796,22.9661 c 0.5985,3.454 -2.8221,6.3275 -6.3275,6.3275 h -113.1 c -3.5055,0 -6.9261,-2.8735 -6.3276,-6.3275 l 3.9796,-22.9661 c 0.5606,-3.2354 2.6435,-5.9271 5.927,-5.9271 z"
         id="path24474"
         inkscape:connector-curvature="0"
         sodipodi:nodetypes="sssssssss" />
      <path
         inkscape:connector-curvature="0"
         style="opacity:1;vector-effect:none;fill:#c2daf6;fill-opacity:1;stroke:none;stroke-width:12.7347;stroke-linecap:butt;stroke-linejoin:miter;stroke-miterlimit:4;stroke-dasharray:none;stroke-dashoffset:0;stroke-opacity:1;marker:none;marker-start:none;marker-mid:none;marker-end:none;paint-order:normal"
         d="m 2567.377,-6078.9744 c 3.2835,0 5.3671,2.6923 5.9277,5.9277 l 3.9785,22.9648 c 0.5985,3.454 -2.8208,6.3282 -6.3262,6.3282 h 35.002 c 3.5054,0 6.9247,-2.8742 6.3262,-6.3282 l -3.9786,-22.9648 c -0.5606,-3.2354 -2.6442,-5.9277 -5.9277,-5.9277 z"
         id="path24482" />
      <path
         sodipodi:nodetypes="sssccss"
         inkscape:connector-curvature="0"
         id="rect24484"
         d="m 2478.927,-6062.2603 h 144.146 c 3.2835,0 5.927,2.6435 5.927,5.9271 v 31.0082 h -156 v -31.0082 c 0,-3.2836 2.6435,-5.9271 5.927,-5.9271 z"
         style="opacity:1;vector-effect:none;fill:#d1e3f9;fill-opacity:1;stroke:none;stroke-width:12.7347;stroke-linecap:butt;stroke-linejoin:miter;stroke-miterlimit:4;stroke-dasharray:none;stroke-dashoffset:0;stroke-opacity:1;marker:none;marker-start:none;marker-mid:none;marker-end:none;paint-order:normal" />
      <path
         sodipodi:nodetypes="csccssc"
         inkscape:connector-curvature="0"
         style="opacity:1;vector-effect:none;fill:#b5d2f5;fill-opacity:1;stroke:none;stroke-width:12.7347;stroke-linecap:butt;stroke-linejoin:miter;stroke-miterlimit:4;stroke-dasharray:none;stroke-dashoffset:0;stroke-opacity:1;marker:none;marker-start:none;marker-mid:none;marker-end:none;paint-order:normal"
         d="m 2582.4141,-6062.2596 c 3.2835,0 5.9277,2.6422 5.9277,5.9258 v 30.7578 H 2629 v -30.7578 c 0,-3.2836 -2.6442,-5.9258 -5.9277,-5.9258 z"
         id="path24488" />
    </g>
    <g
       id="g224"
       transform="translate(-969.43561,-2.0203051)">
      <rect
         style="vector-effect:none;fill:#1a5fb4;fill-opacity:1;stroke:none;stroke-width:7.87157;stroke-linecap:round;stroke-linejoin:miter;stroke-miterlimit:4;stroke-dasharray:none;stroke-dashoffset:0;stroke-opacity:1;marker:none;marker-start:none;marker-mid:none;marker-end:none;paint-order:normal"
         id="rect2246"
         width="472.2941"
         height="288.62418"
         x="1168.8313"
         y="402.569"
         rx="14.299336"
         ry="14.299336" />
      <rect
         style="vector-effect:none;fill:#99c1f1;fill-opacity:1;stroke:none;stroke-width:7.87157;stroke-linecap:round;stroke-linejoin:miter;stroke-miterlimit:4;stroke-dasharray:none;stroke-dashoffset:0;stroke-opacity:1;marker:none;marker-start:none;marker-mid:none;marker-end:none;paint-order:normal"
         id="rect2250"
         width="472.2941"
         height="288.62418"
         x="1168.8313"
         y="697.75287"
         rx="14.299336"
         ry="14.299336" />
      <rect
         ry="14.299336"
         rx="14.299336"
         y="691.19318"
         x="1168.8313"
         height="288.62418"
         width="472.2941"
         id="rect2248"
         style="vector-effect:none;fill:#cee1f8;fill-opacity:1;stroke:none;stroke-width:7.87157;stroke-linecap:round;stroke-linejoin:miter;stroke-miterlimit:4;stroke-dasharray:none;stroke-dashoffset:0;stroke-opacity:1;marker:none;marker-start:none;marker-mid:none;marker-end:none;paint-order:normal" />
      <rect
         style="vector-effect:none;fill:#62a0ea;fill-opacity:1;stroke:none;stroke-width:7.87157;stroke-linecap:round;stroke-linejoin:miter;stroke-miterlimit:4;stroke-dasharray:none;stroke-dashoffset:0;stroke-opacity:1;marker:none;marker-start:none;marker-mid:none;marker-end:none;paint-order:normal"
         id="rect2252"
         width="419.81696"
         height="144.31209"
         x="1195.0698"
         y="717.43176"
         rx="9.7075796"
         ry="9.7075796" />
      <rect
         ry="9.7075796"
         rx="9.7075796"
         y="720.0556"
         x="1195.0698"
         height="144.31209"
         width="419.81696"
         id="rect2332"
         style="vector-effect:none;fill:#89b7ef;fill-opacity:1;stroke:none;stroke-width:7.87157;stroke-linecap:round;stroke-linejoin:miter;stroke-miterlimit:4;stroke-dasharray:none;stroke-dashoffset:0;stroke-opacity:1;marker:none;marker-start:none;marker-mid:none;marker-end:none;paint-order:normal" />
      <rect
         ry="4.0949225"
         rx="4.0949225"
         y="664.95465"
         x="1247.547"
         height="36.733971"
         width="314.86273"
         id="rect2258"
         style="vector-effect:none;fill:#1a5fb4;fill-opacity:1;stroke:none;stroke-width:7.87157;stroke-linecap:round;stroke-linejoin:miter;stroke-miterlimit:4;stroke-dasharray:none;stroke-dashoffset:0;stroke-opacity:1;marker:none;marker-start:none;marker-mid:none;marker-end:none;paint-order:normal" />
      <rect
         ry="14.299359"
         rx="14.299361"
         y="874.8631"
         x="1339.382"
         height="78.71566"
         width="131.1927"
         id="rect2254"
         style="vector-effect:none;fill:#76aceb;fill-opacity:1;stroke:none;stroke-width:7.87157;stroke-linecap:round;stroke-linejoin:miter;stroke-miterlimit:4;stroke-dasharray:none;stroke-dashoffset:0;stroke-opacity:1;marker:none;marker-start:none;marker-mid:none;marker-end:none;paint-order:normal" />
      <rect
         ry="7.8056149"
         rx="7.8056149"
         y="410.58633"
         x="1176.4346"
         height="272.58951"
         width="457.08755"
         id="rect2256"
         style="vector-effect:none;fill:#99c1f1;fill-opacity:1;stroke:none;stroke-width:7.87157;stroke-linecap:round;stroke-linejoin:miter;stroke-miterlimit:4;stroke-dasharray:none;stroke-dashoffset:0;stroke-opacity:1;marker:none;marker-start:none;marker-mid:none;marker-end:none;paint-order:normal" />
      <rect
         style="vector-effect:none;fill:#1a5fb4;fill-opacity:1;stroke:none;stroke-width:7.87157;stroke-linecap:round;stroke-linejoin:miter;stroke-miterlimit:4;stroke-dasharray:none;stroke-dashoffset:0;stroke-opacity:1;marker:none;marker-start:none;marker-mid:none;marker-end:none;paint-order:normal"
         id="rect2260"
         width="229.58746"
         height="26.23856"
         x="1300.024"
         y="828.94562"
         rx="5.0225949"
         ry="5.0225954" />
      <rect
         ry="5.0225954"
         rx="5.0225954"
         y="828.94562"
         x="1536.1711"
         height="26.23856"
         width="32.798141"
         id="rect2262"
         style="vector-effect:none;fill:#1a5fb4;fill-opacity:1;stroke:none;stroke-width:7.87157;stroke-linecap:round;stroke-linejoin:miter;stroke-miterlimit:4;stroke-dasharray:none;stroke-dashoffset:0;stroke-opacity:1;marker:none;marker-start:none;marker-mid:none;marker-end:none;paint-order:normal" />
      <rect
         style="vector-effect:none;fill:#1a5fb4;fill-opacity:1;stroke:none;stroke-width:7.87157;stroke-linecap:round;stroke-linejoin:miter;stroke-miterlimit:4;stroke-dasharray:none;stroke-dashoffset:0;stroke-opacity:1;marker:none;marker-start:none;marker-mid:none;marker-end:none;paint-order:normal"
         id="rect2264"
         width="32.798141"
         height="26.23856"
         x="1575.5291"
         y="828.94562"
         rx="5.0225954"
         ry="5.0225954" />
      <rect
         ry="5.0225954"
         rx="5.0225954"
         y="796.14734"
         x="1555.8501"
         height="26.23856"
         width="26.23855"
         id="rect2266"
         style="vector-effect:none;fill:#1a5fb4;fill-opacity:1;stroke:none;stroke-width:7.87157;stroke-linecap:round;stroke-linejoin:miter;stroke-miterlimit:4;stroke-dasharray:none;stroke-dashoffset:0;stroke-opacity:1;marker:none;marker-start:none;marker-mid:none;marker-end:none;paint-order:normal" />
      <rect
         style="vector-effect:none;fill:#1a5fb4;fill-opacity:1;stroke:none;stroke-width:7.87157;stroke-linecap:round;stroke-linejoin:miter;stroke-miterlimit:4;stroke-dasharray:none;stroke-dashoffset:0;stroke-opacity:1;marker:none;marker-start:none;marker-mid:none;marker-end:none;paint-order:normal"
         id="rect2268"
         width="32.798141"
         height="26.23856"
         x="1516.4922"
         y="796.14734"
         rx="5.0225954"
         ry="5.0225954" />
      <rect
         ry="5.0225954"
         rx="5.0225954"
         y="796.14734"
         x="1477.1344"
         height="26.23856"
         width="32.798141"
         id="rect2270"
         style="vector-effect:none;fill:#1a5fb4;fill-opacity:1;stroke:none;stroke-width:7.87157;stroke-linecap:round;stroke-linejoin:miter;stroke-miterlimit:4;stroke-dasharray:none;stroke-dashoffset:0;stroke-opacity:1;marker:none;marker-start:none;marker-mid:none;marker-end:none;paint-order:normal" />
      <rect
         style="vector-effect:none;fill:#1a5fb4;fill-opacity:1;stroke:none;stroke-width:7.87157;stroke-linecap:round;stroke-linejoin:miter;stroke-miterlimit:4;stroke-dasharray:none;stroke-dashoffset:0;stroke-opacity:1;marker:none;marker-start:none;marker-mid:none;marker-end:none;paint-order:normal"
         id="rect2272"
         width="32.798141"
         height="26.23856"
         x="1437.7766"
         y="796.14734"
         rx="5.0225954"
         ry="5.0225954" />
      <rect
         ry="5.0225954"
         rx="5.0225954"
         y="796.14734"
         x="1398.4187"
         height="26.23856"
         width="32.798141"
         id="rect2274"
         style="vector-effect:none;fill:#1a5fb4;fill-opacity:1;stroke:none;stroke-width:7.87157;stroke-linecap:round;stroke-linejoin:miter;stroke-miterlimit:4;stroke-dasharray:none;stroke-dashoffset:0;stroke-opacity:1;marker:none;marker-start:none;marker-mid:none;marker-end:none;paint-order:normal" />
      <rect
         style="vector-effect:none;fill:#1a5fb4;fill-opacity:1;stroke:none;stroke-width:7.87157;stroke-linecap:round;stroke-linejoin:miter;stroke-miterlimit:4;stroke-dasharray:none;stroke-dashoffset:0;stroke-opacity:1;marker:none;marker-start:none;marker-mid:none;marker-end:none;paint-order:normal"
         id="rect2276"
         width="32.798141"
         height="26.23856"
         x="1359.0608"
         y="796.14734"
         rx="5.0225954"
         ry="5.0225954" />
      <rect
         ry="5.0225954"
         rx="5.0225954"
         y="796.14734"
         x="1319.703"
         height="26.23856"
         width="32.798141"
         id="rect2278"
         style="vector-effect:none;fill:#1a5fb4;fill-opacity:1;stroke:none;stroke-width:7.87157;stroke-linecap:round;stroke-linejoin:miter;stroke-miterlimit:4;stroke-dasharray:none;stroke-dashoffset:0;stroke-opacity:1;marker:none;marker-start:none;marker-mid:none;marker-end:none;paint-order:normal" />
      <rect
         style="vector-effect:none;fill:#1a5fb4;fill-opacity:1;stroke:none;stroke-width:7.87157;stroke-linecap:round;stroke-linejoin:miter;stroke-miterlimit:4;stroke-dasharray:none;stroke-dashoffset:0;stroke-opacity:1;marker:none;marker-start:none;marker-mid:none;marker-end:none;paint-order:normal"
         id="rect2280"
         width="32.798141"
         height="26.23856"
         x="1280.3452"
         y="796.14734"
         rx="5.0225954"
         ry="5.0225954" />
      <rect
         ry="5.0225954"
         rx="5.0225954"
         y="796.14734"
         x="1240.9873"
         height="26.23856"
         width="32.798141"
         id="rect2282"
         style="vector-effect:none;fill:#1a5fb4;fill-opacity:1;stroke:none;stroke-width:7.87157;stroke-linecap:round;stroke-linejoin:miter;stroke-miterlimit:4;stroke-dasharray:none;stroke-dashoffset:0;stroke-opacity:1;marker:none;marker-start:none;marker-mid:none;marker-end:none;paint-order:normal" />
      <rect
         style="vector-effect:none;fill:#1a5fb4;fill-opacity:1;stroke:none;stroke-width:7.87157;stroke-linecap:round;stroke-linejoin:miter;stroke-miterlimit:4;stroke-dasharray:none;stroke-dashoffset:0;stroke-opacity:1;marker:none;marker-start:none;marker-mid:none;marker-end:none;paint-order:normal"
         id="rect2284"
         width="32.798141"
         height="26.23856"
         x="1536.1711"
         y="763.34918"
         rx="5.0225954"
         ry="5.0225954" />
      <rect
         ry="5.0225954"
         rx="5.0225954"
         y="763.34918"
         x="1496.8134"
         height="26.23856"
         width="32.798141"
         id="rect2286"
         style="vector-effect:none;fill:#1a5fb4;fill-opacity:1;stroke:none;stroke-width:7.87157;stroke-linecap:round;stroke-linejoin:miter;stroke-miterlimit:4;stroke-dasharray:none;stroke-dashoffset:0;stroke-opacity:1;marker:none;marker-start:none;marker-mid:none;marker-end:none;paint-order:normal" />
      <rect
         style="vector-effect:none;fill:#1a5fb4;fill-opacity:1;stroke:none;stroke-width:7.87157;stroke-linecap:round;stroke-linejoin:miter;stroke-miterlimit:4;stroke-dasharray:none;stroke-dashoffset:0;stroke-opacity:1;marker:none;marker-start:none;marker-mid:none;marker-end:none;paint-order:normal"
         id="rect2288"
         width="32.798141"
         height="26.23856"
         x="1457.4556"
         y="763.34918"
         rx="5.0225954"
         ry="5.0225954" />
      <rect
         ry="5.0225954"
         rx="5.0225954"
         y="763.34918"
         x="1418.0977"
         height="26.23856"
         width="32.798141"
         id="rect2290"
         style="vector-effect:none;fill:#1a5fb4;fill-opacity:1;stroke:none;stroke-width:7.87157;stroke-linecap:round;stroke-linejoin:miter;stroke-miterlimit:4;stroke-dasharray:none;stroke-dashoffset:0;stroke-opacity:1;marker:none;marker-start:none;marker-mid:none;marker-end:none;paint-order:normal" />
      <rect
         style="vector-effect:none;fill:#1a5fb4;fill-opacity:1;stroke:none;stroke-width:7.87157;stroke-linecap:round;stroke-linejoin:miter;stroke-miterlimit:4;stroke-dasharray:none;stroke-dashoffset:0;stroke-opacity:1;marker:none;marker-start:none;marker-mid:none;marker-end:none;paint-order:normal"
         id="rect2292"
         width="32.798141"
         height="26.23856"
         x="1378.7397"
         y="763.34918"
         rx="5.0225954"
         ry="5.0225954" />
      <rect
         ry="5.0225954"
         rx="5.0225954"
         y="763.34918"
         x="1339.382"
         height="26.23856"
         width="32.798141"
         id="rect2294"
         style="vector-effect:none;fill:#1a5fb4;fill-opacity:1;stroke:none;stroke-width:7.87157;stroke-linecap:round;stroke-linejoin:miter;stroke-miterlimit:4;stroke-dasharray:none;stroke-dashoffset:0;stroke-opacity:1;marker:none;marker-start:none;marker-mid:none;marker-end:none;paint-order:normal" />
      <rect
         style="vector-effect:none;fill:#1a5fb4;fill-opacity:1;stroke:none;stroke-width:7.87157;stroke-linecap:round;stroke-linejoin:miter;stroke-miterlimit:4;stroke-dasharray:none;stroke-dashoffset:0;stroke-opacity:1;marker:none;marker-start:none;marker-mid:none;marker-end:none;paint-order:normal"
         id="rect2296"
         width="32.798141"
         height="26.23856"
         x="1300.0242"
         y="763.34918"
         rx="5.0225954"
         ry="5.0225954" />
      <rect
         ry="5.0225954"
         rx="5.0225954"
         y="763.34918"
         x="1260.6663"
         height="26.23856"
         width="32.798141"
         id="rect2298"
         style="vector-effect:none;fill:#1a5fb4;fill-opacity:1;stroke:none;stroke-width:7.87157;stroke-linecap:round;stroke-linejoin:miter;stroke-miterlimit:4;stroke-dasharray:none;stroke-dashoffset:0;stroke-opacity:1;marker:none;marker-start:none;marker-mid:none;marker-end:none;paint-order:normal" />
      <rect
         style="vector-effect:none;fill:#1a5fb4;fill-opacity:1;stroke:none;stroke-width:7.87157;stroke-linecap:round;stroke-linejoin:miter;stroke-miterlimit:4;stroke-dasharray:none;stroke-dashoffset:0;stroke-opacity:1;marker:none;marker-start:none;marker-mid:none;marker-end:none;paint-order:normal"
         id="rect2300"
         width="52.477116"
         height="26.23856"
         x="1201.6295"
         y="763.34918"
         rx="5.0225954"
         ry="5.0225954" />
      <rect
         ry="5.0225954"
         rx="5.0225954"
         y="730.55103"
         x="1555.8501"
         height="26.23856"
         width="52.477039"
         id="rect2302"
         style="vector-effect:none;fill:#1a5fb4;fill-opacity:1;stroke:none;stroke-width:7.87157;stroke-linecap:round;stroke-linejoin:miter;stroke-miterlimit:4;stroke-dasharray:none;stroke-dashoffset:0;stroke-opacity:1;marker:none;marker-start:none;marker-mid:none;marker-end:none;paint-order:normal" />
      <rect
         style="vector-effect:none;fill:#1a5fb4;fill-opacity:1;stroke:none;stroke-width:7.87157;stroke-linecap:round;stroke-linejoin:miter;stroke-miterlimit:4;stroke-dasharray:none;stroke-dashoffset:0;stroke-opacity:1;marker:none;marker-start:none;marker-mid:none;marker-end:none;paint-order:normal"
         id="rect2304"
         width="32.798141"
         height="26.23856"
         x="1516.4922"
         y="730.55103"
         rx="5.0225954"
         ry="5.0225954" />
      <rect
         ry="5.0225954"
         rx="5.0225954"
         y="730.55103"
         x="1477.1344"
         height="26.23856"
         width="32.798141"
         id="rect2306"
         style="vector-effect:none;fill:#1a5fb4;fill-opacity:1;stroke:none;stroke-width:7.87157;stroke-linecap:round;stroke-linejoin:miter;stroke-miterlimit:4;stroke-dasharray:none;stroke-dashoffset:0;stroke-opacity:1;marker:none;marker-start:none;marker-mid:none;marker-end:none;paint-order:normal" />
      <rect
         style="vector-effect:none;fill:#1a5fb4;fill-opacity:1;stroke:none;stroke-width:7.87157;stroke-linecap:round;stroke-linejoin:miter;stroke-miterlimit:4;stroke-dasharray:none;stroke-dashoffset:0;stroke-opacity:1;marker:none;marker-start:none;marker-mid:none;marker-end:none;paint-order:normal"
         id="rect2308"
         width="32.798141"
         height="26.23856"
         x="1437.7766"
         y="730.55103"
         rx="5.0225954"
         ry="5.0225954" />
      <rect
         ry="5.0225954"
         rx="5.0225954"
         y="730.55103"
         x="1398.4187"
         height="26.23856"
         width="32.798141"
         id="rect2310"
         style="vector-effect:none;fill:#1a5fb4;fill-opacity:1;stroke:none;stroke-width:7.87157;stroke-linecap:round;stroke-linejoin:miter;stroke-miterlimit:4;stroke-dasharray:none;stroke-dashoffset:0;stroke-opacity:1;marker:none;marker-start:none;marker-mid:none;marker-end:none;paint-order:normal" />
      <rect
         style="vector-effect:none;fill:#1a5fb4;fill-opacity:1;stroke:none;stroke-width:7.87157;stroke-linecap:round;stroke-linejoin:miter;stroke-miterlimit:4;stroke-dasharray:none;stroke-dashoffset:0;stroke-opacity:1;marker:none;marker-start:none;marker-mid:none;marker-end:none;paint-order:normal"
         id="rect2312"
         width="32.798141"
         height="26.23856"
         x="1359.0609"
         y="730.55103"
         rx="5.0225954"
         ry="5.0225954" />
      <rect
         ry="5.0225954"
         rx="5.0225954"
         y="730.55103"
         x="1319.7031"
         height="26.23856"
         width="32.798141"
         id="rect2314"
         style="vector-effect:none;fill:#1a5fb4;fill-opacity:1;stroke:none;stroke-width:7.87157;stroke-linecap:round;stroke-linejoin:miter;stroke-miterlimit:4;stroke-dasharray:none;stroke-dashoffset:0;stroke-opacity:1;marker:none;marker-start:none;marker-mid:none;marker-end:none;paint-order:normal" />
      <rect
         style="vector-effect:none;fill:#1a5fb4;fill-opacity:1;stroke:none;stroke-width:7.87157;stroke-linecap:round;stroke-linejoin:miter;stroke-miterlimit:4;stroke-dasharray:none;stroke-dashoffset:0;stroke-opacity:1;marker:none;marker-start:none;marker-mid:none;marker-end:none;paint-order:normal"
         id="rect2316"
         width="32.798141"
         height="26.23856"
         x="1280.3452"
         y="730.55103"
         rx="5.0225954"
         ry="5.0225954" />
      <rect
         ry="5.0225954"
         rx="5.0225954"
         y="730.55103"
         x="1240.9873"
         height="26.23856"
         width="32.798141"
         id="rect2318"
         style="vector-effect:none;fill:#1a5fb4;fill-opacity:1;stroke:none;stroke-width:7.87157;stroke-linecap:round;stroke-linejoin:miter;stroke-miterlimit:4;stroke-dasharray:none;stroke-dashoffset:0;stroke-opacity:1;marker:none;marker-start:none;marker-mid:none;marker-end:none;paint-order:normal" />
      <rect
         style="vector-effect:none;fill:#1a5fb4;fill-opacity:1;stroke:none;stroke-width:7.87157;stroke-linecap:round;stroke-linejoin:miter;stroke-miterlimit:4;stroke-dasharray:none;stroke-dashoffset:0;stroke-opacity:1;marker:none;marker-start:none;marker-mid:none;marker-end:none;paint-order:normal"
         id="rect2320"
         width="32.798141"
         height="26.23856"
         x="1201.6295"
         y="730.55103"
         rx="5.0225954"
         ry="5.0225954" />
      <rect
         style="vector-effect:none;fill:#1a5fb4;fill-opacity:1;stroke:none;stroke-width:7.87157;stroke-linecap:round;stroke-linejoin:miter;stroke-miterlimit:4;stroke-dasharray:none;stroke-dashoffset:0;stroke-opacity:1;marker:none;marker-start:none;marker-mid:none;marker-end:none;paint-order:normal"
         id="rect2322"
         width="32.798141"
         height="26.23856"
         x="1201.6295"
         y="796.14734"
         rx="5.0225954"
         ry="5.0225954" />
      <rect
         style="vector-effect:none;fill:#1a5fb4;fill-opacity:1;stroke:none;stroke-width:7.87157;stroke-linecap:round;stroke-linejoin:miter;stroke-miterlimit:4;stroke-dasharray:none;stroke-dashoffset:0;stroke-opacity:1;marker:none;marker-start:none;marker-mid:none;marker-end:none;paint-order:normal"
         id="rect2324"
         width="32.798141"
         height="26.23856"
         x="1260.6663"
         y="828.94562"
         rx="5.0225954"
         ry="5.0225954" />
      <rect
         ry="5.0225954"
         rx="5.0225954"
         y="828.94562"
         x="1201.6295"
         height="26.23856"
         width="52.477211"
         id="rect2326"
         style="vector-effect:none;fill:#1a5fb4;fill-opacity:1;stroke:none;stroke-width:7.87157;stroke-linecap:round;stroke-linejoin:miter;stroke-miterlimit:4;stroke-dasharray:none;stroke-dashoffset:0;stroke-opacity:1;marker:none;marker-start:none;marker-mid:none;marker-end:none;paint-order:normal" />
      <rect
         ry="5.0225954"
         rx="5.0225954"
         y="763.34918"
         x="1575.5289"
         height="26.23856"
         width="32.798141"
         id="rect2328"
         style="vector-effect:none;fill:#1a5fb4;fill-opacity:1;stroke:none;stroke-width:7.87157;stroke-linecap:round;stroke-linejoin:miter;stroke-miterlimit:4;stroke-dasharray:none;stroke-dashoffset:0;stroke-opacity:1;marker:none;marker-start:none;marker-mid:none;marker-end:none;paint-order:normal" />
      <rect
         style="vector-effect:none;fill:#1a5fb4;fill-opacity:1;stroke:none;stroke-width:7.87157;stroke-linecap:round;stroke-linejoin:miter;stroke-miterlimit:4;stroke-dasharray:none;stroke-dashoffset:0;stroke-opacity:1;marker:none;marker-start:none;marker-mid:none;marker-end:none;paint-order:normal"
         id="rect2330"
         width="19.678816"
         height="59.036724"
         x="1588.6482"
         y="763.34918"
         rx="5.0225954"
         ry="5.0225954" />
      <g
         id="g3293"
         transform="matrix(0.43832528,0,0,0.43832528,492.14863,1304.1763)">
        <rect
           width="328.55078"
           height="374.18201"
           x="1939.6774"
           y="-1899.7522"
           rx="20.079241"
           ry="20.079241"
           stroke-width="6.69309"
           stroke-linecap="square"
           stroke-linejoin="round"
           stroke-dashoffset="26.4"
           id="rect3211"
           style="fill:none;stroke:#ffffff" />
        <circle
           cx="2247.0217"
           cy="-1874.4869"
           r="5.8806181"
           stroke-width="6.69309"
           stroke-linecap="square"
           stroke-linejoin="round"
           stroke-dashoffset="26.4"
           id="circle3247"
           style="fill:none;stroke:#ffffff" />
        <path
           d="m 1941.7359,-1824.3145 h 325.3995"
           stroke-width="6.69309"
           id="path3249"
           sodipodi:nodetypes="cc"
           style="fill:none;stroke:#ffffff" />
        <path
           d="m 2335.6726,-1884.9816 v 343.9645"
           opacity="0.4"
           marker-start="url(#o)"
           marker-end="url(#p)"
           id="path3255"
           style="fill:none;stroke:#ffffff;stroke-width:6.69309"
           sodipodi:nodetypes="cc" />
        <path
           d="m 1941.7359,-1584.9846 h 325.3995"
           stroke-width="6.69309"
           id="path3337"
           sodipodi:nodetypes="cc"
           style="fill:none;stroke:#ffffff" />
        <path
           style="font-variation-settings:normal;vector-effect:none;fill:none;fill-opacity:1;stroke:#ffffff;stroke-width:6.69309;stroke-linecap:butt;stroke-linejoin:miter;stroke-miterlimit:4;stroke-dasharray:none;stroke-dashoffset:0;stroke-opacity:1;stop-color:#000000"
           d="m 2103.9133,-1525.9394 v -57.4616"
           id="path3339" />
        <path
           d="M 1993.1985,-1824.3145 H 1890.7026"
           stroke-width="11.4267"
           id="path3587"
           sodipodi:nodetypes="cc"
           style="font-variation-settings:normal;opacity:0.4;vector-effect:none;fill:none;fill-opacity:1;stroke:#ffffff;stroke-width:6.69367;stroke-linecap:butt;stroke-linejoin:miter;stroke-miterlimit:4;stroke-dasharray:none;stroke-dashoffset:0;stroke-opacity:1;stop-color:#000000" />
        <path
           d="M 1993.1985,-1899.8192 H 1890.7026"
           stroke-width="11.4267"
           id="path3726"
           sodipodi:nodetypes="cc"
           style="font-variation-settings:normal;opacity:0.4;vector-effect:none;fill:none;fill-opacity:1;stroke:#ffffff;stroke-width:6.69367;stroke-linecap:butt;stroke-linejoin:miter;stroke-miterlimit:4;stroke-dasharray:none;stroke-dashoffset:0;stroke-opacity:1;stop-color:#000000" />
        <path
           d="m 1905.3892,-1758.9049 v -49.7407"
           stroke-width="11.4267"
           id="path3728"
           sodipodi:nodetypes="cc"
           style="font-variation-settings:normal;opacity:0.4;vector-effect:none;fill:none;fill-opacity:1;stroke:#ffffff;stroke-width:6.69367;stroke-linecap:butt;stroke-linejoin:miter;stroke-miterlimit:4;stroke-dasharray:none;stroke-dashoffset:0;stroke-opacity:1;marker-end:url(#p);stop-color:#000000" />
        <path
           d="m 1905.3892,-1964.546 v 49.7406"
           stroke-width="11.4267"
           id="path3730"
           sodipodi:nodetypes="cc"
           style="font-variation-settings:normal;opacity:0.4;vector-effect:none;fill:none;fill-opacity:1;stroke:#ffffff;stroke-width:6.69367;stroke-linecap:butt;stroke-linejoin:miter;stroke-miterlimit:4;stroke-dasharray:none;stroke-dashoffset:0;stroke-opacity:1;marker-end:url(#p);stop-color:#000000" />
        <path
           style="font-variation-settings:normal;opacity:0.4;vector-effect:none;fill:none;fill-opacity:1;stroke:#ffffff;stroke-width:6.69367;stroke-linecap:butt;stroke-linejoin:miter;stroke-miterlimit:4;stroke-dasharray:none;stroke-dashoffset:0;stroke-opacity:1;stop-color:#000000"
           d="m 1905.3803,-1827.8122 v -68.4423"
           id="path3732" />
        <path
           d="M 2352.152,-1526.3949 H 2249.6561"
           stroke-width="11.4267"
           id="path3882"
           sodipodi:nodetypes="cc"
           style="font-variation-settings:normal;opacity:0.4;vector-effect:none;fill:none;fill-opacity:1;stroke:#ffffff;stroke-width:6.69367;stroke-linecap:butt;stroke-linejoin:miter;stroke-miterlimit:4;stroke-dasharray:none;stroke-dashoffset:0;stroke-opacity:1;stop-color:#000000" />
        <path
           d="M 2352.152,-1899.8192 H 2249.6561"
           stroke-width="11.4267"
           id="path3884"
           sodipodi:nodetypes="cc"
           style="font-variation-settings:normal;opacity:0.4;vector-effect:none;fill:none;fill-opacity:1;stroke:#ffffff;stroke-width:6.69367;stroke-linecap:butt;stroke-linejoin:miter;stroke-miterlimit:4;stroke-dasharray:none;stroke-dashoffset:0;stroke-opacity:1;stop-color:#000000" />
      </g>
      <rect
         width="20.536222"
         height="17.602478"
         x="1350.3583"
         y="478.46689"
         rx="2.9337461"
         ry="2.9337461"
         stroke-width="2.93375"
         stroke-linecap="square"
         stroke-linejoin="round"
         stroke-dashoffset="26.4"
         id="rect128-6"
         style="font-variation-settings:normal;opacity:1;vector-effect:none;fill:none;fill-opacity:1;stroke:#ffffff;stroke-width:2.93375;stroke-linecap:butt;stroke-linejoin:miter;stroke-miterlimit:4;stroke-dasharray:none;stroke-dashoffset:0;stroke-opacity:1;stop-color:#000000;stop-opacity:1" />
      <g
         id="g41201"
         transform="matrix(0.72922415,0,0,0.72922415,700.48759,205.38541)">
        <path
           id="rect31589"
           style="font-variation-settings:normal;opacity:1;vector-effect:none;fill:#1a5fb4;fill-opacity:1;stroke:none;stroke-width:2.76644;stroke-linecap:round;stroke-linejoin:miter;stroke-miterlimit:4;stroke-dasharray:none;stroke-dashoffset:0;stroke-opacity:1;-inkscape-stroke:none;marker:none;marker-start:none;marker-mid:none;marker-end:none;paint-order:normal;stop-color:#000000;stop-opacity:1"
           sodipodi:type="inkscape:offset"
           inkscape:radius="11.989562"
           inkscape:original="M 2427.0781 316.86328 C 2412.152 316.86328 2400.1348 328.88053 2400.1348 343.80664 L 2400.1348 747.80859 C 2400.1348 762.73471 2412.152 774.75 2427.0781 774.75 L 2706.9062 774.75 C 2721.8324 774.75 2733.8496 762.73471 2733.8496 747.80859 L 2733.8496 343.80664 C 2733.8496 328.88053 2721.8324 316.86328 2706.9062 316.86328 L 2427.0781 316.86328 z "
           d="m 2427.0781,304.87305 c -21.3614,0 -38.9336,17.57218 -38.9336,38.93359 v 404.00195 c 0,21.36142 17.5732,38.93164 38.9336,38.93164 h 279.8281 c 21.3605,0 38.9336,-17.57022 38.9336,-38.93164 V 343.80664 c 0,-21.36141 -17.5721,-38.93359 -38.9336,-38.93359 z"
           transform="translate(-142.8724,-22.4924)" />
        <rect
           style="font-variation-settings:normal;opacity:1;vector-effect:none;fill:#99c1f1;fill-opacity:1;stroke:none;stroke-width:2.76644;stroke-linecap:round;stroke-linejoin:miter;stroke-miterlimit:4;stroke-dasharray:none;stroke-dashoffset:0;stroke-opacity:1;-inkscape-stroke:none;marker:none;marker-start:none;marker-mid:none;marker-end:none;paint-order:normal;stop-color:#000000;stop-opacity:1"
           id="rect29571"
           width="333.71484"
           height="457.88672"
           x="2257.2625"
           y="294.37164"
           rx="26.942444"
           ry="26.942444" />
        <rect
           style="fill:#ffffff;stroke-width:4.02869;stroke-linecap:round;stroke-linejoin:round;stroke-dasharray:4.02869, 8.05739;stop-color:#000000"
           id="rect674"
           width="40.28693"
           height="40.28693"
           x="2318.4998"
           y="435.52798"
           rx="20.143465"
           ry="20.143465" />
        <rect
           style="fill:#ffffff;stroke-width:4.02869;stroke-linecap:round;stroke-linejoin:round;stroke-dasharray:4.02869, 8.05739;stop-color:#000000"
           id="rect676"
           width="40.28693"
           height="40.28693"
           x="2378.9302"
           y="435.52798"
           rx="20.143465"
           ry="20.143465" />
        <rect
           style="fill:#ffffff;stroke-width:4.02869;stroke-linecap:round;stroke-linejoin:round;stroke-dasharray:4.02869, 8.05739;stop-color:#000000"
           id="rect684"
           width="40.28693"
           height="40.28693"
           x="2318.4998"
           y="495.95834"
           rx="20.143465"
           ry="20.143465" />
        <rect
           style="fill:#ffffff;stroke-width:4.02869;stroke-linecap:round;stroke-linejoin:round;stroke-dasharray:4.02869, 8.05739;stop-color:#000000"
           id="rect686"
           width="40.28693"
           height="40.28693"
           x="2378.9302"
           y="495.95834"
           rx="20.143465"
           ry="20.143465" />
        <rect
           style="fill:#ffffff;stroke-width:4.02869;stroke-linecap:round;stroke-linejoin:round;stroke-dasharray:4.02869, 8.05739;stop-color:#000000"
           id="rect694"
           width="40.28693"
           height="40.28693"
           x="2318.4998"
           y="556.38861"
           rx="20.143465"
           ry="20.143465" />
        <rect
           style="fill:#ffffff;stroke-width:4.02869;stroke-linecap:round;stroke-linejoin:round;stroke-dasharray:4.02869, 8.05739;stop-color:#000000"
           id="rect696"
           width="40.28693"
           height="40.28693"
           x="2378.9302"
           y="556.38861"
           rx="20.143465"
           ry="20.143465" />
        <rect
           style="fill:#ffffff;stroke-width:4.02869;stroke-linecap:round;stroke-linejoin:round;stroke-dasharray:4.02869, 8.05739;stop-color:#000000"
           id="rect704"
           width="40.28693"
           height="40.28693"
           x="2318.4998"
           y="616.81903"
           rx="20.143465"
           ry="20.143465" />
        <rect
           style="fill:#ffffff;stroke-width:4.02869;stroke-linecap:round;stroke-linejoin:round;stroke-dasharray:4.02869, 8.05739;stop-color:#000000"
           id="rect706"
           width="40.28693"
           height="40.28693"
           x="2378.9302"
           y="616.81903"
           rx="20.143465"
           ry="20.143465" />
        <rect
           style="fill:#ffffff;stroke-width:4.02869;stroke-linecap:round;stroke-linejoin:round;stroke-dasharray:4.02869, 8.05739;stop-color:#000000"
           id="rect720"
           width="40.28693"
           height="40.28693"
           x="2439.3606"
           y="435.52798"
           rx="20.143465"
           ry="20.143465" />
        <rect
           style="fill:#ffffff;stroke-width:4.02869;stroke-linecap:round;stroke-linejoin:round;stroke-dasharray:4.02869, 8.05739;stop-color:#000000"
           id="rect722"
           width="40.28693"
           height="40.28693"
           x="2499.791"
           y="435.52798"
           rx="20.143465"
           ry="20.143465" />
        <rect
           style="fill:#ffffff;stroke-width:4.02869;stroke-linecap:round;stroke-linejoin:round;stroke-dasharray:4.02869, 8.05739;stop-color:#000000"
           id="rect726"
           width="40.28693"
           height="40.28693"
           x="2439.3606"
           y="495.95834"
           rx="20.143465"
           ry="20.143465" />
        <rect
           style="fill:#ffffff;stroke-width:4.02869;stroke-linecap:round;stroke-linejoin:round;stroke-dasharray:4.02869, 8.05739;stop-color:#000000"
           id="rect728"
           width="40.28693"
           height="40.28693"
           x="2499.791"
           y="495.95834"
           rx="20.143465"
           ry="20.143465" />
        <rect
           style="fill:#ffffff;stroke-width:4.02869;stroke-linecap:round;stroke-linejoin:round;stroke-dasharray:4.02869, 8.05739;stop-color:#000000"
           id="rect732"
           width="40.28693"
           height="40.28693"
           x="2439.3606"
           y="556.38861"
           rx="20.143465"
           ry="20.143465" />
        <rect
           style="fill:#ffffff;stroke-width:4.02869;stroke-linecap:round;stroke-linejoin:round;stroke-dasharray:4.02869, 8.05739;stop-color:#000000"
           id="rect734"
           width="40.28693"
           height="40.28693"
           x="2499.791"
           y="556.38861"
           rx="20.143465"
           ry="20.143465" />
        <rect
           style="fill:#ffffff;stroke-width:4.02869;stroke-linecap:round;stroke-linejoin:round;stroke-dasharray:4.02869, 8.05739;stop-color:#000000"
           id="rect738"
           width="40.28693"
           height="40.28693"
           x="2439.3606"
           y="616.81903"
           rx="20.143465"
           ry="20.143465" />
        <rect
           style="fill:#ffffff;stroke-width:4.02869;stroke-linecap:round;stroke-linejoin:round;stroke-dasharray:4.02869, 8.05739;stop-color:#000000"
           id="rect740"
           width="40.28693"
           height="40.28693"
           x="2499.791"
           y="616.81903"
           rx="20.143465"
           ry="20.143465" />
        <path
           style="fill:#ffffff;stroke:#ffffff;stroke-width:2.01434;stroke-linecap:butt;stroke-linejoin:miter;stroke-miterlimit:4;stroke-dasharray:none;stroke-opacity:1"
           d="M 2319.5069,674.44834 V 375.09748"
           id="path3946-3"
           sodipodi:nodetypes="cc" />
        <path
           style="fill:#ffffff;stroke:#ffffff;stroke-width:2.01435;stroke-linecap:butt;stroke-linejoin:miter;stroke-miterlimit:4;stroke-dasharray:none;stroke-opacity:1"
           d="M 2539.0707,674.19101 V 375.09748"
           id="path4049-6"
           sodipodi:nodetypes="cc" />
        <g
           id="g2223"
           transform="matrix(2.0143466,0,0,2.0143466,1955.9174,254.23669)"
           style="fill:#ffffff">
          <path
             style="fill:#ffffff;stroke:#ffffff;stroke-width:1.00112px;stroke-linecap:butt;stroke-linejoin:miter;stroke-opacity:1"
             d="M 180.98641,75.50056 H 289.1888"
             id="path6063-7"
             sodipodi:nodetypes="cc" />
          <path
             id="rect7848-3-5"
             style="fill:#ffffff;stroke-linecap:round;stroke-linejoin:round;stop-color:#000000"
             d="m 183.02871,72.465325 v 5.826176 l -2.91308,-2.913084 z"
             sodipodi:nodetypes="cccc" />
          <path
             id="rect7848-6-3"
             style="fill:#ffffff;stroke-linecap:round;stroke-linejoin:round;stop-color:#000000"
             d="m 287,72.587472 v 5.826176 l 2.91307,-2.913084 z"
             sodipodi:nodetypes="cccc" />
        </g>
        <rect
           style="fill:#ffffff;fill-opacity:1;stroke-width:8.28381;stroke-linecap:round;stroke-linejoin:round;stroke-dasharray:8.28381, 16.5676;stop-color:#000000"
           id="rect2363"
           width="104.65497"
           height="20.378418"
           x="2381.9856"
           y="359.47656"
           rx="10.189209"
           ry="10.189209" />
      </g>
      <g
         id="g41174"
         transform="translate(28.175427)">
        <g
           id="g27868"
           transform="matrix(1.16717,0,0,1.16717,-608.17055,-171.76734)">
          <path
             style="vector-effect:none;fill:#1a5fb4;fill-opacity:1;stroke:none;stroke-width:2.37021;stroke-linecap:round;stroke-linejoin:miter;stroke-miterlimit:4;stroke-dasharray:none;stroke-dashoffset:0;stroke-opacity:1;marker:none;marker-start:none;marker-mid:none;marker-end:none;paint-order:normal"
             sodipodi:type="inkscape:offset"
             inkscape:radius="6.789465"
             inkscape:original="M 2707.0859 728.57227 C 2699.5633 728.57227 2693.5078 734.62776 2693.5078 742.15039 L 2693.5078 871.70312 C 2693.5078 879.22576 2699.5633 885.28125 2707.0859 885.28125 L 2762.0078 885.28125 C 2769.5304 885.28125 2775.5859 879.22576 2775.5859 871.70312 L 2775.5859 742.15039 C 2775.5859 734.62776 2769.5304 728.57227 2762.0078 728.57227 L 2707.0859 728.57227 z "
             xlink:href="#rect2256-6"
             id="path42015"
             inkscape:href="#rect2256-6"
             d="m 2707.0859,740.85938 c -11.1661,0 -20.3671,9.201 -20.3671,20.36718 v 110.47656 c 0,11.16619 9.201,20.36719 20.3671,20.36719 h 54.9219 c 11.1662,0 20.3672,-9.201 20.3672,-20.36719 V 761.22656 c 0,-11.16618 -9.201,-20.36719 -20.3672,-20.36718 z" />
          <rect
             ry="13.578756"
             rx="13.578756"
             y="2693.5076"
             x="-885.28137"
             height="82.079346"
             width="156.71004"
             id="rect2256-6"
             style="vector-effect:none;fill:#99c1f1;fill-opacity:1;stroke:none;stroke-width:2.37021;stroke-linecap:round;stroke-linejoin:miter;stroke-miterlimit:4;stroke-dasharray:none;stroke-dashoffset:0;stroke-opacity:1;marker:none;marker-start:none;marker-mid:none;marker-end:none;paint-order:normal"
             transform="rotate(-90)" />
          <path
             id="rect25326"
             style="fill:#1a5fb4;fill-opacity:1;stroke:none;stroke-width:1.7531;stroke-linecap:round;stroke-opacity:1;-inkscape-stroke:none;stop-color:#000000"
             d="m 2705.9839,727.38525 c 0,0.006 0,0.0111 0,0.0167 0,4.32614 3.4835,7.80802 7.8097,7.80802 h 41.1854 c 4.3261,0 7.8096,-3.48188 7.8096,-7.80802 0,-0.006 0,-0.0111 0,-0.0167 z" />
        </g>
        <rect
           style="fill:#ffffff;stroke-width:1.26987;stroke-linecap:round;stroke-linejoin:round;stroke-dasharray:1.26987, 2.53974;stop-color:#000000"
           id="rect28149"
           width="12.698671"
           height="12.698671"
           x="2548.5901"
           y="710.81158"
           rx="6.3493361"
           ry="6.3493361" />
        <rect
           style="fill:#ffffff;stroke-width:1.26987;stroke-linecap:round;stroke-linejoin:round;stroke-dasharray:1.26987, 2.53974;stop-color:#000000"
           id="rect28151"
           width="12.698671"
           height="12.698671"
           x="2567.6379"
           y="710.81158"
           rx="6.3493361"
           ry="6.3493361" />
        <rect
           style="fill:#ffffff;stroke-width:1.26987;stroke-linecap:round;stroke-linejoin:round;stroke-dasharray:1.26987, 2.53974;stop-color:#000000"
           id="rect28153"
           width="12.698671"
           height="12.698671"
           x="2548.5901"
           y="729.85962"
           rx="6.3493361"
           ry="6.3493361" />
        <rect
           style="fill:#ffffff;stroke-width:1.26987;stroke-linecap:round;stroke-linejoin:round;stroke-dasharray:1.26987, 2.53974;stop-color:#000000"
           id="rect28155"
           width="12.698671"
           height="12.698671"
           x="2567.6379"
           y="729.85962"
           rx="6.3493361"
           ry="6.3493361" />
        <rect
           style="fill:#ffffff;stroke-width:1.26987;stroke-linecap:round;stroke-linejoin:round;stroke-dasharray:1.26987, 2.53974;stop-color:#000000"
           id="rect28157"
           width="12.698671"
           height="12.698671"
           x="2548.5901"
           y="748.90741"
           rx="6.3493361"
           ry="6.3493361" />
        <rect
           style="fill:#ffffff;stroke-width:1.26987;stroke-linecap:round;stroke-linejoin:round;stroke-dasharray:1.26987, 2.53974;stop-color:#000000"
           id="rect28159"
           width="12.698671"
           height="12.698671"
           x="2567.6379"
           y="748.90741"
           rx="6.3493361"
           ry="6.3493361" />
        <rect
           style="fill:#ffffff;stroke-width:1.26987;stroke-linecap:round;stroke-linejoin:round;stroke-dasharray:1.26987, 2.53974;stop-color:#000000"
           id="rect28161"
           width="12.698671"
           height="12.698671"
           x="2548.5901"
           y="767.95575"
           rx="6.3493361"
           ry="6.3493361" />
        <rect
           style="fill:#ffffff;stroke-width:1.26987;stroke-linecap:round;stroke-linejoin:round;stroke-dasharray:1.26987, 2.53974;stop-color:#000000"
           id="rect28163"
           width="12.698671"
           height="12.698671"
           x="2567.6379"
           y="767.95575"
           rx="6.3493361"
           ry="6.3493361" />
        <rect
           style="fill:#ffffff;stroke-width:1.26987;stroke-linecap:round;stroke-linejoin:round;stroke-dasharray:1.26987, 2.53974;stop-color:#000000"
           id="rect28165"
           width="12.698671"
           height="12.698671"
           x="2586.6855"
           y="710.81158"
           rx="6.3493361"
           ry="6.3493361" />
        <rect
           style="fill:#ffffff;stroke-width:1.26987;stroke-linecap:round;stroke-linejoin:round;stroke-dasharray:1.26987, 2.53974;stop-color:#000000"
           id="rect28167"
           width="12.698671"
           height="12.698671"
           x="2605.7334"
           y="710.81158"
           rx="6.3493361"
           ry="6.3493361" />
        <rect
           style="fill:#ffffff;stroke-width:1.26987;stroke-linecap:round;stroke-linejoin:round;stroke-dasharray:1.26987, 2.53974;stop-color:#000000"
           id="rect28169"
           width="12.698671"
           height="12.698671"
           x="2586.6855"
           y="729.85962"
           rx="6.3493361"
           ry="6.3493361" />
        <rect
           style="fill:#ffffff;stroke-width:1.26987;stroke-linecap:round;stroke-linejoin:round;stroke-dasharray:1.26987, 2.53974;stop-color:#000000"
           id="rect28171"
           width="12.698671"
           height="12.698671"
           x="2605.7334"
           y="729.85962"
           rx="6.3493361"
           ry="6.3493361" />
        <rect
           style="fill:#ffffff;stroke-width:1.26987;stroke-linecap:round;stroke-linejoin:round;stroke-dasharray:1.26987, 2.53974;stop-color:#000000"
           id="rect28173"
           width="12.698671"
           height="12.698671"
           x="2586.6855"
           y="748.90741"
           rx="6.3493361"
           ry="6.3493361" />
        <rect
           style="fill:#ffffff;stroke-width:1.26987;stroke-linecap:round;stroke-linejoin:round;stroke-dasharray:1.26987, 2.53974;stop-color:#000000"
           id="rect28175"
           width="12.698671"
           height="12.698671"
           x="2605.7334"
           y="748.90741"
           rx="6.3493361"
           ry="6.3493361" />
        <rect
           style="fill:#ffffff;stroke-width:1.26987;stroke-linecap:round;stroke-linejoin:round;stroke-dasharray:1.26987, 2.53974;stop-color:#000000"
           id="rect28177"
           width="12.698671"
           height="12.698671"
           x="2586.6855"
           y="767.95575"
           rx="6.3493361"
           ry="6.3493361" />
        <rect
           style="fill:#ffffff;stroke-width:1.26987;stroke-linecap:round;stroke-linejoin:round;stroke-dasharray:1.26987, 2.53974;stop-color:#000000"
           id="rect28179"
           width="12.698671"
           height="12.698671"
           x="2605.7334"
           y="767.95575"
           rx="6.3493361"
           ry="6.3493361" />
        <path
           style="fill:#ffffff;stroke:#ffffff;stroke-width:0.634933;stroke-linecap:butt;stroke-linejoin:miter;stroke-miterlimit:4;stroke-dasharray:none;stroke-opacity:1"
           d="M 2548.9073,839.80786 V 691.76354"
           id="path28181"
           sodipodi:nodetypes="cc" />
        <path
           style="fill:#ffffff;stroke:#ffffff;stroke-width:0.634937;stroke-linecap:butt;stroke-linejoin:miter;stroke-miterlimit:4;stroke-dasharray:none;stroke-opacity:1"
           d="M 2618.1146,839.72674 V 691.76354"
           id="path28183"
           sodipodi:nodetypes="cc" />
        <g
           id="g28191"
           transform="matrix(0.63493378,0,0,0.63493378,2434.3012,653.6675)"
           style="fill:#ffffff">
          <path
             style="fill:#ffffff;stroke:#ffffff;stroke-width:1.00112px;stroke-linecap:butt;stroke-linejoin:miter;stroke-opacity:1"
             d="M 180.98641,75.50056 H 289.1888"
             id="path28185"
             sodipodi:nodetypes="cc" />
          <path
             id="path28187"
             style="fill:#ffffff;stroke-linecap:round;stroke-linejoin:round;stop-color:#000000"
             d="m 183.02871,72.465325 v 5.826176 l -2.91308,-2.913084 z"
             sodipodi:nodetypes="cccc" />
          <path
             id="path28189"
             style="fill:#ffffff;stroke-linecap:round;stroke-linejoin:round;stop-color:#000000"
             d="m 287,72.587472 v 5.826176 l 2.91307,-2.913084 z"
             sodipodi:nodetypes="cccc" />
        </g>
        <rect
           style="fill:#ffffff;stroke-width:1.26987;stroke-linecap:round;stroke-linejoin:round;stroke-dasharray:1.26987, 2.53974;stop-color:#000000"
           id="rect28195"
           width="12.698671"
           height="12.698671"
           x="2548.5901"
           y="839.80798"
           rx="6.3493361"
           ry="6.3493361" />
        <rect
           style="fill:#ffffff;stroke-width:1.26987;stroke-linecap:round;stroke-linejoin:round;stroke-dasharray:1.26987, 2.53974;stop-color:#000000"
           id="rect28197"
           width="12.698671"
           height="12.698671"
           x="2567.6379"
           y="839.80798"
           rx="6.3493361"
           ry="6.3493361" />
        <rect
           style="fill:#ffffff;stroke-width:1.26987;stroke-linecap:round;stroke-linejoin:round;stroke-dasharray:1.26987, 2.53974;stop-color:#000000"
           id="rect28199"
           width="12.698671"
           height="12.698671"
           x="2586.6855"
           y="839.80798"
           rx="6.3493361"
           ry="6.3493361" />
        <rect
           style="fill:#ffffff;stroke-width:1.26987;stroke-linecap:round;stroke-linejoin:round;stroke-dasharray:1.26987, 2.53974;stop-color:#000000"
           id="rect28201"
           width="12.698671"
           height="12.698671"
           x="2605.7334"
           y="839.80798"
           rx="6.3493361"
           ry="6.3493361" />
        <rect
           style="fill:#ffffff;stroke-width:1.26987;stroke-linecap:round;stroke-linejoin:round;stroke-dasharray:1.26987, 2.53974;stop-color:#000000"
           id="rect44401"
           width="12.698671"
           height="12.698671"
           x="2548.5901"
           y="787.67389"
           rx="6.3493361"
           ry="6.3493361" />
        <rect
           style="fill:#ffffff;stroke-width:1.26987;stroke-linecap:round;stroke-linejoin:round;stroke-dasharray:1.26987, 2.53974;stop-color:#000000"
           id="rect44403"
           width="12.698671"
           height="12.698671"
           x="2567.6379"
           y="787.67389"
           rx="6.3493361"
           ry="6.3493361" />
        <rect
           style="fill:#ffffff;stroke-width:1.26987;stroke-linecap:round;stroke-linejoin:round;stroke-dasharray:1.26987, 2.53974;stop-color:#000000"
           id="rect44405"
           width="12.698671"
           height="12.698671"
           x="2586.6855"
           y="787.67389"
           rx="6.3493361"
           ry="6.3493361" />
        <rect
           style="fill:#ffffff;stroke-width:1.26987;stroke-linecap:round;stroke-linejoin:round;stroke-dasharray:1.26987, 2.53974;stop-color:#000000"
           id="rect44407"
           width="12.698671"
           height="12.698671"
           x="2605.7334"
           y="787.67389"
           rx="6.3493361"
           ry="6.3493361" />
      </g>
    </g>
    <g
       transform="matrix(4.9702911,0,0,4.9702911,532.77289,-102.13409)"
       id="g29394-9"
       style="display:inline;stroke-width:1.04199">
      <path
         id="rect29074-6"
         style="display:inline;opacity:1;vector-effect:none;fill:#99c1f1;fill-opacity:1;stroke:none;stroke-width:1.03994;stroke-linecap:round;stroke-linejoin:miter;stroke-miterlimit:4;stroke-dasharray:none;stroke-dashoffset:0;stroke-opacity:1;marker:none;marker-start:none;marker-mid:none;marker-end:none;paint-order:normal"
         d="m 59.729442,183.89973 h 93.618748 c 0.98138,0 1.77145,0.79007 1.77145,1.77146 v 30.96686 c 0,0.98139 -0.79007,1.77146 -1.77145,1.77146 H 59.729442 c -0.981385,0 -1.771453,-0.79007 -1.771453,-1.77146 v -30.96686 c 0,-0.98139 0.790068,-1.77146 1.771453,-1.77146 z"
         sodipodi:nodetypes="sssssssss" />
      <path
         id="rect29076-0"
         style="display:inline;opacity:1;vector-effect:none;fill:#cee1f8;fill-opacity:1;stroke:none;stroke-width:1.037;stroke-linecap:round;stroke-linejoin:miter;stroke-miterlimit:4;stroke-dasharray:none;stroke-dashoffset:0;stroke-opacity:1;marker:none;marker-start:none;marker-mid:none;marker-end:none;paint-order:normal"
         d="m 59.729442,182.69067 h 93.618748 c 0.98138,0 1.77145,0.79007 1.77145,1.77146 v 30.77207 c 0,0.98139 -0.79007,1.77145 -1.77145,1.77145 H 59.729442 c -0.981385,0 -1.771453,-0.79006 -1.771453,-1.77145 v -30.77207 c 0,-0.98139 0.790068,-1.77146 1.771453,-1.77146 z"
         sodipodi:nodetypes="sssssssss" />
      <path
         id="path6153"
         style="display:inline;opacity:1;vector-effect:none;fill:#1a5fb4;fill-opacity:1;stroke:none;stroke-width:1.65416;stroke-linecap:round;stroke-linejoin:miter;stroke-miterlimit:4;stroke-dasharray:none;stroke-dashoffset:0;stroke-opacity:1;marker:none;marker-start:none;marker-mid:none;marker-end:none;paint-order:normal"
         d="m 138.72959,200.40592 h 4.58871 c 0.56117,0 1.01293,0.45177 1.01293,1.01294 v 3.2658 c 0,0.56116 -0.45176,1.01293 -1.01293,1.01293 h -4.58871 c -0.56116,0 -1.01293,-0.45177 -1.01293,-1.01293 v -3.2658 c 0,-0.56117 0.45177,-1.01294 1.01293,-1.01294 z m 7.94035,-13.06114 h 4.58871 c 0.56117,0 1.01293,0.45177 1.01293,1.01294 v 3.2658 c 0,0.56116 -0.45176,1.01293 -1.01293,1.01293 h -4.58871 c -0.56116,0 -1.01293,-0.45177 -1.01293,-1.01293 v -3.2658 c 0,-0.56117 0.45177,-1.01294 1.01293,-1.01294 z m 0,19.68763 h 4.58871 c 0.56117,0 1.01293,0.45177 1.01293,1.01294 v 3.2658 c 0,0.56116 -0.45176,1.01293 -1.01293,1.01293 h -4.58871 c -0.56116,0 -1.01293,-0.45177 -1.01293,-1.01293 v -3.2658 c 0,-0.56117 0.45177,-1.01294 1.01293,-1.01294 z m -7.94035,-19.68763 h 4.58871 c 0.56117,0 1.01293,0.45177 1.01293,1.01294 v 3.2658 c 0,0.56116 -0.45176,1.01293 -1.01293,1.01293 h -4.58871 c -0.56116,0 -1.01293,-0.45177 -1.01293,-1.01293 v -3.2658 c 0,-0.56117 0.45177,-1.01294 1.01293,-1.01294 z m -7.9375,0 h 4.58871 c 0.56117,0 1.01293,0.45177 1.01293,1.01294 v 3.2658 c 0,0.56116 -0.45176,1.01293 -1.01293,1.01293 h -4.58871 c -0.56116,0 -1.01293,-0.45177 -1.01293,-1.01293 v -3.2658 c 0,-0.56117 0.45177,-1.01294 1.01293,-1.01294 z m 7.9375,19.68763 h 4.58871 c 0.56117,0 1.01293,0.45177 1.01293,1.01294 v 3.2658 c 0,0.56116 -0.45176,1.01293 -1.01293,1.01293 h -4.58871 c -0.56116,0 -1.01293,-0.45177 -1.01293,-1.01293 v -3.2658 c 0,-0.56117 0.45177,-1.01294 1.01293,-1.01294 z m -7.9375,0 h 4.58871 c 0.56117,0 1.01293,0.45177 1.01293,1.01294 v 3.2658 c 0,0.56116 -0.45176,1.01293 -1.01293,1.01293 h -4.58871 c -0.56116,0 -1.01293,-0.45177 -1.01293,-1.01293 v -3.2658 c 0,-0.56117 0.45177,-1.01294 1.01293,-1.01294 z m -49.2697,0 h 4.588705 c 0.56117,0 1.01293,0.45177 1.01293,1.01294 v 3.2658 c 0,0.56116 -0.45176,1.01293 -1.01293,1.01293 H 81.52239 c -0.561165,0 -1.012933,-0.45177 -1.012933,-1.01293 v -3.2658 c 0,-0.56117 0.451768,-1.01294 1.012933,-1.01294 z m 3.952077,-19.84375 h 4.588708 c 0.56116,0 1.01293,0.45177 1.01293,1.01294 v 3.2658 c 0,0.56116 -0.45177,1.01293 -1.01293,1.01293 h -4.588708 c -0.56116,0 -1.01293,-0.45177 -1.01293,-1.01293 v -3.2658 c 0,-0.56117 0.45177,-1.01294 1.01293,-1.01294 z m -3.968761,6.61458 h 4.588721 c 0.56116,0 1.012928,0.45177 1.012928,1.01294 v 3.2658 c 0,0.56116 -0.451768,1.01293 -1.012928,1.01293 h -4.588721 c -0.56116,0 -1.01293,-0.45177 -1.01293,-1.01293 v -3.2658 c 0,-0.56117 0.45177,-1.01294 1.01293,-1.01294 z m 3.968751,6.61458 h 4.588708 c 0.56117,0 1.01293,0.45177 1.01293,1.01293 v 3.2658 c 0,0.56117 -0.45176,1.01294 -1.01293,1.01294 h -4.588708 c -0.56116,0 -1.01293,-0.45177 -1.01293,-1.01294 v -3.2658 c 0,-0.56116 0.45177,-1.01293 1.01293,-1.01293 z m 38.359133,-6.61458 h 1.94287 c 0.56116,0 1.01293,0.45177 1.01293,1.01294 v 9.88037 c 0,0.56117 -0.45177,1.01294 -1.01293,1.01294 h -1.94287 c -0.56116,0 -1.01293,-0.45177 -1.01293,-1.01294 v -9.88037 c 0,-0.56117 0.45177,-1.01294 1.01293,-1.01294 z m -2.64584,0 h 4.58871 c 0.56116,0 1.01293,0.45177 1.01293,1.01294 v 3.2658 c 0,0.56116 -0.45177,1.01293 -1.01293,1.01293 h -4.58871 c -0.56117,0 -1.01293,-0.45177 -1.01293,-1.01293 v -3.2658 c 0,-0.56117 0.45176,-1.01294 1.01293,-1.01294 z m -59.571001,13.22917 h 8.557485 c 0.561165,0 1.012933,0.45177 1.012933,1.01294 v 3.2658 c 0,0.56116 -0.451768,1.01293 -1.012933,1.01293 h -8.557485 c -0.561165,0 -1.012933,-0.45177 -1.012933,-1.01293 v -3.2658 c 0,-0.56117 0.451768,-1.01294 1.012933,-1.01294 z m 11.906258,0 h 4.588705 c 0.56117,0 1.01293,0.45177 1.01293,1.01294 v 3.2658 c 0,0.56116 -0.45176,1.01293 -1.01293,1.01293 h -4.588705 c -0.561165,0 -1.012933,-0.45177 -1.012933,-1.01293 v -3.2658 c 0,-0.56117 0.451768,-1.01294 1.012933,-1.01294 z m -11.90625,-6.61459 h 4.588705 c 0.561165,0 1.012933,0.45177 1.012933,1.01293 v 3.2658 c 0,0.56117 -0.451768,1.01294 -1.012933,1.01294 h -4.588705 c -0.561165,0 -1.012933,-0.45177 -1.012933,-1.01294 v -3.2658 c 0,-0.56116 0.451768,-1.01293 1.012933,-1.01293 z m -8e-6,-13.22916 h 4.588706 c 0.561165,0 1.012933,0.45177 1.012933,1.01294 v 3.2658 c 0,0.56116 -0.451768,1.01293 -1.012933,1.01293 h -4.588706 c -0.561165,0 -1.012933,-0.45177 -1.012933,-1.01293 v -3.2658 c 0,-0.56117 0.451768,-1.01294 1.012933,-1.01294 z m 7.9375,0 h 4.588706 c 0.561165,0 1.012933,0.45177 1.012933,1.01294 v 3.2658 c 0,0.56116 -0.451768,1.01293 -1.012933,1.01293 h -4.588706 c -0.561165,0 -1.012933,-0.45177 -1.012933,-1.01293 v -3.2658 c 0,-0.56117 0.451768,-1.01294 1.012933,-1.01294 z m 7.937503,0 h 4.588711 c 0.56117,0 1.01294,0.45177 1.01294,1.01294 v 3.2658 c 0,0.56116 -0.45177,1.01293 -1.01294,1.01293 h -4.588711 c -0.56116,0 -1.01293,-0.45177 -1.01293,-1.01293 v -3.2658 c 0,-0.56117 0.45177,-1.01294 1.01293,-1.01294 z m 15.914768,0 h 4.588708 c 0.56116,0 1.01293,0.45177 1.01293,1.01294 v 3.2658 c 0,0.56116 -0.45177,1.01293 -1.01293,1.01293 H 93.40652 c -0.56116,0 -1.01293,-0.45177 -1.01293,-1.01293 v -3.2658 c 0,-0.56117 0.45177,-1.01294 1.01293,-1.01294 z m 7.93748,0 h 4.58871 c 0.56116,0 1.01293,0.45177 1.01293,1.01294 v 3.2658 c 0,0.56116 -0.45177,1.01293 -1.01293,1.01293 H 101.344 c -0.56117,0 -1.01293,-0.45177 -1.01293,-1.01293 v -3.2658 c 0,-0.56117 0.45176,-1.01294 1.01293,-1.01294 z m 7.93751,0 h 4.58871 c 0.56117,0 1.01293,0.45177 1.01293,1.01294 v 3.2658 c 0,0.56116 -0.45176,1.01293 -1.01293,1.01293 h -4.58871 c -0.56116,0 -1.01293,-0.45177 -1.01293,-1.01293 v -3.2658 c 0,-0.56117 0.45177,-1.01294 1.01293,-1.01294 z m 7.9375,0 h 8.55746 c 0.56116,0 1.01293,0.45177 1.01293,1.01294 v 3.2658 c 0,0.56116 -0.45177,1.01293 -1.01293,1.01293 h -8.55746 c -0.56116,0 -1.01293,-0.45177 -1.01293,-1.01293 v -3.2658 c 0,-0.56117 0.45177,-1.01294 1.01293,-1.01294 z m -55.602261,6.61458 h 8.557466 c 0.561165,0 1.012933,0.45177 1.012933,1.01294 v 3.2658 c 0,0.56116 -0.451768,1.01293 -1.012933,1.01293 h -8.557466 c -0.561165,0 -1.012933,-0.45177 -1.012933,-1.01293 v -3.2658 c 0,-0.56117 0.451768,-1.01294 1.012933,-1.01294 z m 11.906258,0 h 4.588705 c 0.56117,0 1.01293,0.45177 1.01293,1.01294 v 3.2658 c 0,0.56116 -0.45176,1.01293 -1.01293,1.01293 h -4.588705 c -0.561165,0 -1.012933,-0.45177 -1.012933,-1.01293 v -3.2658 c 0,-0.56117 0.451768,-1.01294 1.012933,-1.01294 z m 15.914752,0 h 4.588721 c 0.56116,0 1.012928,0.45177 1.012928,1.01294 v 3.2658 c 0,0.56116 -0.451768,1.01293 -1.012928,1.01293 h -4.588721 c -0.56116,0 -1.01293,-0.45177 -1.01293,-1.01293 v -3.2658 c 0,-0.56117 0.45177,-1.01294 1.01293,-1.01294 z m 7.937489,0 h 4.588712 c 0.56116,0 1.01293,0.45177 1.01293,1.01294 v 3.2658 c 0,0.56116 -0.45177,1.01293 -1.01293,1.01293 h -4.588712 c -0.56117,0 -1.01293,-0.45177 -1.01293,-1.01293 v -3.2658 c 0,-0.56117 0.45176,-1.01294 1.01293,-1.01294 z m 7.937512,0 h 4.58871 c 0.56117,0 1.01293,0.45177 1.01293,1.01294 v 3.2658 c 0,0.56116 -0.45176,1.01293 -1.01293,1.01293 h -4.58871 c -0.56116,0 -1.01293,-0.45177 -1.01293,-1.01293 v -3.2658 c 0,-0.56117 0.45177,-1.01294 1.01293,-1.01294 z m 7.93752,0 h 4.58871 c 0.56116,0 1.01293,0.45177 1.01293,1.01294 v 3.2658 c 0,0.56116 -0.45177,1.01293 -1.01293,1.01293 h -4.58871 c -0.56116,0 -1.01293,-0.45177 -1.01293,-1.01293 v -3.2658 c 0,-0.56117 0.45177,-1.01294 1.01293,-1.01294 z m -43.696031,6.61458 h 4.588706 c 0.561165,0 1.012933,0.45177 1.012933,1.01293 v 3.2658 c 0,0.56117 -0.451768,1.01294 -1.012933,1.01294 h -4.588706 c -0.561165,0 -1.012933,-0.45177 -1.012933,-1.01294 v -3.2658 c 0,-0.56116 0.451768,-1.01293 1.012933,-1.01293 z m 7.937493,0 h 4.588711 c 0.56116,0 1.01294,0.45177 1.01294,1.01293 v 3.2658 c 0,0.56117 -0.45178,1.01294 -1.01294,1.01294 h -4.588711 c -0.56117,0 -1.01293,-0.45177 -1.01293,-1.01294 v -3.2658 c 0,-0.56116 0.45176,-1.01293 1.01293,-1.01293 z m 15.914768,0 h 4.588708 c 0.56117,0 1.01293,0.45177 1.01293,1.01293 v 3.2658 c 0,0.56117 -0.45176,1.01294 -1.01293,1.01294 H 93.40651 c -0.56116,0 -1.01293,-0.45177 -1.01293,-1.01294 v -3.2658 c 0,-0.56116 0.45177,-1.01293 1.01293,-1.01293 z m 7.93749,0 h 4.58871 c 0.56116,0 1.01293,0.45177 1.01293,1.01293 v 3.2658 c 0,0.56117 -0.45177,1.01294 -1.01293,1.01294 H 101.344 c -0.56117,0 -1.01293,-0.45177 -1.01293,-1.01294 v -3.2658 c 0,-0.56116 0.45176,-1.01293 1.01293,-1.01293 z m 7.9375,0 h 4.58871 c 0.56116,0 1.01293,0.45177 1.01293,1.01293 v 3.2658 c 0,0.56117 -0.45177,1.01294 -1.01293,1.01294 h -4.58871 c -0.56117,0 -1.01293,-0.45177 -1.01293,-1.01294 v -3.2658 c 0,-0.56116 0.45176,-1.01293 1.01293,-1.01293 z m 7.93751,0 h 3.2658 c 0.56117,0 1.01294,0.45177 1.01294,1.01293 v 3.2658 c 0,0.56117 -0.45177,1.01294 -1.01294,1.01294 h -3.2658 c -0.56116,0 -1.01293,-0.45177 -1.01293,-1.01294 v -3.2658 c 0,-0.56116 0.45177,-1.01293 1.01293,-1.01293 z m 3.96875,6.61459 h 4.58871 c 0.56117,0 1.01293,0.45177 1.01293,1.01294 v 3.2658 c 0,0.56116 -0.45176,1.01293 -1.01293,1.01293 h -4.58871 c -0.56116,0 -1.01293,-0.45177 -1.01293,-1.01293 v -3.2658 c 0,-0.56117 0.45177,-1.01294 1.01293,-1.01294 z m -7.9375,0 h 4.58871 c 0.56117,0 1.01293,0.45177 1.01293,1.01294 v 3.2658 c 0,0.56116 -0.45176,1.01293 -1.01293,1.01293 h -4.58871 c -0.56116,0 -1.01293,-0.45177 -1.01293,-1.01293 v -3.2658 c 0,-0.56117 0.45177,-1.01294 1.01293,-1.01294 z m -23.812521,0 h 20.463741 c 0.56117,0 1.01293,0.45177 1.01293,1.01294 v 3.2658 c 0,0.56117 -0.45176,1.01294 -1.01293,1.01294 H 89.437739 c -0.56117,0 -1.01293,-0.45177 -1.01293,-1.01294 v -3.2658 c 0,-0.56117 0.45176,-1.01294 1.01293,-1.01294 z" />
    </g>
    <g
       transform="matrix(4.2622318,0,0,4.2622318,347.76483,160.76776)"
       id="g11726-6"
       style="display:inline;stroke-width:1.50077">
      <rect
         ry="11.641666"
         rx="11.641666"
         y="157.69165"
         x="248.70833"
         height="35.454166"
         width="23.283333"
         id="rect11709-8"
         style="opacity:1;vector-effect:none;fill:#99c1f1;fill-opacity:1;stroke:none;stroke-width:2.38247;stroke-linecap:round;stroke-linejoin:miter;stroke-miterlimit:4;stroke-dasharray:none;stroke-dashoffset:0;stroke-opacity:1;marker:none;marker-start:none;marker-mid:none;marker-end:none;paint-order:normal" />
      <rect
         style="opacity:1;vector-effect:none;fill:#cee1f8;fill-opacity:1;stroke:none;stroke-width:6.35324;stroke-linecap:round;stroke-linejoin:miter;stroke-miterlimit:4;stroke-dasharray:none;stroke-dashoffset:0;stroke-opacity:1;marker:none;marker-start:none;marker-mid:none;marker-end:none;paint-order:normal"
         id="rect11701-7"
         width="23.283333"
         height="35.454166"
         x="248.70833"
         y="156.10417"
         rx="11.641666"
         ry="11.641666" />
      <path
         style="fill:#89b7ef;fill-opacity:1;stroke:#99c1f1;stroke-width:0.397077px;stroke-linecap:butt;stroke-linejoin:miter;stroke-opacity:1"
         d="M 260.61458,170.65625 V 156.10416"
         id="path11703-9"
         inkscape:connector-curvature="0" />
      <rect
         style="opacity:1;vector-effect:none;fill:#1a5fb4;fill-opacity:1;stroke:none;stroke-width:6.35324;stroke-linecap:round;stroke-linejoin:miter;stroke-miterlimit:4;stroke-dasharray:none;stroke-dashoffset:0;stroke-opacity:1;marker:none;marker-start:none;marker-mid:none;marker-end:none;paint-order:normal"
         id="rect11707-2"
         width="5.2916665"
         height="13.229166"
         x="257.96875"
         y="160.07292"
         rx="2.6458333"
         ry="2.6458333" />
      <circle
         r="1.4552083"
         cy="162.00343"
         cx="260.603"
         id="path15652-0"
         style="opacity:1;vector-effect:none;fill:#c0bfbc;fill-opacity:0.102362;stroke:none;stroke-width:2.90278;stroke-linecap:round;stroke-linejoin:miter;stroke-miterlimit:4;stroke-dasharray:none;stroke-dashoffset:0;stroke-opacity:1;marker:none;marker-start:none;marker-mid:none;marker-end:none;paint-order:normal" />
    </g>
  </g>
</svg>
