<?xml version="1.0" encoding="UTF-8" standalone="no"?>
<svg
   id="svg4749"
   version="1.1"
   viewBox="0 0 360 360.00002"
   height="360"
   width="360"
   xmlns:xlink="http://www.w3.org/1999/xlink"
   xmlns="http://www.w3.org/2000/svg"
   xmlns:svg="http://www.w3.org/2000/svg"
   xmlns:rdf="http://www.w3.org/1999/02/22-rdf-syntax-ns#"
   xmlns:cc="http://creativecommons.org/ns#"
   xmlns:dc="http://purl.org/dc/elements/1.1/">
  <defs
     id="defs4743" />
  <metadata
     id="metadata4746">
    <rdf:RDF>
      <cc:Work
         rdf:about="">
        <dc:format>image/svg+xml</dc:format>
        <dc:type
           rdf:resource="http://purl.org/dc/dcmitype/StillImage" />
      </cc:Work>
    </rdf:RDF>
  </metadata>
  <g
     style="display:inline;opacity:1"
     id="layer2"
     transform="translate(-8080,80.000003)">
    <rect
       style="opacity:1;vector-effect:none;fill:#f5c211;fill-opacity:1;stroke:none;stroke-width:2.31269;stroke-linecap:round;stroke-linejoin:miter;stroke-miterlimit:4;stroke-dasharray:none;stroke-dashoffset:0;stroke-opacity:1;marker:none;marker-start:none;marker-mid:none;marker-end:none;paint-order:normal"
       id="rect5320"
       width="360"
       height="360"
       x="8080"
       y="-80" />
  </g>
  <g
     style="opacity:1"
     transform="translate(-8080,6957.4803)"
     id="layer1">
    <g
       transform="matrix(1.6678944,1.6678944,-1.6678944,1.6678944,8560.2287,-7301.1117)"
       id="g1179"
       style="display:inline;enable-background:new">
      <path
         id="path15618"
         d="m 69.871508,198.76082 c -2.25097,2.1168 -4.369863,6.10177 -4.369831,13.60191 l -0.0149,34.49994 -10.178493,10.17849 c -0.400227,-0.0954 -0.858822,-0.0856 -1.343179,0.1576 l -12.124649,6.0886 c -4.633632,-2.88859 -10.848475,-2.32767 -14.864321,1.68818 -4.671489,4.67149 -4.672268,12.32091 -7.83e-4,16.99239 4.671483,4.67149 12.321684,4.67149 16.993171,0 0.01446,-0.0145 0.02797,-0.0294 0.04234,-0.0439 l 0.0055,0.0447 15.555904,-15.5559 0.01725,0.0173 5.891781,-5.89649 -0.0039,7.82931 0.02431,-7.8e-4 7.83e-4,21.9997 0.0345,-0.0282 c -1e-4,0.0205 -8.31e-4,0.0399 -7.83e-4,0.0604 0,6.60649 5.409965,12.01645 12.016442,12.01644 6.606478,1e-5 12.014086,-5.40917 12.01409,-12.01565 -4e-6,-5.67926 -3.997747,-10.47123 -9.316761,-11.70515 l -4.268686,-12.87818 c -0.170506,-0.51448 -0.487762,-0.84533 -0.838215,-1.0609 l 4e-6,-13.88811 24.027397,-24.04778 c 11.313711,-11.31372 4.496071,-18.13169 4.496071,-18.13169 l -28.523468,28.52346 7.83e-4,-40.84492 c 0,0 -2.72124,3.3e-4 -5.272336,2.39936 z m -39.359831,69.75026 c 2.760744,-2.76075 7.160569,-2.76152 9.921308,-7.8e-4 2.760744,2.76073 2.760744,7.16134 0,9.92209 -2.760739,2.76074 -7.161351,2.76074 -9.922091,0 -2.760743,-2.76074 -2.759957,-7.16057 7.83e-4,-9.92131 z m 42.068136,16.91084 c 1.265961,-1.26596 3.019884,-2.04417 4.972022,-2.04417 3.904278,1e-5 7.015419,3.1127 7.015411,7.01698 0,3.90426 -3.111125,7.01542 -7.015407,7.01541 -3.904279,10e-6 -7.016191,-3.11193 -7.016195,-7.0162 4e-6,-1.95214 0.778212,-3.70606 2.044169,-4.97202 z"
         style="opacity:1;vector-effect:none;fill:#000000;fill-opacity:0.102362;fill-rule:evenodd;stroke:none;stroke-width:4.15049;stroke-linecap:round;stroke-linejoin:miter;stroke-miterlimit:4;stroke-dasharray:none;stroke-dashoffset:0;stroke-opacity:1;marker:none;marker-start:none;marker-mid:none;marker-end:none;paint-order:normal" />
      <g
         style="display:inline;enable-background:new"
         transform="translate(7.9947119,-21.03751)"
         id="g1200">
        <path
           style="fill:#9a9996;fill-rule:evenodd;stroke:none;stroke-width:1px;stroke-linecap:butt;stroke-linejoin:miter;stroke-opacity:1"
           d="m 58,290 h 6 v -72 l -1.414214,-1.41421 C 62.585786,216.58579 56,221.64656 56,234 l 0.0053,27.18969 0.09677,2.72237 L 58,266 Z"
           id="path1186" />
        <g
           id="g1194"
           transform="translate(2)" />
      </g>
      <use
         style="display:inline;enable-background:new"
         x="0"
         y="0"
         xlink:href="#g1059"
         id="use1074"
         transform="matrix(-0.70710678,-0.70710678,-0.70710678,0.70710678,292.42443,120.74209)"
         width="100%"
         height="100%" />
      <g
         style="display:inline;enable-background:new"
         transform="matrix(-0.70710678,-0.70710678,-0.70710678,0.70710678,302.73447,101.58204)"
         id="g1180">
        <g
           id="g1174"
           transform="translate(2)" />
      </g>
      <g
         style="display:inline;enable-background:new"
         id="g1059"
         transform="matrix(-0.70710678,-0.70710678,-0.70710678,0.70710678,302.75946,99.477469)">
        <path
           id="path1039-3"
           d="m 55.975259,290 h 9.666423 v -72 c 0,0 -9.641682,-1e-5 -9.641682,16 z"
           style="fill:#ffffff;fill-rule:evenodd;stroke:none;stroke-width:1px;stroke-linecap:butt;stroke-linejoin:miter;stroke-opacity:1" />
        <g
           transform="translate(2)"
           id="g1052">
          <path
             style="fill:#ed333b;fill-opacity:1;fill-rule:evenodd;stroke:none;stroke-width:1px;stroke-linecap:butt;stroke-linejoin:miter;stroke-opacity:1"
             d="m 54,312 v -24 c 0,-2 2,-2 2,-2 h 6.037213 c 0,0 1.917797,-0.13576 2.443399,1.45023 l 4.397602,13.26955 z"
             id="path1047" />
          <circle
             r="9.515707"
             cy="312.03348"
             cx="-66.049789"
             id="circle1045"
             style="opacity:1;fill:none;fill-opacity:1;stroke:#ed333b;stroke-width:5;stroke-linecap:round;stroke-linejoin:round;stroke-miterlimit:4;stroke-dasharray:none;stroke-dashoffset:0;stroke-opacity:1"
             transform="scale(-1,1)" />
          <circle
             style="opacity:1;fill:none;fill-opacity:1;stroke:#e01b24;stroke-width:2;stroke-linecap:round;stroke-linejoin:round;stroke-miterlimit:4;stroke-dasharray:none;stroke-dashoffset:0;stroke-opacity:1"
             id="path1043-6"
             cx="-66"
             cy="312"
             r="7"
             transform="scale(-1,1)" />
        </g>
      </g>
      <circle
         transform="matrix(-0.70710678,-0.70710678,-0.70710678,0.70710678,0,0)"
         style="display:inline;opacity:1;fill:#3d3846;fill-opacity:1;stroke:none;stroke-width:2;stroke-linecap:round;stroke-linejoin:round;stroke-miterlimit:4;stroke-dasharray:none;stroke-dashoffset:0;stroke-opacity:1;enable-background:new"
         id="circle1204"
         cx="-223.44576"
         cy="125.86499"
         r="2" />
    </g>
  </g>
</svg>
