<?xml version="1.0" encoding="UTF-8" standalone="no"?>
<svg
   xmlns:dc="http://purl.org/dc/elements/1.1/"
   xmlns:cc="http://creativecommons.org/ns#"
   xmlns:rdf="http://www.w3.org/1999/02/22-rdf-syntax-ns#"
   xmlns:svg="http://www.w3.org/2000/svg"
   xmlns="http://www.w3.org/2000/svg"
   xmlns:xlink="http://www.w3.org/1999/xlink"
   xmlns:sodipodi="http://sodipodi.sourceforge.net/DTD/sodipodi-0.dtd"
   xmlns:inkscape="http://www.inkscape.org/namespaces/inkscape"
   inkscape:version="1.0.1 (3bc2e813f5, 2020-09-07)"
   id="svg8"
   version="1.1"
   viewBox="0 0 940 320"
   height="320"
   width="940"
   sodipodi:docname="22-app-drawer.svg"
   inkscape:export-filename="/var/home/jimmac/SparkleShare/gnome-web/blog.design/03-workspaces.png"
   inkscape:export-xdpi="96"
   inkscape:export-ydpi="96">
  <defs
     id="defs2">
    <inkscape:path-effect
       effect="spiro"
       id="path-effect18352"
       is_visible="true"
       lpeversion="1" />
    <linearGradient
       y2="236"
       x2="96"
       y1="236"
       x1="32"
       gradientTransform="translate(604.81684,170.58641)"
       gradientUnits="userSpaceOnUse"
       id="linearGradient1099"
       xlink:href="#linearGradient1036" />
    <linearGradient
       id="linearGradient1036">
      <stop
         id="stop1032"
         offset="0"
         style="stop-color:#d5d3cf;stop-opacity:1;" />
      <stop
         id="stop1034"
         offset="1"
         style="stop-color:#f6f5f4;stop-opacity:1" />
    </linearGradient>
    <radialGradient
       r="32"
       fy="-76"
       fx="-244"
       cy="-76"
       cx="-244"
       gradientTransform="matrix(0.88333331,0,0,0.88333331,-460.35018,463.11973)"
       gradientUnits="userSpaceOnUse"
       id="radialGradient1103"
       xlink:href="#linearGradient1069" />
    <linearGradient
       id="linearGradient1069">
      <stop
         id="stop1065"
         offset="0"
         style="stop-color:#d5d3cf;stop-opacity:1" />
      <stop
         id="stop1067-1"
         offset="1"
         style="stop-color:#949390;stop-opacity:1" />
    </linearGradient>
    <linearGradient
       gradientUnits="userSpaceOnUse"
       y2="232"
       x2="64"
       y1="262.5"
       x1="64"
       id="linearGradient1027"
       xlink:href="#linearGradient1025"
       gradientTransform="translate(-470.5864,432.81685)" />
    <linearGradient
       id="linearGradient1025">
      <stop
         id="stop1021"
         offset="0"
         style="stop-color:#9a9996;stop-opacity:1" />
      <stop
         id="stop1023"
         offset="1"
         style="stop-color:#77767b;stop-opacity:1" />
    </linearGradient>
    <inkscape:path-effect
       effect="spiro"
       id="path-effect35304-9"
       is_visible="true"
       lpeversion="0" />
    <clipPath
       clipPathUnits="userSpaceOnUse"
       id="clipPath1609-7">
      <path
         sodipodi:nodetypes="cccccc"
         inkscape:connector-curvature="0"
         id="path1611-5"
         d="m 252,116 28,-28 v -8 h -36 v 36 z"
         style="fill:#e74747;stroke:none;stroke-width:0.25px;stroke-linecap:butt;stroke-linejoin:miter;stroke-opacity:1" />
    </clipPath>
    <radialGradient
       r="32"
       fy="-76"
       fx="-244"
       cy="-76"
       cx="-244"
       gradientTransform="matrix(0.88333331,0,0,0.88333331,-460.35018,463.11973)"
       gradientUnits="userSpaceOnUse"
       id="radialGradient1103-3"
       xlink:href="#linearGradient1069" />
    <clipPath
       clipPathUnits="userSpaceOnUse"
       id="clipPath1609-7-1">
      <path
         sodipodi:nodetypes="cccccc"
         inkscape:connector-curvature="0"
         id="path1611-5-2"
         d="m 252,116 28,-28 v -8 h -36 v 36 z"
         style="fill:#e74747;stroke:none;stroke-width:0.25px;stroke-linecap:butt;stroke-linejoin:miter;stroke-opacity:1" />
    </clipPath>
  </defs>
  <sodipodi:namedview
     units="px"
     borderlayer="true"
     inkscape:showpageshadow="false"
     showgrid="false"
     inkscape:document-rotation="0"
     inkscape:current-layer="g14552"
     inkscape:document-units="px"
     inkscape:cy="180.87459"
     inkscape:cx="598.69042"
     inkscape:zoom="1"
     inkscape:pageshadow="2"
     inkscape:pageopacity="1"
     borderopacity="1"
     bordercolor="#383838"
     pagecolor="#ffffff"
     id="base"
     inkscape:snap-nodes="false"
     inkscape:snap-others="false"
     inkscape:snap-bbox="true"
     inkscape:bbox-nodes="true"
     inkscape:bbox-paths="true"
     inkscape:window-width="2560"
     inkscape:window-height="1376"
     inkscape:window-x="26"
     inkscape:window-y="23"
     inkscape:window-maximized="0">
    <inkscape:grid
       type="xygrid"
       id="grid949" />
  </sodipodi:namedview>
  <metadata
     id="metadata5">
    <rdf:RDF>
      <cc:Work
         rdf:about="">
        <dc:format>image/svg+xml</dc:format>
        <dc:type
           rdf:resource="http://purl.org/dc/dcmitype/StillImage" />
        <dc:title></dc:title>
        <cc:license
           rdf:resource="http://creativecommons.org/licenses/by-sa/4.0/" />
      </cc:Work>
      <cc:License
         rdf:about="http://creativecommons.org/licenses/by-sa/4.0/">
        <cc:permits
           rdf:resource="http://creativecommons.org/ns#Reproduction" />
        <cc:permits
           rdf:resource="http://creativecommons.org/ns#Distribution" />
        <cc:requires
           rdf:resource="http://creativecommons.org/ns#Notice" />
        <cc:requires
           rdf:resource="http://creativecommons.org/ns#Attribution" />
        <cc:permits
           rdf:resource="http://creativecommons.org/ns#DerivativeWorks" />
        <cc:requires
           rdf:resource="http://creativecommons.org/ns#ShareAlike" />
      </cc:License>
    </rdf:RDF>
  </metadata>
  <g
     id="layer1"
     inkscape:groupmode="layer"
     inkscape:label="Layer 1">
    <rect
       ry="1.2678875"
       rx="1.2678875"
       y="-322.09512"
       x="57.97707"
       height="105.75732"
       width="178.33087"
       id="rect18340"
       style="color:#000000;clip-rule:nonzero;display:inline;overflow:visible;visibility:visible;isolation:auto;mix-blend-mode:normal;color-interpolation:sRGB;color-interpolation-filters:linearRGB;solid-color:#000000;solid-opacity:1;fill:#98c1f1;fill-opacity:1;fill-rule:nonzero;stroke:none;stroke-width:5.10969;stroke-linecap:butt;stroke-linejoin:miter;stroke-miterlimit:4;stroke-dasharray:none;stroke-dashoffset:0;stroke-opacity:1;marker:none;marker-start:none;marker-mid:none;marker-end:none;paint-order:normal;color-rendering:auto;image-rendering:auto;shape-rendering:auto;text-rendering:auto;enable-background:new" />
    <rect
       ry="1.2678875"
       rx="1.2678875"
       y="-322.09512"
       x="275.79797"
       height="105.75732"
       width="178.33087"
       id="rect18342"
       style="color:#000000;clip-rule:nonzero;display:inline;overflow:visible;visibility:visible;isolation:auto;mix-blend-mode:normal;color-interpolation:sRGB;color-interpolation-filters:linearRGB;solid-color:#000000;solid-opacity:1;fill:#98c1f1;fill-opacity:1;fill-rule:nonzero;stroke:none;stroke-width:5.10969;stroke-linecap:butt;stroke-linejoin:miter;stroke-miterlimit:4;stroke-dasharray:none;stroke-dashoffset:0;stroke-opacity:1;marker:none;marker-start:none;marker-mid:none;marker-end:none;paint-order:normal;color-rendering:auto;image-rendering:auto;shape-rendering:auto;text-rendering:auto;enable-background:new" />
    <rect
       ry="1.2678875"
       rx="1.2678875"
       y="-322.09512"
       x="493.61893"
       height="105.75732"
       width="178.33087"
       id="rect18344"
       style="color:#000000;clip-rule:nonzero;display:inline;overflow:visible;visibility:visible;isolation:auto;mix-blend-mode:normal;color-interpolation:sRGB;color-interpolation-filters:linearRGB;solid-color:#000000;solid-opacity:1;fill:#98c1f1;fill-opacity:1;fill-rule:nonzero;stroke:none;stroke-width:5.10969;stroke-linecap:butt;stroke-linejoin:miter;stroke-miterlimit:4;stroke-dasharray:none;stroke-dashoffset:0;stroke-opacity:1;marker:none;marker-start:none;marker-mid:none;marker-end:none;paint-order:normal;color-rendering:auto;image-rendering:auto;shape-rendering:auto;text-rendering:auto;enable-background:new" />
    <rect
       ry="1.2678875"
       rx="1.2678875"
       y="-322.09512"
       x="711.43988"
       height="105.75732"
       width="178.33087"
       id="rect18348"
       style="color:#000000;clip-rule:nonzero;display:inline;overflow:visible;visibility:visible;isolation:auto;mix-blend-mode:normal;color-interpolation:sRGB;color-interpolation-filters:linearRGB;solid-color:#000000;solid-opacity:1;fill:#98c1f1;fill-opacity:1;fill-rule:nonzero;stroke:none;stroke-width:5.10969;stroke-linecap:butt;stroke-linejoin:miter;stroke-miterlimit:4;stroke-dasharray:none;stroke-dashoffset:0;stroke-opacity:1;marker:none;marker-start:none;marker-mid:none;marker-end:none;paint-order:normal;color-rendering:auto;image-rendering:auto;shape-rendering:auto;text-rendering:auto;enable-background:new" />
    <g
       style="display:inline;enable-background:new"
       id="g18457"
       transform="translate(127.87868,-344.56947)">
      <g
         id="layer1-0"
         inkscape:label="App Icon"
         style="display:inline"
         transform="translate(0,-172)">
        <g
           inkscape:groupmode="layer"
           id="layer2"
           inkscape:label="baseplate"
           style="display:none"
           sodipodi:insensitive="true">
          <g
             style="display:inline;fill:#000000;enable-background:new"
             transform="matrix(7.9911709,0,0,8.0036407,-167.7909,-4846.0776)"
             id="g12027"
             inkscape:export-xdpi="12"
             inkscape:export-ydpi="12" />
          <rect
             style="display:inline;overflow:visible;visibility:visible;fill:#1c71d8;fill-opacity:1;fill-rule:nonzero;stroke:none;stroke-width:0.5;marker:none;enable-background:accumulate"
             id="rect13805"
             width="128"
             height="128"
             x="9.2651362e-08"
             y="172"
             inkscape:label="512x512" />
          <g
             id="g883"
             style="fill:none;fill-opacity:0.25098;stroke:#a579b3;stroke-opacity:1"
             transform="translate(-24,24)" />
          <g
             id="g900"
             style="fill:none;fill-opacity:0.25098;stroke:#a579b3;stroke-opacity:1"
             transform="translate(-24,24)" />
          <text
             xml:space="preserve"
             style="font-style:normal;font-variant:normal;font-weight:bold;font-stretch:normal;font-size:15.6101px;line-height:125%;font-family:Cantarell;-inkscape-font-specification:'Cantarell, Bold';text-align:start;writing-mode:lr-tb;text-anchor:start;display:inline;fill:#98c1f1;fill-opacity:1;stroke:none;stroke-width:1.29817;enable-background:new"
             x="-0.98685926"
             y="161.48061"
             id="text863"
             inkscape:label="icon-name"><tspan
               style="font-size:15.6101px;fill:#98c1f1;stroke-width:1.29817"
               sodipodi:role="line"
               id="tspan861"
               x="-0.98685926"
               y="161.48061">Blueprint</tspan></text>
        </g>
        <g
           inkscape:groupmode="layer"
           id="layer3"
           inkscape:label="hairlines"
           style="display:none"
           sodipodi:insensitive="true">
          <circle
             cx="64.000031"
             cy="236"
             r="59.504131"
             id="circle2892"
             style="display:inline;opacity:0.1;vector-effect:none;fill:none;fill-opacity:1;stroke:#ffffff;stroke-width:0.99;stroke-linecap:butt;stroke-linejoin:miter;stroke-miterlimit:4;stroke-dasharray:0.99, 0.99;stroke-dashoffset:0;stroke-opacity:1;marker:none;marker-start:none;marker-mid:none;marker-end:none;paint-order:normal;enable-background:new" />
          <rect
             ry="7.9292889"
             rx="8.701004"
             y="180.49496"
             x="20.495007"
             height="111.01005"
             width="87.009987"
             id="rect2894"
             style="display:inline;opacity:0.1;vector-effect:none;fill:none;fill-opacity:1;stroke:#ffffff;stroke-width:0.99;stroke-linecap:butt;stroke-linejoin:miter;stroke-miterlimit:4;stroke-dasharray:0.99, 0.99;stroke-dashoffset:0;stroke-opacity:1;marker:none;marker-start:none;marker-mid:none;marker-end:none;paint-order:normal;enable-background:new" />
          <rect
             ry="7.9238095"
             rx="7.9238095"
             y="184.49524"
             x="12.495266"
             height="103.00952"
             width="103.00952"
             id="rect2896"
             style="display:inline;opacity:0.1;vector-effect:none;fill:none;fill-opacity:1;stroke:#ffffff;stroke-width:0.99;stroke-linecap:butt;stroke-linejoin:miter;stroke-miterlimit:4;stroke-dasharray:0.99, 0.99;stroke-dashoffset:0;stroke-opacity:1;marker:none;marker-start:none;marker-mid:none;marker-end:none;paint-order:normal;enable-background:new" />
          <rect
             ry="8.701005"
             rx="7.9292889"
             y="200.49496"
             x="8.4950066"
             height="87.010048"
             width="111.01004"
             id="rect2898"
             style="display:inline;opacity:0.1;vector-effect:none;fill:none;fill-opacity:1;stroke:#ffffff;stroke-width:0.99;stroke-linecap:butt;stroke-linejoin:miter;stroke-miterlimit:4;stroke-dasharray:0.99, 0.99;stroke-dashoffset:0;stroke-opacity:1;marker:none;marker-start:none;marker-mid:none;marker-end:none;paint-order:normal;enable-background:new" />
          <path
             inkscape:connector-curvature="0"
             id="path2900"
             d="M 2.6203015e-5,288.99999 H 128.00003"
             style="display:inline;fill:none;stroke:#98c1f1;stroke-width:2;stroke-linecap:butt;stroke-linejoin:miter;stroke-miterlimit:4;stroke-dasharray:none;stroke-opacity:1;enable-background:new" />
        </g>
        <g
           inkscape:groupmode="layer"
           id="layer9"
           inkscape:label="icons"
           style="display:inline">
          <rect
             ry="3.8039243"
             rx="3.8039246"
             y="186.02901"
             x="14.129242"
             height="99.973259"
             width="99.87075"
             id="rect23109"
             style="color:#000000;display:inline;overflow:visible;visibility:visible;fill:#ffffff;fill-opacity:1;fill-rule:nonzero;stroke:#98c1f1;stroke-width:4;stroke-miterlimit:4;stroke-dasharray:none;stroke-opacity:1;marker:none;enable-background:new" />
          <rect
             y="183.98929"
             x="12.407834"
             height="104.02142"
             width="104.02142"
             id="rect7477"
             style="color:#000000;clip-rule:nonzero;display:inline;overflow:visible;visibility:visible;opacity:1;isolation:auto;mix-blend-mode:normal;color-interpolation:sRGB;color-interpolation-filters:linearRGB;solid-color:#000000;solid-opacity:1;fill:none;fill-opacity:1;fill-rule:nonzero;stroke:none;stroke-width:1;stroke-linecap:butt;stroke-linejoin:miter;stroke-miterlimit:4;stroke-dasharray:none;stroke-dashoffset:0;stroke-opacity:1;marker:none;marker-start:none;marker-mid:none;marker-end:none;paint-order:normal;color-rendering:auto;image-rendering:auto;shape-rendering:auto;text-rendering:auto;enable-background:accumulate" />
          <rect
             style="color:#000000;clip-rule:nonzero;display:inline;overflow:visible;visibility:visible;opacity:1;isolation:auto;mix-blend-mode:normal;color-interpolation:sRGB;color-interpolation-filters:linearRGB;solid-color:#000000;solid-opacity:1;fill:#98c1f1;fill-opacity:1;fill-rule:nonzero;stroke:none;stroke-width:1.4;stroke-linecap:butt;stroke-linejoin:miter;stroke-miterlimit:4;stroke-dasharray:none;stroke-dashoffset:0;stroke-opacity:1;marker:none;marker-start:none;marker-mid:none;marker-end:none;paint-order:normal;color-rendering:auto;image-rendering:auto;shape-rendering:auto;text-rendering:auto;enable-background:new"
             id="rect23252"
             width="29.168156"
             height="10.960155"
             x="20"
             y="203"
             rx="0"
             ry="0" />
          <rect
             ry="0"
             rx="0"
             y="206.00525"
             x="52.084957"
             height="5.038136"
             width="22.98097"
             id="rect23254"
             style="color:#000000;clip-rule:nonzero;display:inline;overflow:visible;visibility:visible;opacity:1;isolation:auto;mix-blend-mode:normal;color-interpolation:sRGB;color-interpolation-filters:linearRGB;solid-color:#000000;solid-opacity:1;fill:#98c1f1;fill-opacity:1;fill-rule:nonzero;stroke:none;stroke-width:1.4;stroke-linecap:butt;stroke-linejoin:miter;stroke-miterlimit:4;stroke-dasharray:none;stroke-dashoffset:0;stroke-opacity:1;marker:none;marker-start:none;marker-mid:none;marker-end:none;paint-order:normal;color-rendering:auto;image-rendering:auto;shape-rendering:auto;text-rendering:auto;enable-background:new" />
          <rect
             style="color:#000000;clip-rule:nonzero;display:inline;overflow:visible;visibility:visible;opacity:1;isolation:auto;mix-blend-mode:normal;color-interpolation:sRGB;color-interpolation-filters:linearRGB;solid-color:#000000;solid-opacity:1;fill:#98c1f1;fill-opacity:1;fill-rule:nonzero;stroke:none;stroke-width:1.4;stroke-linecap:butt;stroke-linejoin:miter;stroke-miterlimit:4;stroke-dasharray:none;stroke-dashoffset:0;stroke-opacity:1;marker:none;marker-start:none;marker-mid:none;marker-end:none;paint-order:normal;color-rendering:auto;image-rendering:auto;shape-rendering:auto;text-rendering:auto;enable-background:new"
             id="rect23256"
             width="22.98097"
             height="5.038136"
             x="82.048645"
             y="206.00525"
             rx="0"
             ry="0" />
          <rect
             ry="0"
             rx="0"
             y="206.00525"
             x="23.181944"
             height="5.038136"
             width="22.98097"
             id="rect23258"
             style="color:#000000;clip-rule:nonzero;display:inline;overflow:visible;visibility:visible;opacity:1;isolation:auto;mix-blend-mode:normal;color-interpolation:sRGB;color-interpolation-filters:linearRGB;solid-color:#000000;solid-opacity:1;fill:#ffffff;fill-opacity:1;fill-rule:nonzero;stroke:none;stroke-width:1.4;stroke-linecap:butt;stroke-linejoin:miter;stroke-miterlimit:4;stroke-dasharray:none;stroke-dashoffset:0;stroke-opacity:1;marker:none;marker-start:none;marker-mid:none;marker-end:none;paint-order:normal;color-rendering:auto;image-rendering:auto;shape-rendering:auto;text-rendering:auto;enable-background:new" />
          <rect
             ry="0"
             rx="0"
             y="-259.55804"
             x="19.513855"
             height="46.039845"
             width="41.043156"
             id="rect23260"
             style="color:#000000;clip-rule:nonzero;display:inline;overflow:visible;visibility:visible;opacity:1;isolation:auto;mix-blend-mode:normal;color-interpolation:sRGB;color-interpolation-filters:linearRGB;solid-color:#000000;solid-opacity:1;fill:none;fill-opacity:1;fill-rule:nonzero;stroke:#98c1f1;stroke-width:1;stroke-linecap:butt;stroke-linejoin:miter;stroke-miterlimit:4;stroke-dasharray:none;stroke-dashoffset:0;stroke-opacity:1;marker:none;marker-start:none;marker-mid:none;marker-end:none;paint-order:normal;color-rendering:auto;image-rendering:auto;shape-rendering:auto;text-rendering:auto;enable-background:new"
             transform="scale(1,-1)" />
          <rect
             style="color:#000000;clip-rule:nonzero;display:inline;overflow:visible;visibility:visible;opacity:1;isolation:auto;mix-blend-mode:normal;color-interpolation:sRGB;color-interpolation-filters:linearRGB;solid-color:#000000;solid-opacity:1;fill:#98c1f1;fill-opacity:1;fill-rule:nonzero;stroke:none;stroke-width:1;stroke-linecap:butt;stroke-linejoin:miter;stroke-miterlimit:4;stroke-dasharray:none;stroke-dashoffset:0;stroke-opacity:1;marker:none;marker-start:none;marker-mid:none;marker-end:none;paint-order:normal;color-rendering:auto;image-rendering:auto;shape-rendering:auto;text-rendering:auto;enable-background:new"
             id="rect23262"
             width="33.896931"
             height="4.9939413"
             x="23.093626"
             y="217.00958" />
          <rect
             y="225.00873"
             x="23.093626"
             height="4.9939413"
             width="24.969707"
             id="rect23264"
             style="color:#000000;clip-rule:nonzero;display:inline;overflow:visible;visibility:visible;opacity:1;isolation:auto;mix-blend-mode:normal;color-interpolation:sRGB;color-interpolation-filters:linearRGB;solid-color:#000000;solid-opacity:1;fill:#98c1f1;fill-opacity:1;fill-rule:nonzero;stroke:none;stroke-width:1;stroke-linecap:butt;stroke-linejoin:miter;stroke-miterlimit:4;stroke-dasharray:none;stroke-dashoffset:0;stroke-opacity:1;marker:none;marker-start:none;marker-mid:none;marker-end:none;paint-order:normal;color-rendering:auto;image-rendering:auto;shape-rendering:auto;text-rendering:auto;enable-background:new" />
          <rect
             style="color:#000000;clip-rule:nonzero;display:inline;overflow:visible;visibility:visible;opacity:1;isolation:auto;mix-blend-mode:normal;color-interpolation:sRGB;color-interpolation-filters:linearRGB;solid-color:#000000;solid-opacity:1;fill:#98c1f1;fill-opacity:1;fill-rule:nonzero;stroke:none;stroke-width:1;stroke-linecap:butt;stroke-linejoin:miter;stroke-miterlimit:4;stroke-dasharray:none;stroke-dashoffset:0;stroke-opacity:1;marker:none;marker-start:none;marker-mid:none;marker-end:none;paint-order:normal;color-rendering:auto;image-rendering:auto;shape-rendering:auto;text-rendering:auto;enable-background:new"
             id="rect23266"
             width="28.019106"
             height="4.9939413"
             x="23.093626"
             y="233.00873" />
          <rect
             y="241.00873"
             x="23.093626"
             height="4.9939413"
             width="15.998291"
             id="rect23268"
             style="color:#000000;clip-rule:nonzero;display:inline;overflow:visible;visibility:visible;opacity:1;isolation:auto;mix-blend-mode:normal;color-interpolation:sRGB;color-interpolation-filters:linearRGB;solid-color:#000000;solid-opacity:1;fill:#98c1f1;fill-opacity:1;fill-rule:nonzero;stroke:none;stroke-width:1;stroke-linecap:butt;stroke-linejoin:miter;stroke-miterlimit:4;stroke-dasharray:none;stroke-dashoffset:0;stroke-opacity:1;marker:none;marker-start:none;marker-mid:none;marker-end:none;paint-order:normal;color-rendering:auto;image-rendering:auto;shape-rendering:auto;text-rendering:auto;enable-background:new" />
          <rect
             style="color:#000000;clip-rule:nonzero;display:inline;overflow:visible;visibility:visible;opacity:1;isolation:auto;mix-blend-mode:normal;color-interpolation:sRGB;color-interpolation-filters:linearRGB;solid-color:#000000;solid-opacity:1;fill:#98c1f1;fill-opacity:1;fill-rule:nonzero;stroke:none;stroke-width:1;stroke-linecap:butt;stroke-linejoin:miter;stroke-miterlimit:4;stroke-dasharray:none;stroke-dashoffset:0;stroke-opacity:1;marker:none;marker-start:none;marker-mid:none;marker-end:none;paint-order:normal;color-rendering:auto;image-rendering:auto;shape-rendering:auto;text-rendering:auto;enable-background:new"
             id="rect23270"
             width="33.013046"
             height="4.9939413"
             x="23.093626"
             y="249.00873" />
          <path
             inkscape:connector-curvature="0"
             id="path23541"
             d="M 14.98775,202.55805 H 114"
             style="color:#000000;clip-rule:nonzero;display:inline;overflow:visible;visibility:visible;opacity:1;isolation:auto;mix-blend-mode:normal;color-interpolation:sRGB;color-interpolation-filters:linearRGB;solid-color:#000000;solid-opacity:1;fill:#eeeeec;fill-opacity:1;fill-rule:nonzero;stroke:#98c1f1;stroke-width:1;stroke-linecap:butt;stroke-linejoin:miter;stroke-miterlimit:4;stroke-dasharray:none;stroke-dashoffset:0;stroke-opacity:1;marker:none;marker-start:none;marker-mid:none;marker-end:none;paint-order:normal;color-rendering:auto;image-rendering:auto;shape-rendering:auto;text-rendering:auto;enable-background:new" />
          <path
             style="color:#000000;font-style:normal;font-variant:normal;font-weight:normal;font-stretch:normal;font-size:medium;line-height:normal;font-family:sans-serif;font-variant-ligatures:normal;font-variant-position:normal;font-variant-caps:normal;font-variant-numeric:normal;font-variant-alternates:normal;font-feature-settings:normal;text-indent:0;text-align:start;text-decoration:none;text-decoration-line:none;text-decoration-style:solid;text-decoration-color:#000000;letter-spacing:normal;word-spacing:normal;text-transform:none;writing-mode:lr-tb;direction:ltr;text-orientation:mixed;dominant-baseline:auto;baseline-shift:baseline;text-anchor:start;white-space:normal;shape-padding:0;clip-rule:nonzero;display:inline;overflow:visible;visibility:visible;opacity:1;isolation:auto;mix-blend-mode:normal;color-interpolation:sRGB;color-interpolation-filters:linearRGB;solid-color:#000000;solid-opacity:1;vector-effect:none;fill:#98c1f1;fill-opacity:1;fill-rule:nonzero;stroke:none;stroke-width:1.7;stroke-linecap:butt;stroke-linejoin:miter;stroke-miterlimit:4;stroke-dasharray:none;stroke-dashoffset:0;stroke-opacity:1;marker:none;paint-order:normal;color-rendering:auto;image-rendering:auto;shape-rendering:auto;text-rendering:auto;enable-background:new"
             d="m 103.30224,192.02681 -0.0254,0.0254 h -1.15234 v 1.16602 l -0.0176,0.0176 1.80469,1.78515 -1.80469,1.78321 0.0254,0.0254 h -0.008 v 1.17383 h 1.16797 l 0.01,0.01 0.01,-0.01 h 0.0137 v -0.0137 l 1.79297,-1.77343 1.81836,1.79687 0.01,-0.01 h 1.18164 v -1.17383 h -0.0215 l 0.0254,-0.0254 -1.80468,-1.78321 1.80468,-1.78515 -0.01,-0.01 h 0.006 v -1.17383 h -1.16602 l -0.0254,-0.0254 -1.81858,1.79688 z"
             id="path23545"
             inkscape:connector-curvature="0" />
        </g>
      </g>
    </g>
    <g
       id="g1502"
       transform="translate(248.1659,-390.94141)">
      <path
         id="path18459"
         style="fill:none;fill-opacity:1;stroke:#98c1f1;stroke-width:0.999995;stroke-miterlimit:4;stroke-dasharray:none;stroke-opacity:1;stop-color:#000000"
         d="M 293.93751,236.38928 H 149.73068"
         sodipodi:nodetypes="cc" />
      <path
         id="path18461"
         style="fill:#98c1f1;fill-opacity:1;stroke:none;stroke-width:0.999996;stroke-miterlimit:4;stroke-dasharray:none;stroke-opacity:1;stop-color:#000000"
         d="m 284.4572,226.86386 9.48031,9.48031 -9.4803,9.48031 z"
         sodipodi:nodetypes="cccc" />
      <path
         id="path18463"
         style="fill:#98c1f1;fill-opacity:1;stroke:none;stroke-width:0.999996;stroke-miterlimit:4;stroke-dasharray:none;stroke-opacity:1;stop-color:#000000"
         d="m 158.38241,226.86386 -9.48031,9.48031 9.4803,9.48031 z"
         sodipodi:nodetypes="cccc" />
    </g>
    <g
       style="display:inline;enable-background:new"
       id="g1562"
       transform="translate(325.48183,-319.02909)">
      <g
         id="g1560"
         inkscape:label="App Icon"
         style="display:inline"
         transform="translate(0,-172)">
        <g
           inkscape:groupmode="layer"
           id="g1516"
           inkscape:label="baseplate"
           style="display:none"
           sodipodi:insensitive="true">
          <g
             style="display:inline;fill:#000000;enable-background:new"
             transform="matrix(7.9911709,0,0,8.0036407,-167.7909,-4846.0776)"
             id="g1504"
             inkscape:export-xdpi="12"
             inkscape:export-ydpi="12" />
          <rect
             style="display:inline;overflow:visible;visibility:visible;fill:#1c71d8;fill-opacity:1;fill-rule:nonzero;stroke:none;stroke-width:0.5;marker:none;enable-background:accumulate"
             id="rect1506"
             width="128"
             height="128"
             x="9.2651362e-08"
             y="172"
             inkscape:label="512x512" />
          <g
             id="g1508"
             style="fill:none;fill-opacity:0.25098;stroke:#a579b3;stroke-opacity:1"
             transform="translate(-24,24)" />
          <g
             id="g1510"
             style="fill:none;fill-opacity:0.25098;stroke:#a579b3;stroke-opacity:1"
             transform="translate(-24,24)" />
          <text
             xml:space="preserve"
             style="font-style:normal;font-variant:normal;font-weight:bold;font-stretch:normal;font-size:15.6101px;line-height:125%;font-family:Cantarell;-inkscape-font-specification:'Cantarell, Bold';text-align:start;writing-mode:lr-tb;text-anchor:start;display:inline;fill:#98c1f1;fill-opacity:1;stroke:none;stroke-width:1.29817;enable-background:new"
             x="-0.98685926"
             y="161.48061"
             id="text1514"
             inkscape:label="icon-name"><tspan
               style="font-size:15.6101px;fill:#98c1f1;stroke-width:1.29817"
               sodipodi:role="line"
               id="tspan1512"
               x="-0.98685926"
               y="161.48061">Blueprint</tspan></text>
        </g>
        <g
           inkscape:groupmode="layer"
           id="g1528"
           inkscape:label="hairlines"
           style="display:none"
           sodipodi:insensitive="true">
          <circle
             cx="64.000031"
             cy="236"
             r="59.504131"
             id="circle1518"
             style="display:inline;opacity:0.1;vector-effect:none;fill:none;fill-opacity:1;stroke:#ffffff;stroke-width:0.99;stroke-linecap:butt;stroke-linejoin:miter;stroke-miterlimit:4;stroke-dasharray:0.99, 0.99;stroke-dashoffset:0;stroke-opacity:1;marker:none;marker-start:none;marker-mid:none;marker-end:none;paint-order:normal;enable-background:new" />
          <rect
             ry="7.9292889"
             rx="8.701004"
             y="180.49496"
             x="20.495007"
             height="111.01005"
             width="87.009987"
             id="rect1520"
             style="display:inline;opacity:0.1;vector-effect:none;fill:none;fill-opacity:1;stroke:#ffffff;stroke-width:0.99;stroke-linecap:butt;stroke-linejoin:miter;stroke-miterlimit:4;stroke-dasharray:0.99, 0.99;stroke-dashoffset:0;stroke-opacity:1;marker:none;marker-start:none;marker-mid:none;marker-end:none;paint-order:normal;enable-background:new" />
          <rect
             ry="7.9238095"
             rx="7.9238095"
             y="184.49524"
             x="12.495266"
             height="103.00952"
             width="103.00952"
             id="rect1522"
             style="display:inline;opacity:0.1;vector-effect:none;fill:none;fill-opacity:1;stroke:#ffffff;stroke-width:0.99;stroke-linecap:butt;stroke-linejoin:miter;stroke-miterlimit:4;stroke-dasharray:0.99, 0.99;stroke-dashoffset:0;stroke-opacity:1;marker:none;marker-start:none;marker-mid:none;marker-end:none;paint-order:normal;enable-background:new" />
          <rect
             ry="8.701005"
             rx="7.9292889"
             y="200.49496"
             x="8.4950066"
             height="87.010048"
             width="111.01004"
             id="rect1524"
             style="display:inline;opacity:0.1;vector-effect:none;fill:none;fill-opacity:1;stroke:#ffffff;stroke-width:0.99;stroke-linecap:butt;stroke-linejoin:miter;stroke-miterlimit:4;stroke-dasharray:0.99, 0.99;stroke-dashoffset:0;stroke-opacity:1;marker:none;marker-start:none;marker-mid:none;marker-end:none;paint-order:normal;enable-background:new" />
          <path
             inkscape:connector-curvature="0"
             id="path1526"
             d="M 2.6203015e-5,288.99999 H 128.00003"
             style="display:inline;fill:none;stroke:#98c1f1;stroke-width:2;stroke-linecap:butt;stroke-linejoin:miter;stroke-miterlimit:4;stroke-dasharray:none;stroke-opacity:1;enable-background:new" />
        </g>
        <g
           inkscape:groupmode="layer"
           id="g1558"
           inkscape:label="icons"
           style="display:inline">
          <rect
             ry="3.8039243"
             rx="3.8039246"
             y="186.03746"
             x="44.814938"
             height="99.973251"
             width="69.614319"
             id="rect1530"
             style="color:#000000;display:inline;overflow:visible;visibility:visible;fill:#ffffff;fill-opacity:1;fill-rule:nonzero;stroke:#98c1f1;stroke-width:4;stroke-miterlimit:4;stroke-dasharray:none;stroke-opacity:1;marker:none;enable-background:new" />
          <path
             inkscape:connector-curvature="0"
             id="path1554"
             d="M 45.051796,202.55805 H 114"
             style="color:#000000;clip-rule:nonzero;display:inline;overflow:visible;visibility:visible;opacity:1;isolation:auto;mix-blend-mode:normal;color-interpolation:sRGB;color-interpolation-filters:linearRGB;solid-color:#000000;solid-opacity:1;fill:#eeeeec;fill-opacity:1;fill-rule:nonzero;stroke:#98c1f1;stroke-width:1;stroke-linecap:butt;stroke-linejoin:miter;stroke-miterlimit:4;stroke-dasharray:none;stroke-dashoffset:0;stroke-opacity:1;marker:none;marker-start:none;marker-mid:none;marker-end:none;paint-order:normal;color-rendering:auto;image-rendering:auto;shape-rendering:auto;text-rendering:auto;enable-background:new"
             sodipodi:nodetypes="cc" />
          <path
             style="color:#000000;font-style:normal;font-variant:normal;font-weight:normal;font-stretch:normal;font-size:medium;line-height:normal;font-family:sans-serif;font-variant-ligatures:normal;font-variant-position:normal;font-variant-caps:normal;font-variant-numeric:normal;font-variant-alternates:normal;font-feature-settings:normal;text-indent:0;text-align:start;text-decoration:none;text-decoration-line:none;text-decoration-style:solid;text-decoration-color:#000000;letter-spacing:normal;word-spacing:normal;text-transform:none;writing-mode:lr-tb;direction:ltr;text-orientation:mixed;dominant-baseline:auto;baseline-shift:baseline;text-anchor:start;white-space:normal;shape-padding:0;clip-rule:nonzero;display:inline;overflow:visible;visibility:visible;opacity:1;isolation:auto;mix-blend-mode:normal;color-interpolation:sRGB;color-interpolation-filters:linearRGB;solid-color:#000000;solid-opacity:1;vector-effect:none;fill:#98c1f1;fill-opacity:1;fill-rule:nonzero;stroke:none;stroke-width:1.7;stroke-linecap:butt;stroke-linejoin:miter;stroke-miterlimit:4;stroke-dasharray:none;stroke-dashoffset:0;stroke-opacity:1;marker:none;paint-order:normal;color-rendering:auto;image-rendering:auto;shape-rendering:auto;text-rendering:auto;enable-background:new"
             d="m 103.30224,192.02681 -0.0254,0.0254 h -1.15234 v 1.16602 l -0.0176,0.0176 1.80469,1.78515 -1.80469,1.78321 0.0254,0.0254 h -0.008 v 1.17383 h 1.16797 l 0.01,0.01 0.01,-0.01 h 0.0137 v -0.0137 l 1.79297,-1.77343 1.81836,1.79687 0.01,-0.01 h 1.18164 v -1.17383 h -0.0215 l 0.0254,-0.0254 -1.80468,-1.78321 1.80468,-1.78515 -0.01,-0.01 h 0.006 v -1.17383 h -1.16602 l -0.0254,-0.0254 -1.81858,1.79688 z"
             id="path1556"
             inkscape:connector-curvature="0" />
        </g>
      </g>
    </g>
    <g
       style="display:inline;enable-background:new"
       id="g1600"
       transform="translate(237.86751,-343.02909)">
      <g
         id="g1598"
         inkscape:label="App Icon"
         style="display:inline"
         transform="translate(0,-172)">
        <g
           inkscape:groupmode="layer"
           id="g1576"
           inkscape:label="baseplate"
           style="display:none"
           sodipodi:insensitive="true">
          <g
             style="display:inline;fill:#000000;enable-background:new"
             transform="matrix(7.9911709,0,0,8.0036407,-167.7909,-4846.0776)"
             id="g1564"
             inkscape:export-xdpi="12"
             inkscape:export-ydpi="12" />
          <rect
             style="display:inline;overflow:visible;visibility:visible;fill:#1c71d8;fill-opacity:1;fill-rule:nonzero;stroke:none;stroke-width:0.5;marker:none;enable-background:accumulate"
             id="rect1566"
             width="128"
             height="128"
             x="9.2651362e-08"
             y="172"
             inkscape:label="512x512" />
          <g
             id="g1568"
             style="fill:none;fill-opacity:0.25098;stroke:#a579b3;stroke-opacity:1"
             transform="translate(-24,24)" />
          <g
             id="g1570"
             style="fill:none;fill-opacity:0.25098;stroke:#a579b3;stroke-opacity:1"
             transform="translate(-24,24)" />
          <text
             xml:space="preserve"
             style="font-style:normal;font-variant:normal;font-weight:bold;font-stretch:normal;font-size:15.6101px;line-height:125%;font-family:Cantarell;-inkscape-font-specification:'Cantarell, Bold';text-align:start;writing-mode:lr-tb;text-anchor:start;display:inline;fill:#98c1f1;fill-opacity:1;stroke:none;stroke-width:1.29817;enable-background:new"
             x="-0.98685926"
             y="161.48061"
             id="text1574"
             inkscape:label="icon-name"><tspan
               style="font-size:15.6101px;fill:#98c1f1;stroke-width:1.29817"
               sodipodi:role="line"
               id="tspan1572"
               x="-0.98685926"
               y="161.48061">Blueprint</tspan></text>
        </g>
        <g
           inkscape:groupmode="layer"
           id="g1588"
           inkscape:label="hairlines"
           style="display:none"
           sodipodi:insensitive="true">
          <circle
             cx="64.000031"
             cy="236"
             r="59.504131"
             id="circle1578"
             style="display:inline;opacity:0.1;vector-effect:none;fill:none;fill-opacity:1;stroke:#ffffff;stroke-width:0.99;stroke-linecap:butt;stroke-linejoin:miter;stroke-miterlimit:4;stroke-dasharray:0.99, 0.99;stroke-dashoffset:0;stroke-opacity:1;marker:none;marker-start:none;marker-mid:none;marker-end:none;paint-order:normal;enable-background:new" />
          <rect
             ry="7.9292889"
             rx="8.701004"
             y="180.49496"
             x="20.495007"
             height="111.01005"
             width="87.009987"
             id="rect1580"
             style="display:inline;opacity:0.1;vector-effect:none;fill:none;fill-opacity:1;stroke:#ffffff;stroke-width:0.99;stroke-linecap:butt;stroke-linejoin:miter;stroke-miterlimit:4;stroke-dasharray:0.99, 0.99;stroke-dashoffset:0;stroke-opacity:1;marker:none;marker-start:none;marker-mid:none;marker-end:none;paint-order:normal;enable-background:new" />
          <rect
             ry="7.9238095"
             rx="7.9238095"
             y="184.49524"
             x="12.495266"
             height="103.00952"
             width="103.00952"
             id="rect1582"
             style="display:inline;opacity:0.1;vector-effect:none;fill:none;fill-opacity:1;stroke:#ffffff;stroke-width:0.99;stroke-linecap:butt;stroke-linejoin:miter;stroke-miterlimit:4;stroke-dasharray:0.99, 0.99;stroke-dashoffset:0;stroke-opacity:1;marker:none;marker-start:none;marker-mid:none;marker-end:none;paint-order:normal;enable-background:new" />
          <rect
             ry="8.701005"
             rx="7.9292889"
             y="200.49496"
             x="8.4950066"
             height="87.010048"
             width="111.01004"
             id="rect1584"
             style="display:inline;opacity:0.1;vector-effect:none;fill:none;fill-opacity:1;stroke:#ffffff;stroke-width:0.99;stroke-linecap:butt;stroke-linejoin:miter;stroke-miterlimit:4;stroke-dasharray:0.99, 0.99;stroke-dashoffset:0;stroke-opacity:1;marker:none;marker-start:none;marker-mid:none;marker-end:none;paint-order:normal;enable-background:new" />
          <path
             inkscape:connector-curvature="0"
             id="path1586"
             d="M 2.6203015e-5,288.99999 H 128.00003"
             style="display:inline;fill:none;stroke:#98c1f1;stroke-width:2;stroke-linecap:butt;stroke-linejoin:miter;stroke-miterlimit:4;stroke-dasharray:none;stroke-opacity:1;enable-background:new" />
        </g>
        <g
           inkscape:groupmode="layer"
           id="g1596"
           inkscape:label="icons"
           style="display:inline">
          <rect
             ry="3.8039243"
             rx="3.8039246"
             y="186.03746"
             x="44.814938"
             height="57.406845"
             width="69.614319"
             id="rect1590"
             style="color:#000000;display:inline;overflow:visible;visibility:visible;fill:#ffffff;fill-opacity:1;fill-rule:nonzero;stroke:#98c1f1;stroke-width:4;stroke-miterlimit:4;stroke-dasharray:none;stroke-opacity:1;marker:none;enable-background:new" />
          <path
             inkscape:connector-curvature="0"
             id="path1592"
             d="M 45.051796,202.55805 H 114"
             style="color:#000000;clip-rule:nonzero;display:inline;overflow:visible;visibility:visible;opacity:1;isolation:auto;mix-blend-mode:normal;color-interpolation:sRGB;color-interpolation-filters:linearRGB;solid-color:#000000;solid-opacity:1;fill:#eeeeec;fill-opacity:1;fill-rule:nonzero;stroke:#98c1f1;stroke-width:1;stroke-linecap:butt;stroke-linejoin:miter;stroke-miterlimit:4;stroke-dasharray:none;stroke-dashoffset:0;stroke-opacity:1;marker:none;marker-start:none;marker-mid:none;marker-end:none;paint-order:normal;color-rendering:auto;image-rendering:auto;shape-rendering:auto;text-rendering:auto;enable-background:new"
             sodipodi:nodetypes="cc" />
          <path
             style="color:#000000;font-style:normal;font-variant:normal;font-weight:normal;font-stretch:normal;font-size:medium;line-height:normal;font-family:sans-serif;font-variant-ligatures:normal;font-variant-position:normal;font-variant-caps:normal;font-variant-numeric:normal;font-variant-alternates:normal;font-feature-settings:normal;text-indent:0;text-align:start;text-decoration:none;text-decoration-line:none;text-decoration-style:solid;text-decoration-color:#000000;letter-spacing:normal;word-spacing:normal;text-transform:none;writing-mode:lr-tb;direction:ltr;text-orientation:mixed;dominant-baseline:auto;baseline-shift:baseline;text-anchor:start;white-space:normal;shape-padding:0;clip-rule:nonzero;display:inline;overflow:visible;visibility:visible;opacity:1;isolation:auto;mix-blend-mode:normal;color-interpolation:sRGB;color-interpolation-filters:linearRGB;solid-color:#000000;solid-opacity:1;vector-effect:none;fill:#98c1f1;fill-opacity:1;fill-rule:nonzero;stroke:none;stroke-width:1.7;stroke-linecap:butt;stroke-linejoin:miter;stroke-miterlimit:4;stroke-dasharray:none;stroke-dashoffset:0;stroke-opacity:1;marker:none;paint-order:normal;color-rendering:auto;image-rendering:auto;shape-rendering:auto;text-rendering:auto;enable-background:new"
             d="m 103.30224,192.02681 -0.0254,0.0254 h -1.15234 v 1.16602 l -0.0176,0.0176 1.80469,1.78515 -1.80469,1.78321 0.0254,0.0254 h -0.008 v 1.17383 h 1.16797 l 0.01,0.01 0.01,-0.01 h 0.0137 v -0.0137 l 1.79297,-1.77343 1.81836,1.79687 0.01,-0.01 h 1.18164 v -1.17383 h -0.0215 l 0.0254,-0.0254 -1.80468,-1.78321 1.80468,-1.78515 -0.01,-0.01 h 0.006 v -1.17383 h -1.16602 l -0.0254,-0.0254 -1.81858,1.79688 z"
             id="path1594"
             inkscape:connector-curvature="0" />
        </g>
      </g>
    </g>
    <g
       style="display:inline;enable-background:new"
       id="g1638"
       transform="translate(534.2787,-326.13258)">
      <g
         id="g1636"
         inkscape:label="App Icon"
         style="display:inline"
         transform="translate(0,-172)">
        <g
           inkscape:groupmode="layer"
           id="g1614"
           inkscape:label="baseplate"
           style="display:none"
           sodipodi:insensitive="true">
          <g
             style="display:inline;fill:#000000;enable-background:new"
             transform="matrix(7.9911709,0,0,8.0036407,-167.7909,-4846.0776)"
             id="g1602"
             inkscape:export-xdpi="12"
             inkscape:export-ydpi="12" />
          <rect
             style="display:inline;overflow:visible;visibility:visible;fill:#1c71d8;fill-opacity:1;fill-rule:nonzero;stroke:none;stroke-width:0.5;marker:none;enable-background:accumulate"
             id="rect1604"
             width="128"
             height="128"
             x="9.2651362e-08"
             y="172"
             inkscape:label="512x512" />
          <g
             id="g1606"
             style="fill:none;fill-opacity:0.25098;stroke:#a579b3;stroke-opacity:1"
             transform="translate(-24,24)" />
          <g
             id="g1608"
             style="fill:none;fill-opacity:0.25098;stroke:#a579b3;stroke-opacity:1"
             transform="translate(-24,24)" />
          <text
             xml:space="preserve"
             style="font-style:normal;font-variant:normal;font-weight:bold;font-stretch:normal;font-size:15.6101px;line-height:125%;font-family:Cantarell;-inkscape-font-specification:'Cantarell, Bold';text-align:start;writing-mode:lr-tb;text-anchor:start;display:inline;fill:#98c1f1;fill-opacity:1;stroke:none;stroke-width:1.29817;enable-background:new"
             x="-0.98685926"
             y="161.48061"
             id="text1612"
             inkscape:label="icon-name"><tspan
               style="font-size:15.6101px;fill:#98c1f1;stroke-width:1.29817"
               sodipodi:role="line"
               id="tspan1610"
               x="-0.98685926"
               y="161.48061">Blueprint</tspan></text>
        </g>
        <g
           inkscape:groupmode="layer"
           id="g1626"
           inkscape:label="hairlines"
           style="display:none"
           sodipodi:insensitive="true">
          <circle
             cx="64.000031"
             cy="236"
             r="59.504131"
             id="circle1616"
             style="display:inline;opacity:0.1;vector-effect:none;fill:none;fill-opacity:1;stroke:#ffffff;stroke-width:0.99;stroke-linecap:butt;stroke-linejoin:miter;stroke-miterlimit:4;stroke-dasharray:0.99, 0.99;stroke-dashoffset:0;stroke-opacity:1;marker:none;marker-start:none;marker-mid:none;marker-end:none;paint-order:normal;enable-background:new" />
          <rect
             ry="7.9292889"
             rx="8.701004"
             y="180.49496"
             x="20.495007"
             height="111.01005"
             width="87.009987"
             id="rect1618"
             style="display:inline;opacity:0.1;vector-effect:none;fill:none;fill-opacity:1;stroke:#ffffff;stroke-width:0.99;stroke-linecap:butt;stroke-linejoin:miter;stroke-miterlimit:4;stroke-dasharray:0.99, 0.99;stroke-dashoffset:0;stroke-opacity:1;marker:none;marker-start:none;marker-mid:none;marker-end:none;paint-order:normal;enable-background:new" />
          <rect
             ry="7.9238095"
             rx="7.9238095"
             y="184.49524"
             x="12.495266"
             height="103.00952"
             width="103.00952"
             id="rect1620"
             style="display:inline;opacity:0.1;vector-effect:none;fill:none;fill-opacity:1;stroke:#ffffff;stroke-width:0.99;stroke-linecap:butt;stroke-linejoin:miter;stroke-miterlimit:4;stroke-dasharray:0.99, 0.99;stroke-dashoffset:0;stroke-opacity:1;marker:none;marker-start:none;marker-mid:none;marker-end:none;paint-order:normal;enable-background:new" />
          <rect
             ry="8.701005"
             rx="7.9292889"
             y="200.49496"
             x="8.4950066"
             height="87.010048"
             width="111.01004"
             id="rect1622"
             style="display:inline;opacity:0.1;vector-effect:none;fill:none;fill-opacity:1;stroke:#ffffff;stroke-width:0.99;stroke-linecap:butt;stroke-linejoin:miter;stroke-miterlimit:4;stroke-dasharray:0.99, 0.99;stroke-dashoffset:0;stroke-opacity:1;marker:none;marker-start:none;marker-mid:none;marker-end:none;paint-order:normal;enable-background:new" />
          <path
             inkscape:connector-curvature="0"
             id="path1624"
             d="M 2.6203015e-5,288.99999 H 128.00003"
             style="display:inline;fill:none;stroke:#98c1f1;stroke-width:2;stroke-linecap:butt;stroke-linejoin:miter;stroke-miterlimit:4;stroke-dasharray:none;stroke-opacity:1;enable-background:new" />
        </g>
        <g
           inkscape:groupmode="layer"
           id="g1634"
           inkscape:label="icons"
           style="display:inline">
          <rect
             ry="3.8039243"
             rx="3.8039246"
             y="186.03746"
             x="-3.8452187"
             height="99.973251"
             width="118.27448"
             id="rect1628"
             style="color:#000000;display:inline;overflow:visible;visibility:visible;fill:#ffffff;fill-opacity:1;fill-rule:nonzero;stroke:#98c1f1;stroke-width:4;stroke-miterlimit:4;stroke-dasharray:none;stroke-opacity:1;marker:none;enable-background:new" />
          <path
             inkscape:connector-curvature="0"
             id="path1630"
             d="M -3.0849228,202.55805 H 114"
             style="color:#000000;clip-rule:nonzero;display:inline;overflow:visible;visibility:visible;opacity:1;isolation:auto;mix-blend-mode:normal;color-interpolation:sRGB;color-interpolation-filters:linearRGB;solid-color:#000000;solid-opacity:1;fill:#eeeeec;fill-opacity:1;fill-rule:nonzero;stroke:#98c1f1;stroke-width:1;stroke-linecap:butt;stroke-linejoin:miter;stroke-miterlimit:4;stroke-dasharray:none;stroke-dashoffset:0;stroke-opacity:1;marker:none;marker-start:none;marker-mid:none;marker-end:none;paint-order:normal;color-rendering:auto;image-rendering:auto;shape-rendering:auto;text-rendering:auto;enable-background:new"
             sodipodi:nodetypes="cc" />
          <path
             style="color:#000000;font-style:normal;font-variant:normal;font-weight:normal;font-stretch:normal;font-size:medium;line-height:normal;font-family:sans-serif;font-variant-ligatures:normal;font-variant-position:normal;font-variant-caps:normal;font-variant-numeric:normal;font-variant-alternates:normal;font-feature-settings:normal;text-indent:0;text-align:start;text-decoration:none;text-decoration-line:none;text-decoration-style:solid;text-decoration-color:#000000;letter-spacing:normal;word-spacing:normal;text-transform:none;writing-mode:lr-tb;direction:ltr;text-orientation:mixed;dominant-baseline:auto;baseline-shift:baseline;text-anchor:start;white-space:normal;shape-padding:0;clip-rule:nonzero;display:inline;overflow:visible;visibility:visible;opacity:1;isolation:auto;mix-blend-mode:normal;color-interpolation:sRGB;color-interpolation-filters:linearRGB;solid-color:#000000;solid-opacity:1;vector-effect:none;fill:#98c1f1;fill-opacity:1;fill-rule:nonzero;stroke:none;stroke-width:1.7;stroke-linecap:butt;stroke-linejoin:miter;stroke-miterlimit:4;stroke-dasharray:none;stroke-dashoffset:0;stroke-opacity:1;marker:none;paint-order:normal;color-rendering:auto;image-rendering:auto;shape-rendering:auto;text-rendering:auto;enable-background:new"
             d="m 103.30224,192.02681 -0.0254,0.0254 h -1.15234 v 1.16602 l -0.0176,0.0176 1.80469,1.78515 -1.80469,1.78321 0.0254,0.0254 h -0.008 v 1.17383 h 1.16797 l 0.01,0.01 0.01,-0.01 h 0.0137 v -0.0137 l 1.79297,-1.77343 1.81836,1.79687 0.01,-0.01 h 1.18164 v -1.17383 h -0.0215 l 0.0254,-0.0254 -1.80468,-1.78321 1.80468,-1.78515 -0.01,-0.01 h 0.006 v -1.17383 h -1.16602 l -0.0254,-0.0254 -1.81858,1.79688 z"
             id="path1632"
             inkscape:connector-curvature="0" />
        </g>
      </g>
    </g>
    <g
       id="g14552"
       transform="translate(-16.179657)">
      <rect
         style="vector-effect:none;fill:#98c1f1;fill-opacity:1;stroke:none;stroke-width:1.50001;stroke-linecap:round;stroke-linejoin:miter;stroke-miterlimit:4;stroke-dasharray:none;stroke-dashoffset:0;stroke-opacity:1"
         id="rect879"
         width="401.29974"
         height="235.92667"
         x="70.119629"
         y="45.076141" />
      <ellipse
         style="vector-effect:none;fill:#ffffff;fill-opacity:1;stroke:none;stroke-width:1.125;stroke-linecap:round;stroke-linejoin:miter;stroke-miterlimit:4;stroke-dasharray:none;stroke-dashoffset:0;stroke-opacity:1"
         id="circle1860-6"
         cx="228.09067"
         cy="258.44534"
         rx="10.07695"
         ry="10.102653" />
      <ellipse
         cy="258.44534"
         cx="185.41182"
         id="circle1862-7"
         style="vector-effect:none;fill:#ffffff;fill-opacity:1;stroke:none;stroke-width:1.125;stroke-linecap:round;stroke-linejoin:miter;stroke-miterlimit:4;stroke-dasharray:none;stroke-dashoffset:0;stroke-opacity:1"
         rx="10.07695"
         ry="10.102653" />
      <ellipse
         style="vector-effect:none;fill:#ffffff;fill-opacity:1;stroke:none;stroke-width:1.125;stroke-linecap:round;stroke-linejoin:miter;stroke-miterlimit:4;stroke-dasharray:none;stroke-dashoffset:0;stroke-opacity:1"
         id="circle1864-5"
         cx="270.76953"
         cy="258.44534"
         rx="10.07695"
         ry="10.102653" />
      <ellipse
         cy="258.44534"
         cx="312.26285"
         id="circle1866-3"
         style="vector-effect:none;fill:#ffffff;fill-opacity:1;stroke:none;stroke-width:1.125;stroke-linecap:round;stroke-linejoin:miter;stroke-miterlimit:4;stroke-dasharray:none;stroke-dashoffset:0;stroke-opacity:1"
         rx="10.07695"
         ry="10.102653" />
      <ellipse
         style="vector-effect:none;fill:#ffffff;fill-opacity:1;stroke:none;stroke-width:1.125;stroke-linecap:round;stroke-linejoin:miter;stroke-miterlimit:4;stroke-dasharray:none;stroke-dashoffset:0;stroke-opacity:1"
         id="circle1868-5"
         cx="356.1272"
         cy="258.44534"
         rx="10.07695"
         ry="10.102653" />
      <g
         id="g14523" />
      <rect
         style="vector-effect:none;fill:#98c1f1;fill-opacity:1;stroke:none;stroke-width:1.50001;stroke-linecap:round;stroke-linejoin:miter;stroke-miterlimit:4;stroke-dasharray:none;stroke-dashoffset:0;stroke-opacity:1"
         id="rect14572"
         width="401.29974"
         height="235.92667"
         x="497.11316"
         y="45.076141" />
      <g
         id="g14604"
         transform="matrix(0.51151344,0,0,0.51151344,456.18876,20.461114)"
         style="stroke-width:1.95498">
        <ellipse
           style="vector-effect:none;fill:#ffffff;fill-opacity:1;stroke:none;stroke-width:2.19936;stroke-linecap:round;stroke-linejoin:miter;stroke-miterlimit:4;stroke-dasharray:none;stroke-dashoffset:0;stroke-opacity:1"
           id="ellipse14574"
           cx="388.83716"
           cy="217.16315"
           rx="19.700264"
           ry="19.750513" />
        <ellipse
           cy="217.16315"
           cx="305.40076"
           id="ellipse14576"
           style="vector-effect:none;fill:#ffffff;fill-opacity:1;stroke:none;stroke-width:2.19936;stroke-linecap:round;stroke-linejoin:miter;stroke-miterlimit:4;stroke-dasharray:none;stroke-dashoffset:0;stroke-opacity:1"
           rx="19.700264"
           ry="19.750513" />
        <ellipse
           style="vector-effect:none;fill:#ffffff;fill-opacity:1;stroke:none;stroke-width:2.19936;stroke-linecap:round;stroke-linejoin:miter;stroke-miterlimit:4;stroke-dasharray:none;stroke-dashoffset:0;stroke-opacity:1"
           id="ellipse14578"
           cx="472.27359"
           cy="217.16315"
           rx="19.700264"
           ry="19.750513" />
        <ellipse
           cy="217.16315"
           cx="553.39233"
           id="ellipse14580"
           style="vector-effect:none;fill:#ffffff;fill-opacity:1;stroke:none;stroke-width:2.19936;stroke-linecap:round;stroke-linejoin:miter;stroke-miterlimit:4;stroke-dasharray:none;stroke-dashoffset:0;stroke-opacity:1"
           rx="19.700264"
           ry="19.750513" />
        <ellipse
           style="vector-effect:none;fill:#ffffff;fill-opacity:1;stroke:none;stroke-width:2.19936;stroke-linecap:round;stroke-linejoin:miter;stroke-miterlimit:4;stroke-dasharray:none;stroke-dashoffset:0;stroke-opacity:1"
           id="ellipse14582"
           cx="639.14636"
           cy="217.16315"
           rx="19.700264"
           ry="19.750513" />
        <ellipse
           cy="291.51801"
           cx="388.83716"
           id="ellipse14584"
           style="vector-effect:none;fill:#ffffff;fill-opacity:1;stroke:none;stroke-width:2.19936;stroke-linecap:round;stroke-linejoin:miter;stroke-miterlimit:4;stroke-dasharray:none;stroke-dashoffset:0;stroke-opacity:1"
           rx="19.700264"
           ry="19.750513" />
        <ellipse
           style="vector-effect:none;fill:#ffffff;fill-opacity:1;stroke:none;stroke-width:2.19936;stroke-linecap:round;stroke-linejoin:miter;stroke-miterlimit:4;stroke-dasharray:none;stroke-dashoffset:0;stroke-opacity:1"
           id="ellipse14586"
           cx="305.40076"
           cy="291.51801"
           rx="19.700264"
           ry="19.750513" />
        <ellipse
           cy="291.51801"
           cx="472.27359"
           id="ellipse14588"
           style="vector-effect:none;fill:#ffffff;fill-opacity:1;stroke:none;stroke-width:2.19936;stroke-linecap:round;stroke-linejoin:miter;stroke-miterlimit:4;stroke-dasharray:none;stroke-dashoffset:0;stroke-opacity:1"
           rx="19.700264"
           ry="19.750513" />
        <ellipse
           style="vector-effect:none;fill:#ffffff;fill-opacity:1;stroke:none;stroke-width:2.19936;stroke-linecap:round;stroke-linejoin:miter;stroke-miterlimit:4;stroke-dasharray:none;stroke-dashoffset:0;stroke-opacity:1"
           id="ellipse14590"
           cx="553.39233"
           cy="291.51801"
           rx="19.700264"
           ry="19.750513" />
        <ellipse
           cy="291.51801"
           cx="639.14636"
           id="ellipse14592"
           style="vector-effect:none;fill:#ffffff;fill-opacity:1;stroke:none;stroke-width:2.19936;stroke-linecap:round;stroke-linejoin:miter;stroke-miterlimit:4;stroke-dasharray:none;stroke-dashoffset:0;stroke-opacity:1"
           rx="19.700264"
           ry="19.750513" />
        <ellipse
           style="vector-effect:none;fill:#ffffff;fill-opacity:1;stroke:none;stroke-width:2.19936;stroke-linecap:round;stroke-linejoin:miter;stroke-miterlimit:4;stroke-dasharray:none;stroke-dashoffset:0;stroke-opacity:1"
           id="ellipse14594"
           cx="388.83716"
           cy="365.87289"
           rx="19.700264"
           ry="19.750513" />
        <ellipse
           cy="365.87289"
           cx="305.40076"
           id="ellipse14596"
           style="vector-effect:none;fill:#ffffff;fill-opacity:1;stroke:none;stroke-width:2.19936;stroke-linecap:round;stroke-linejoin:miter;stroke-miterlimit:4;stroke-dasharray:none;stroke-dashoffset:0;stroke-opacity:1"
           rx="19.700264"
           ry="19.750513" />
        <ellipse
           style="vector-effect:none;fill:#ffffff;fill-opacity:1;stroke:none;stroke-width:2.19936;stroke-linecap:round;stroke-linejoin:miter;stroke-miterlimit:4;stroke-dasharray:none;stroke-dashoffset:0;stroke-opacity:1"
           id="ellipse14598"
           cx="472.27359"
           cy="365.87289"
           rx="19.700264"
           ry="19.750513" />
        <ellipse
           cy="365.87289"
           cx="553.39233"
           id="ellipse14600"
           style="vector-effect:none;fill:#ffffff;fill-opacity:1;stroke:none;stroke-width:2.19936;stroke-linecap:round;stroke-linejoin:miter;stroke-miterlimit:4;stroke-dasharray:none;stroke-dashoffset:0;stroke-opacity:1"
           rx="19.700264"
           ry="19.750513" />
        <ellipse
           style="vector-effect:none;fill:#ffffff;fill-opacity:1;stroke:none;stroke-width:2.19936;stroke-linecap:round;stroke-linejoin:miter;stroke-miterlimit:4;stroke-dasharray:none;stroke-dashoffset:0;stroke-opacity:1"
           id="ellipse14602"
           cx="639.14636"
           cy="365.87289"
           rx="19.700264"
           ry="19.750513" />
      </g>
      <rect
         style="vector-effect:none;fill:#ffffff;fill-opacity:1;stroke:none;stroke-width:1.50001;stroke-linecap:round;stroke-linejoin:miter;stroke-miterlimit:4;stroke-dasharray:none;stroke-dashoffset:0;stroke-opacity:1"
         id="rect14622"
         width="111.43922"
         height="14.262569"
         x="642.04346"
         y="84.375397"
         rx="7.1312847"
         ry="7.1312847" />
      <rect
         style="vector-effect:none;fill:#ffffff;fill-opacity:1;stroke:none;stroke-width:1.50001;stroke-linecap:round;stroke-linejoin:miter;stroke-miterlimit:4;stroke-dasharray:none;stroke-dashoffset:0;stroke-opacity:1"
         id="rect14624"
         width="111.43922"
         height="14.262569"
         x="211.87549"
         y="211.27774"
         rx="7.1312847"
         ry="7.1312847" />
    </g>
  </g>
</svg>
