<?xml version="1.0" encoding="UTF-8" standalone="no"?>
<svg
   inkscape:version="1.1 (c68e22c387, 2021-05-23)"
   id="svg8"
   version="1.1"
   viewBox="0 0 230 140"
   height="140"
   width="230"
   sodipodi:docname="controls-checkboxes.svg"
   xmlns:inkscape="http://www.inkscape.org/namespaces/inkscape"
   xmlns:sodipodi="http://sodipodi.sourceforge.net/DTD/sodipodi-0.dtd"
   xmlns="http://www.w3.org/2000/svg"
   xmlns:svg="http://www.w3.org/2000/svg"
   xmlns:rdf="http://www.w3.org/1999/02/22-rdf-syntax-ns#">
  <defs
     id="defs2">
    <clipPath
       clipPathUnits="userSpaceOnUse"
       id="clipPath28924">
      <rect
         style="fill:#99c1f1;stroke:none;stroke-width:4.7625;stroke-linecap:round;stroke-dashoffset:26.4"
         id="rect28926"
         width="60.854164"
         height="37.041683"
         x="223.57289"
         y="113.77081"
         ry="2.1166666"
         rx="2.1166666" />
    </clipPath>
    <inkscape:path-effect
       effect="fillet_chamfer"
       id="path-effect51438"
       is_visible="true"
       lpeversion="1"
       satellites_param="F,0,0,1,0,0,0,1 @ F,0,0,1,0,0,0,1 @ F,0,0,1,0,0,0,1 @ F,0,0,1,0,2,0,1"
       unit="px"
       method="auto"
       mode="F"
       radius="8"
       chamfer_steps="1"
       flexible="false"
       use_knot_distance="true"
       apply_no_radius="true"
       apply_with_radius="true"
       only_selected="false"
       hide_knots="false" />
    <clipPath
       clipPathUnits="userSpaceOnUse"
       id="clipPath40461">
      <rect
         style="fill:#99c1f1;stroke:none;stroke-width:4.7625;stroke-linecap:round;stroke-dashoffset:26.4"
         id="rect40463"
         width="60.854164"
         height="37.041683"
         x="223.57289"
         y="163.24783"
         ry="2.1166666"
         rx="2.1166666" />
    </clipPath>
    <clipPath
       clipPathUnits="userSpaceOnUse"
       id="clipPath53720">
      <rect
         style="fill:#99c1f1;stroke:none;stroke-width:4.7625;stroke-linecap:round;stroke-dashoffset:26.4"
         id="rect53722"
         width="60.854168"
         height="37.041683"
         x="-47.603741"
         y="164.65617"
         ry="2.1166666"
         rx="2.1166666" />
    </clipPath>
    <clipPath
       id="c-9">
      <path
         d="M 0,0 H 1024 V 800 H 0 Z"
         id="path64878" />
    </clipPath>
    <mask
       id="b-90">
      <g
         filter="url(#a)"
         id="g64875"
         style="filter:url(#a-4)">
        <path
           d="M 0,0 H 16 V 16 H 0 Z"
           fill-opacity="0.3"
           id="path64873" />
      </g>
    </mask>
    <filter
       id="a-4"
       height="1"
       width="1"
       x="0"
       y="0">
      <feColorMatrix
         in="SourceGraphic"
         type="matrix"
         values="0 0 0 0 1 0 0 0 0 1 0 0 0 0 1 0 0 0 1 0"
         id="feColorMatrix64870" />
    </filter>
    <clipPath
       id="e-7">
      <path
         d="M 0,0 H 1024 V 800 H 0 Z"
         id="path64886" />
    </clipPath>
    <mask
       id="d-1">
      <g
         filter="url(#a)"
         id="g64883"
         style="filter:url(#a-4)">
        <path
           d="M 0,0 H 16 V 16 H 0 Z"
           fill-opacity="0.05"
           id="path64881" />
      </g>
    </mask>
    <filter
       id="filter7691"
       height="1"
       width="1"
       x="0"
       y="0">
      <feColorMatrix
         in="SourceGraphic"
         type="matrix"
         values="0 0 0 0 1 0 0 0 0 1 0 0 0 0 1 0 0 0 1 0"
         id="feColorMatrix7689" />
    </filter>
    <clipPath
       id="g-1">
      <path
         d="M 0,0 H 1024 V 800 H 0 Z"
         id="path64894" />
    </clipPath>
    <mask
       id="f-7">
      <g
         filter="url(#a)"
         id="g64891"
         style="filter:url(#a-4)">
        <path
           d="M 0,0 H 16 V 16 H 0 Z"
           fill-opacity="0.05"
           id="path64889" />
      </g>
    </mask>
    <filter
       id="filter7700"
       height="1"
       width="1"
       x="0"
       y="0">
      <feColorMatrix
         in="SourceGraphic"
         type="matrix"
         values="0 0 0 0 1 0 0 0 0 1 0 0 0 0 1 0 0 0 1 0"
         id="feColorMatrix7698" />
    </filter>
    <clipPath
       id="i-5">
      <path
         d="M 0,0 H 1024 V 800 H 0 Z"
         id="path64902" />
    </clipPath>
    <mask
       id="h-1">
      <g
         filter="url(#a)"
         id="g64899"
         style="filter:url(#a-4)">
        <path
           d="M 0,0 H 16 V 16 H 0 Z"
           fill-opacity="0.05"
           id="path64897" />
      </g>
    </mask>
    <filter
       id="filter7709"
       height="1"
       width="1"
       x="0"
       y="0">
      <feColorMatrix
         in="SourceGraphic"
         type="matrix"
         values="0 0 0 0 1 0 0 0 0 1 0 0 0 0 1 0 0 0 1 0"
         id="feColorMatrix7707" />
    </filter>
    <clipPath
       id="k-77">
      <path
         d="M 0,0 H 1024 V 800 H 0 Z"
         id="path64910" />
    </clipPath>
    <mask
       id="j-9">
      <g
         filter="url(#a)"
         id="g64907"
         style="filter:url(#a-4)">
        <path
           d="M 0,0 H 16 V 16 H 0 Z"
           fill-opacity="0.05"
           id="path64905" />
      </g>
    </mask>
    <filter
       id="filter7718"
       height="1"
       width="1"
       x="0"
       y="0">
      <feColorMatrix
         in="SourceGraphic"
         type="matrix"
         values="0 0 0 0 1 0 0 0 0 1 0 0 0 0 1 0 0 0 1 0"
         id="feColorMatrix7716" />
    </filter>
    <clipPath
       id="m-7">
      <path
         d="M 0,0 H 1024 V 800 H 0 Z"
         id="path64918" />
    </clipPath>
    <mask
       id="l-6">
      <g
         filter="url(#a)"
         id="g64915"
         style="filter:url(#a-4)">
        <path
           d="M 0,0 H 16 V 16 H 0 Z"
           fill-opacity="0.05"
           id="path64913" />
      </g>
    </mask>
    <filter
       id="filter7727"
       height="1"
       width="1"
       x="0"
       y="0">
      <feColorMatrix
         in="SourceGraphic"
         type="matrix"
         values="0 0 0 0 1 0 0 0 0 1 0 0 0 0 1 0 0 0 1 0"
         id="feColorMatrix7725" />
    </filter>
    <clipPath
       id="o-5">
      <path
         d="M 0,0 H 1024 V 800 H 0 Z"
         id="path64926" />
    </clipPath>
    <mask
       id="n-36">
      <g
         filter="url(#a)"
         id="g64923"
         style="filter:url(#a-4)">
        <path
           d="M 0,0 H 16 V 16 H 0 Z"
           fill-opacity="0.05"
           id="path64921" />
      </g>
    </mask>
    <filter
       id="filter7736"
       height="1"
       width="1"
       x="0"
       y="0">
      <feColorMatrix
         in="SourceGraphic"
         type="matrix"
         values="0 0 0 0 1 0 0 0 0 1 0 0 0 0 1 0 0 0 1 0"
         id="feColorMatrix7734" />
    </filter>
    <clipPath
       id="q-9">
      <path
         d="M 0,0 H 1024 V 800 H 0 Z"
         id="path64934" />
    </clipPath>
    <mask
       id="p-63">
      <g
         filter="url(#a)"
         id="g64931"
         style="filter:url(#a-4)">
        <path
           d="M 0,0 H 16 V 16 H 0 Z"
           fill-opacity="0.3"
           id="path64929" />
      </g>
    </mask>
    <filter
       id="filter7745"
       height="1"
       width="1"
       x="0"
       y="0">
      <feColorMatrix
         in="SourceGraphic"
         type="matrix"
         values="0 0 0 0 1 0 0 0 0 1 0 0 0 0 1 0 0 0 1 0"
         id="feColorMatrix7743" />
    </filter>
    <clipPath
       id="s-8">
      <path
         d="M 0,0 H 1024 V 800 H 0 Z"
         id="path64942" />
    </clipPath>
    <mask
       id="r-4">
      <g
         filter="url(#a)"
         id="g64939"
         style="filter:url(#a-4)">
        <path
           d="M 0,0 H 16 V 16 H 0 Z"
           fill-opacity="0.5"
           id="path64937" />
      </g>
    </mask>
    <filter
       id="filter7754"
       height="1"
       width="1"
       x="0"
       y="0">
      <feColorMatrix
         in="SourceGraphic"
         type="matrix"
         values="0 0 0 0 1 0 0 0 0 1 0 0 0 0 1 0 0 0 1 0"
         id="feColorMatrix7752" />
    </filter>
    <clipPath
       id="u-9">
      <path
         d="M 0,0 H 1024 V 800 H 0 Z"
         id="path64950" />
    </clipPath>
    <mask
       id="t-12">
      <g
         filter="url(#a)"
         id="g64947"
         style="filter:url(#a-4)">
        <path
           d="M 0,0 H 16 V 16 H 0 Z"
           fill-opacity="0.4"
           id="path64945" />
      </g>
    </mask>
    <filter
       id="filter7763"
       height="1"
       width="1"
       x="0"
       y="0">
      <feColorMatrix
         in="SourceGraphic"
         type="matrix"
         values="0 0 0 0 1 0 0 0 0 1 0 0 0 0 1 0 0 0 1 0"
         id="feColorMatrix7761" />
    </filter>
    <clipPath
       id="w-90">
      <path
         d="M 0,0 H 1024 V 800 H 0 Z"
         id="path64958" />
    </clipPath>
    <mask
       id="v-3">
      <g
         filter="url(#a)"
         id="g64955"
         style="filter:url(#a-4)">
        <path
           d="M 0,0 H 16 V 16 H 0 Z"
           fill-opacity="0.4"
           id="path64953" />
      </g>
    </mask>
    <filter
       id="filter7772"
       height="1"
       width="1"
       x="0"
       y="0">
      <feColorMatrix
         in="SourceGraphic"
         type="matrix"
         values="0 0 0 0 1 0 0 0 0 1 0 0 0 0 1 0 0 0 1 0"
         id="feColorMatrix7770" />
    </filter>
    <clipPath
       id="y-8">
      <path
         d="M 0,0 H 1024 V 800 H 0 Z"
         id="path64966" />
    </clipPath>
    <mask
       id="x-8">
      <g
         filter="url(#a)"
         id="g64963"
         style="filter:url(#a-4)">
        <path
           d="M 0,0 H 16 V 16 H 0 Z"
           fill-opacity="0.5"
           id="path64961" />
      </g>
    </mask>
    <filter
       id="filter7781"
       height="1"
       width="1"
       x="0"
       y="0">
      <feColorMatrix
         in="SourceGraphic"
         type="matrix"
         values="0 0 0 0 1 0 0 0 0 1 0 0 0 0 1 0 0 0 1 0"
         id="feColorMatrix7779" />
    </filter>
    <clipPath
       id="A-0">
      <path
         d="M 0,0 H 1024 V 800 H 0 Z"
         id="path64974" />
    </clipPath>
    <mask
       id="z-5">
      <g
         filter="url(#a)"
         id="g64971"
         style="filter:url(#a-4)">
        <path
           d="M 0,0 H 16 V 16 H 0 Z"
           fill-opacity="0.5"
           id="path64969" />
      </g>
    </mask>
    <filter
       id="filter7790"
       height="1"
       width="1"
       x="0"
       y="0">
      <feColorMatrix
         in="SourceGraphic"
         type="matrix"
         values="0 0 0 0 1 0 0 0 0 1 0 0 0 0 1 0 0 0 1 0"
         id="feColorMatrix7788" />
    </filter>
    <inkscape:path-effect
       effect="fillet_chamfer"
       id="path-effect70083"
       is_visible="true"
       lpeversion="1"
       satellites_param="F,0,0,1,0,0,0,1 @ F,0,0,1,0,0,0,1 @ F,0,0,1,0,0,0,1 @ F,0,0,1,0,2,0,1"
       unit="px"
       method="auto"
       mode="F"
       radius="8"
       chamfer_steps="1"
       flexible="false"
       use_knot_distance="true"
       apply_no_radius="true"
       apply_with_radius="true"
       only_selected="false"
       hide_knots="false" />
  </defs>
  <sodipodi:namedview
     units="px"
     borderlayer="true"
     inkscape:showpageshadow="false"
     showgrid="false"
     inkscape:document-rotation="0"
     inkscape:current-layer="layer1"
     inkscape:document-units="px"
     inkscape:cy="560"
     inkscape:cx="400"
     inkscape:zoom="0.35"
     inkscape:pageshadow="2"
     inkscape:pageopacity="0"
     borderopacity="1"
     bordercolor="#383838"
     pagecolor="#1f1f1f"
     id="base"
     inkscape:pagecheckerboard="1"
     width="230px">
    <inkscape:grid
       type="xygrid"
       id="grid1900" />
  </sodipodi:namedview>
  <metadata
     id="metadata5">
    <rdf:RDF />
  </metadata>
  <g
     id="layer1"
     inkscape:groupmode="layer"
     inkscape:label="Layer 1">
    <rect
       style="fill:#99c1f1;stroke:none;stroke-width:18;stroke-linecap:round;stroke-dashoffset:26.4"
       id="rect1098"
       width="229.99998"
       height="140.00005"
       x="0.0010986328"
       y="-5.7220459e-05"
       ry="7.999999"
       rx="7.999999" />
    <g
       id="g36575"
       transform="matrix(3.7795272,0,0,3.7795272,-4259,-619.99988)">
      <rect
         width="9.2603178"
         height="9.2601662"
         x="1138.5022"
         y="170.65622"
         fill="#ffffff"
         id="rect110891-3"
         style="fill:#ffffff;fill-opacity:1;stroke-width:0.488966"
         rx="3.1750002"
         ry="3.1750002" />
      <rect
         width="9.2603178"
         height="9.2601662"
         x="1138.5022"
         y="185.20859"
         fill="#ffffff"
         id="rect112541"
         style="fill:#ffffff;fill-opacity:1;stroke-width:0.488966"
         rx="3.1750002"
         ry="3.1750002" />
      <rect
         width="25.135416"
         height="2.6457901"
         x="1150.9376"
         y="173.83125"
         fill="#ffffff"
         id="rect110891"
         style="fill:#d1e3f9;fill-opacity:1;stroke-width:0.488965" />
      <rect
         width="25.135416"
         height="2.6457901"
         x="1150.9376"
         y="188.38335"
         fill="#ffffff"
         id="rect110893"
         style="fill:#d1e3f9;fill-opacity:1;stroke-width:0.488965" />
      <path
         style="fill:none;stroke:#99c1f1;stroke-width:1.5875;stroke-linecap:butt;stroke-linejoin:miter;stroke-opacity:1"
         d="m 1140.0896,175.15418 2.1167,2.11666 3.9687,-3.96875"
         id="path114388"
         sodipodi:nodetypes="ccc" />
    </g>
  </g>
</svg>
