<?xml version="1.0" encoding="UTF-8" standalone="no"?>
<svg
   xmlns:dc="http://purl.org/dc/elements/1.1/"
   xmlns:cc="http://creativecommons.org/ns#"
   xmlns:rdf="http://www.w3.org/1999/02/22-rdf-syntax-ns#"
   xmlns:svg="http://www.w3.org/2000/svg"
   xmlns="http://www.w3.org/2000/svg"
   xmlns:xlink="http://www.w3.org/1999/xlink"
   xmlns:sodipodi="http://sodipodi.sourceforge.net/DTD/sodipodi-0.dtd"
   xmlns:inkscape="http://www.inkscape.org/namespaces/inkscape"
   inkscape:export-ydpi="96"
   inkscape:export-xdpi="96"
   inkscape:export-filename="Template.png"
   width="192"
   height="152"
   id="svg11300"
   sodipodi:version="0.32"
   inkscape:version="1.0beta2 (2b71d25d45, 2019-12-03)"
   sodipodi:docname="net.daase.Journable.svg"
   inkscape:output_extension="org.inkscape.output.svg.inkscape"
   version="1.0"
   style="display:inline;enable-background:new"
   viewBox="0 0 192 152">
  <title
     id="title4162">Adwaita Icon Template</title>
  <defs
     id="defs3">
    <linearGradient
       id="linearGradient1686"
       inkscape:collect="always">
      <stop
         id="stop1682"
         offset="0"
         style="stop-color:#5e5c64;stop-opacity:1" />
      <stop
         id="stop1684"
         offset="1"
         style="stop-color:#9a9996;stop-opacity:1" />
    </linearGradient>
    <linearGradient
       id="linearGradient1517"
       inkscape:collect="always">
      <stop
         id="stop1511"
         offset="0"
         style="stop-color:#77767b;stop-opacity:1" />
      <stop
         style="stop-color:#c0bfbc;stop-opacity:1"
         offset="0.51104856"
         id="stop1513" />
      <stop
         id="stop1515"
         offset="1"
         style="stop-color:#9a9996;stop-opacity:1" />
    </linearGradient>
    <linearGradient
       inkscape:collect="always"
       id="linearGradient1696">
      <stop
         style="stop-color:#3d3846;stop-opacity:1"
         offset="0"
         id="stop1692" />
      <stop
         style="stop-color:#5e5c64;stop-opacity:1"
         offset="1"
         id="stop1694" />
    </linearGradient>
    <linearGradient
       y2="236"
       x2="96"
       y1="236"
       x1="32"
       gradientTransform="translate(604.81684,170.58641)"
       gradientUnits="userSpaceOnUse"
       id="linearGradient1099"
       xlink:href="#linearGradient1036" />
    <linearGradient
       id="linearGradient1036">
      <stop
         id="stop1032"
         offset="0"
         style="stop-color:#d5d3cf;stop-opacity:1;" />
      <stop
         id="stop1034"
         offset="1"
         style="stop-color:#f6f5f4;stop-opacity:1" />
    </linearGradient>
    <radialGradient
       r="32"
       fy="-76"
       fx="-244"
       cy="-76"
       cx="-244"
       gradientTransform="matrix(0.88333331,0,0,0.88333331,-460.35018,463.11973)"
       gradientUnits="userSpaceOnUse"
       id="radialGradient1103"
       xlink:href="#linearGradient1069" />
    <linearGradient
       id="linearGradient1069">
      <stop
         id="stop1065"
         offset="0"
         style="stop-color:#d5d3cf;stop-opacity:1" />
      <stop
         id="stop1067-1"
         offset="1"
         style="stop-color:#949390;stop-opacity:1" />
    </linearGradient>
    <linearGradient
       gradientUnits="userSpaceOnUse"
       y2="232"
       x2="64"
       y1="262.5"
       x1="64"
       id="linearGradient1027"
       xlink:href="#linearGradient1025"
       gradientTransform="translate(-470.5864,432.81685)" />
    <linearGradient
       id="linearGradient1025">
      <stop
         id="stop1021"
         offset="0"
         style="stop-color:#9a9996;stop-opacity:1" />
      <stop
         id="stop1023"
         offset="1"
         style="stop-color:#77767b;stop-opacity:1" />
    </linearGradient>
    <inkscape:path-effect
       effect="spiro"
       id="path-effect35304-9"
       is_visible="true" />
    <clipPath
       clipPathUnits="userSpaceOnUse"
       id="clipPath1609-7">
      <path
         sodipodi:nodetypes="cccccc"
         inkscape:connector-curvature="0"
         id="path1611-5"
         d="m 252,116 28,-28 v -8 h -36 v 36 z"
         style="fill:#e74747;stroke:none;stroke-width:0.25px;stroke-linecap:butt;stroke-linejoin:miter;stroke-opacity:1" />
    </clipPath>
    <linearGradient
       id="linearGradient1697">
      <stop
         id="stop1685"
         offset="0"
         style="stop-color:#c0bfbc;stop-opacity:1" />
      <stop
         style="stop-color:#eeeeec;stop-opacity:1"
         offset="0.04545455"
         id="stop1687" />
      <stop
         id="stop1689"
         offset="0.09090909"
         style="stop-color:#deddda;stop-opacity:1" />
      <stop
         style="stop-color:#deddda;stop-opacity:1"
         offset="0.90909094"
         id="stop1691" />
      <stop
         id="stop1693"
         offset="0.95454544"
         style="stop-color:#eeeeec;stop-opacity:1" />
      <stop
         id="stop1695"
         offset="1"
         style="stop-color:#c0bfbc;stop-opacity:1" />
    </linearGradient>
    <clipPath
       clipPathUnits="userSpaceOnUse"
       id="clipPath1289">
      <path
         style="display:inline;opacity:1;vector-effect:none;fill:none;fill-opacity:1;stroke:#000000;stroke-width:4;stroke-linecap:round;stroke-linejoin:round;stroke-miterlimit:4;stroke-dasharray:none;stroke-dashoffset:0;stroke-opacity:1;marker:none;marker-start:none;marker-mid:none;marker-end:none;paint-order:normal;enable-background:new"
         d="m 64,-148 h 64 l 64,-64 64,64 h 192 c 17.728,0 32,14.272 32,32 v 288 c 0,17.728 -14.272,32 -32,32 H 256 l -64,-64 -64,64 H 64 C 46.272,204 32,189.728 32,172 v -288 c 0,-17.728 14.408898,-34.19889 32,-32 z"
         id="path1291"
         inkscape:connector-curvature="0"
         sodipodi:nodetypes="scccsssscccssss" />
    </clipPath>
    <linearGradient
       id="paint3_linear-2-6-5"
       x2="1"
       gradientUnits="userSpaceOnUse"
       gradientTransform="matrix(0,6,-12,0,-64,209.99687)">
      <stop
         stop-color="#C01C27"
         id="stop91-0-7-4" />
      <stop
         offset="1"
         stop-color="#E01B24"
         id="stop93-2-5-7" />
    </linearGradient>
    <linearGradient
       inkscape:collect="always"
       id="linearGradient1351-3">
      <stop
         style="stop-color:#d5d3cf;stop-opacity:1"
         offset="0"
         id="stop1347" />
      <stop
         style="stop-color:#ffffff;stop-opacity:1"
         offset="1"
         id="stop1349-6" />
    </linearGradient>
    <clipPath
       clipPathUnits="userSpaceOnUse"
       id="clipPath1609">
      <path
         sodipodi:nodetypes="cccccc"
         inkscape:connector-curvature="0"
         id="path1611"
         d="m 252,116 28,-28 v -8 h -36 v 36 z"
         style="fill:#e74747;stroke:none;stroke-width:0.25px;stroke-linecap:butt;stroke-linejoin:miter;stroke-opacity:1" />
    </clipPath>
    <linearGradient
       inkscape:collect="always"
       id="linearGradient1187">
      <stop
         style="stop-color:#eeeeec;stop-opacity:1;"
         offset="0"
         id="stop1183" />
      <stop
         style="stop-color:#ffffff;stop-opacity:1"
         offset="1"
         id="stop1185" />
    </linearGradient>
    <clipPath
       clipPathUnits="userSpaceOnUse"
       id="clipPath2750">
      <path
         style="opacity:1;fill:url(#linearGradient2754);fill-opacity:1;stroke:none;stroke-width:7.55906;stroke-linecap:round;stroke-linejoin:miter;stroke-miterlimit:4;stroke-dasharray:none;stroke-dashoffset:4;stroke-opacity:1"
         d="m 36,192 v 92 h 72 v -92 z"
         id="path2752"
         inkscape:connector-curvature="0"
         sodipodi:nodetypes="ccccc" />
    </clipPath>
    <linearGradient
       id="linearGradient1005"
       inkscape:collect="always">
      <stop
         id="stop1001"
         offset="0"
         style="stop-color:#d0bb8e;stop-opacity:1" />
      <stop
         id="stop1003"
         offset="1"
         style="stop-color:#ffffff;stop-opacity:1" />
    </linearGradient>
    <linearGradient
       inkscape:collect="always"
       id="linearGradient1514">
      <stop
         style="stop-color:#9a9996;stop-opacity:1;"
         offset="0"
         id="stop1510" />
      <stop
         id="stop1516"
         offset="0.53315085"
         style="stop-color:#deddda;stop-opacity:1" />
      <stop
         style="stop-color:#f6f5f4;stop-opacity:1"
         offset="1"
         id="stop1512" />
    </linearGradient>
    <linearGradient
       inkscape:collect="always"
       xlink:href="#linearGradient1187"
       id="linearGradient1639"
       gradientUnits="userSpaceOnUse"
       x1="256"
       y1="268"
       x2="256"
       y2="-180.00006" />
    <linearGradient
       inkscape:collect="always"
       xlink:href="#linearGradient1697"
       id="linearGradient1426"
       x1="-429.33331"
       y1="-54.685287"
       x2="-55.999969"
       y2="-54.685287"
       gradientUnits="userSpaceOnUse" />
    <linearGradient
       gradientUnits="userSpaceOnUse"
       y2="174"
       x2="32"
       y1="190"
       x1="32"
       id="linearGradient1440"
       xlink:href="#linearGradient1517"
       inkscape:collect="always" />
    <linearGradient
       inkscape:collect="always"
       xlink:href="#linearGradient1697"
       id="linearGradient1668"
       gradientUnits="userSpaceOnUse"
       x1="-429.33331"
       y1="-54.685287"
       x2="-55.999969"
       y2="-54.685287" />
    <linearGradient
       inkscape:collect="always"
       xlink:href="#linearGradient1187"
       id="linearGradient1670"
       gradientUnits="userSpaceOnUse"
       x1="256"
       y1="268"
       x2="256"
       y2="-180.00006" />
    <linearGradient
       inkscape:collect="always"
       xlink:href="#linearGradient1351-3"
       id="linearGradient1672"
       gradientUnits="userSpaceOnUse"
       gradientTransform="matrix(0.25,0,0,0.25,180,83)"
       x1="344"
       y1="76"
       x2="340"
       y2="72" />
    <linearGradient
       inkscape:collect="always"
       xlink:href="#linearGradient1005"
       id="linearGradient1674"
       gradientUnits="userSpaceOnUse"
       gradientTransform="matrix(0.15612285,-0.1103955,0.15612285,0.11039551,46.966318,104.46916)"
       x1="128.81717"
       y1="-97.698288"
       x2="158.51802"
       y2="-127.39915" />
    <linearGradient
       inkscape:collect="always"
       xlink:href="#linearGradient1696"
       id="linearGradient1676"
       gradientUnits="userSpaceOnUse"
       gradientTransform="translate(-28.666666,-104)"
       x1="115"
       y1="183"
       x2="115"
       y2="174" />
    <linearGradient
       inkscape:collect="always"
       xlink:href="#linearGradient1514"
       id="linearGradient1678"
       gradientUnits="userSpaceOnUse"
       gradientTransform="translate(-29.333333,-104)"
       x1="110"
       y1="182"
       x2="110"
       y2="174" />
    <linearGradient
       inkscape:collect="always"
       xlink:href="#linearGradient1517"
       id="linearGradient1680"
       gradientUnits="userSpaceOnUse"
       x1="32"
       y1="190"
       x2="32"
       y2="174" />
    <linearGradient
       inkscape:collect="always"
       xlink:href="#linearGradient1005"
       id="linearGradient1717"
       gradientUnits="userSpaceOnUse"
       gradientTransform="matrix(0.15612285,-0.1103955,0.15612285,0.11039551,46.966318,104.46916)"
       x1="128.81717"
       y1="-97.698288"
       x2="158.51802"
       y2="-127.39915" />
    <linearGradient
       inkscape:collect="always"
       xlink:href="#linearGradient1686"
       id="linearGradient1719"
       gradientUnits="userSpaceOnUse"
       gradientTransform="matrix(1.5799969,0,0,1,-97.106293,-104)"
       x1="115"
       y1="183"
       x2="115"
       y2="174" />
    <linearGradient
       inkscape:collect="always"
       xlink:href="#linearGradient1514"
       id="linearGradient1721"
       gradientUnits="userSpaceOnUse"
       gradientTransform="translate(-29.333333,-104)"
       x1="110"
       y1="182"
       x2="110"
       y2="174" />
    <linearGradient
       inkscape:collect="always"
       xlink:href="#linearGradient1005"
       id="linearGradient1741"
       gradientUnits="userSpaceOnUse"
       gradientTransform="matrix(0.15612285,-0.1103955,0.15612285,0.11039551,46.966318,104.46916)"
       x1="128.81717"
       y1="-97.698288"
       x2="158.51802"
       y2="-127.39915" />
    <linearGradient
       inkscape:collect="always"
       xlink:href="#linearGradient1686"
       id="linearGradient1743"
       gradientUnits="userSpaceOnUse"
       gradientTransform="matrix(1.5799969,0,0,1,-97.106293,-104)"
       x1="115"
       y1="183"
       x2="115"
       y2="174" />
    <linearGradient
       inkscape:collect="always"
       xlink:href="#linearGradient1514"
       id="linearGradient1745"
       gradientUnits="userSpaceOnUse"
       gradientTransform="translate(-29.333333,-104)"
       x1="110"
       y1="182"
       x2="110"
       y2="174" />
  </defs>
  <sodipodi:namedview
     stroke="#ef2929"
     fill="#f57900"
     id="base"
     pagecolor="#ffffff"
     bordercolor="#666666"
     borderopacity="0.25490196"
     inkscape:pageopacity="0.0"
     inkscape:pageshadow="2"
     inkscape:zoom="3.4569554"
     inkscape:cx="252.89775"
     inkscape:cy="64.337806"
     inkscape:current-layer="layer1"
     showgrid="true"
     inkscape:grid-bbox="true"
     inkscape:document-units="px"
     inkscape:showpageshadow="false"
     inkscape:window-width="1920"
     inkscape:window-height="1016"
     inkscape:window-x="0"
     inkscape:window-y="0"
     width="400px"
     height="300px"
     inkscape:snap-nodes="true"
     inkscape:snap-bbox="true"
     objecttolerance="7"
     gridtolerance="12"
     guidetolerance="13"
     inkscape:window-maximized="1"
     inkscape:pagecheckerboard="false"
     showguides="false"
     inkscape:guide-bbox="true"
     inkscape:locked="false"
     inkscape:measure-start="0,0"
     inkscape:measure-end="0,0"
     inkscape:object-nodes="true"
     inkscape:bbox-nodes="true"
     inkscape:snap-global="true"
     inkscape:object-paths="true"
     inkscape:snap-intersection-paths="true"
     inkscape:snap-bbox-edge-midpoints="true"
     inkscape:snap-bbox-midpoints="true"
     showborder="true"
     inkscape:snap-center="true"
     inkscape:snap-object-midpoints="true"
     inkscape:snap-midpoints="true"
     inkscape:snap-smooth-nodes="true"
     inkscape:snap-text-baseline="true"
     borderlayer="true"
     inkscape:document-rotation="0">
    <inkscape:grid
       type="xygrid"
       id="grid5883"
       spacingx="2"
       spacingy="2"
       enabled="true"
       visible="true"
       empspacing="4"
       originx="8"
       originy="8" />
    <sodipodi:guide
       position="72,16"
       orientation="0,1"
       id="guide1073"
       inkscape:locked="false"
       inkscape:label=""
       inkscape:color="rgb(0,0,255)" />
    <sodipodi:guide
       position="20,72"
       orientation="1,0"
       id="guide1075"
       inkscape:locked="false"
       inkscape:label=""
       inkscape:color="rgb(0,0,255)" />
    <sodipodi:guide
       position="72,112"
       orientation="0,1"
       id="guide1099"
       inkscape:locked="false"
       inkscape:label=""
       inkscape:color="rgb(0,0,255)" />
    <sodipodi:guide
       position="72,136"
       orientation="0,1"
       id="guide993"
       inkscape:locked="false"
       inkscape:label=""
       inkscape:color="rgb(0,0,255)" />
    <sodipodi:guide
       position="112,72"
       orientation="1,0"
       id="guide995"
       inkscape:locked="false"
       inkscape:label=""
       inkscape:color="rgb(0,0,255)" />
    <sodipodi:guide
       position="8.0000001,72"
       orientation="1,0"
       id="guide867"
       inkscape:locked="false"
       inkscape:label=""
       inkscape:color="rgb(0,0,255)" />
    <sodipodi:guide
       position="128,72"
       orientation="1,0"
       id="guide869"
       inkscape:locked="false"
       inkscape:label=""
       inkscape:color="rgb(0,0,255)" />
    <sodipodi:guide
       position="72,124"
       orientation="0,1"
       id="guide871"
       inkscape:locked="false"
       inkscape:label=""
       inkscape:color="rgb(0,0,255)" />
    <inkscape:grid
       type="xygrid"
       id="grid873"
       spacingx="1"
       spacingy="1"
       empspacing="8"
       color="#000000"
       opacity="0.49019608"
       empcolor="#000000"
       empopacity="0.08627451"
       dotted="true"
       originx="8"
       originy="8" />
    <sodipodi:guide
       position="32,72"
       orientation="1,0"
       id="guide877"
       inkscape:locked="false"
       inkscape:label=""
       inkscape:color="rgb(0,0,255)" />
    <sodipodi:guide
       position="124,72"
       orientation="1,0"
       id="guide879"
       inkscape:locked="false"
       inkscape:label=""
       inkscape:color="rgb(0,0,255)" />
    <sodipodi:guide
       position="72,128"
       orientation="0,1"
       id="guide881"
       inkscape:locked="false"
       inkscape:label=""
       inkscape:color="rgb(0,0,255)" />
    <sodipodi:guide
       position="72,20"
       orientation="0,1"
       id="guide883"
       inkscape:locked="false"
       inkscape:label=""
       inkscape:color="rgb(0,0,255)" />
    <sodipodi:guide
       position="16,72"
       orientation="1,0"
       id="guide885"
       inkscape:locked="false"
       inkscape:label=""
       inkscape:color="rgb(0,0,255)" />
    <sodipodi:guide
       position="136,72"
       orientation="1,0"
       id="guide887"
       inkscape:locked="false"
       inkscape:label=""
       inkscape:color="rgb(0,0,255)" />
    <sodipodi:guide
       position="72,8"
       orientation="0,1"
       id="guide897"
       inkscape:locked="false"
       inkscape:label=""
       inkscape:color="rgb(0,0,255)" />
    <sodipodi:guide
       position="72,32"
       orientation="0,1"
       id="guide899"
       inkscape:locked="false"
       inkscape:label=""
       inkscape:color="rgb(0,0,255)" />
    <sodipodi:guide
       position="264,264"
       orientation="-0.70710678,0.70710678"
       id="guide950"
       inkscape:locked="false"
       inkscape:label=""
       inkscape:color="rgb(0,0,255)" />
    <sodipodi:guide
       position="72,72"
       orientation="0.70710678,0.70710678"
       id="guide952"
       inkscape:locked="false"
       inkscape:label=""
       inkscape:color="rgb(0,0,255)" />
  </sodipodi:namedview>
  <metadata
     id="metadata4">
    <rdf:RDF>
      <cc:Work
         rdf:about="">
        <dc:format>image/svg+xml</dc:format>
        <dc:type
           rdf:resource="http://purl.org/dc/dcmitype/StillImage" />
        <dc:creator>
          <cc:Agent>
            <dc:title>GNOME Design Team</dc:title>
          </cc:Agent>
        </dc:creator>
        <dc:source />
        <cc:license
           rdf:resource="http://creativecommons.org/licenses/by-sa/4.0/" />
        <dc:title>Adwaita Icon Template</dc:title>
        <dc:subject>
          <rdf:Bag />
        </dc:subject>
        <dc:date />
        <dc:rights>
          <cc:Agent>
            <dc:title />
          </cc:Agent>
        </dc:rights>
        <dc:publisher>
          <cc:Agent>
            <dc:title />
          </cc:Agent>
        </dc:publisher>
        <dc:identifier />
        <dc:relation />
        <dc:language />
        <dc:coverage />
        <dc:description />
        <dc:contributor>
          <cc:Agent>
            <dc:title />
          </cc:Agent>
        </dc:contributor>
      </cc:Work>
      <cc:License
         rdf:about="http://creativecommons.org/licenses/by-sa/4.0/">
        <cc:permits
           rdf:resource="http://creativecommons.org/ns#Reproduction" />
        <cc:permits
           rdf:resource="http://creativecommons.org/ns#Distribution" />
        <cc:requires
           rdf:resource="http://creativecommons.org/ns#Notice" />
        <cc:requires
           rdf:resource="http://creativecommons.org/ns#Attribution" />
        <cc:permits
           rdf:resource="http://creativecommons.org/ns#DerivativeWorks" />
        <cc:requires
           rdf:resource="http://creativecommons.org/ns#ShareAlike" />
      </cc:License>
    </rdf:RDF>
  </metadata>
  <g
     id="layer1"
     inkscape:label="App Icon"
     inkscape:groupmode="layer"
     style="display:inline"
     transform="translate(8,-156)">
    <g
       inkscape:groupmode="layer"
       id="layer4"
       inkscape:label="template"
       style="display:inline"
       sodipodi:insensitive="true">
      <rect
         inkscape:label="0"
         y="172"
         x="9.2651362e-08"
         height="128"
         width="128"
         id="hicolor"
         style="display:inline;overflow:visible;visibility:visible;fill:#f0f0f0;fill-opacity:0;fill-rule:nonzero;stroke:none;stroke-width:0.5;marker:none;enable-background:accumulate" />
      <rect
         style="display:inline;overflow:visible;visibility:visible;fill:#f0f0f0;fill-opacity:0;fill-rule:nonzero;stroke:none;stroke-width:0.5;marker:none;enable-background:accumulate"
         id="symbolic"
         width="16"
         height="16"
         x="160"
         y="172"
         inkscape:label="0" />
    </g>
    <g
       inkscape:groupmode="layer"
       id="layer2"
       inkscape:label="baseplate"
       style="display:none"
       sodipodi:insensitive="true">
      <g
         style="display:inline;fill:#000000;enable-background:new"
         transform="matrix(7.9911709,0,0,8.0036407,-167.7909,-4846.0776)"
         id="g12027"
         inkscape:export-xdpi="12"
         inkscape:export-ydpi="12" />
      <rect
         style="display:inline;overflow:visible;visibility:visible;fill:#f0f0f0;fill-opacity:1;fill-rule:nonzero;stroke:none;stroke-width:0.5;marker:none;enable-background:accumulate"
         id="128"
         width="128"
         height="128"
         x="9.2651362e-08"
         y="172"
         inkscape:label="0" />
      <g
         id="g883"
         style="fill:none;fill-opacity:0.25098;stroke:#a579b3;stroke-opacity:1"
         transform="translate(-24,24)" />
      <g
         id="g900"
         style="fill:none;fill-opacity:0.25098;stroke:#a579b3;stroke-opacity:1"
         transform="translate(-24,24)" />
      <rect
         inkscape:label=""
         y="172"
         x="160"
         height="16"
         width="16"
         id="16"
         style="display:inline;overflow:visible;visibility:visible;fill:#f0f0f0;fill-opacity:1;fill-rule:nonzero;stroke:none;stroke-width:0.5;marker:none;enable-background:accumulate" />
      <text
         xml:space="preserve"
         style="font-style:normal;font-variant:normal;font-weight:bold;font-stretch:normal;font-size:4px;line-height:125%;font-family:Cantarell;-inkscape-font-specification:'Cantarell, Bold';text-align:start;writing-mode:lr-tb;text-anchor:start;display:inline;fill:#000000;fill-opacity:1;stroke:none;stroke-width:0.332649;enable-background:new"
         x="0"
         y="167"
         id="text863"
         inkscape:label="icon-name"><tspan
           style="font-size:4px;stroke-width:0.332649"
           sodipodi:role="line"
           id="tspan861"
           x="0"
           y="167">Hicolor</tspan></text>
      <text
         inkscape:label="icon-name"
         id="text867"
         y="167"
         x="160"
         style="font-style:normal;font-variant:normal;font-weight:bold;font-stretch:normal;font-size:4px;line-height:125%;font-family:Cantarell;-inkscape-font-specification:'Cantarell, Bold';text-align:start;writing-mode:lr-tb;text-anchor:start;display:inline;fill:#000000;fill-opacity:1;stroke:none;stroke-width:0.332649;enable-background:new"
         xml:space="preserve"><tspan
           y="167"
           x="160"
           id="tspan865"
           sodipodi:role="line"
           style="font-size:4px;stroke-width:0.332649">Symbolic</tspan></text>
    </g>
    <g
       inkscape:groupmode="layer"
       id="layer9"
       inkscape:label="icons"
       style="display:inline">
      <g
         transform="matrix(0.3,0,0,-0.21279762,-8.8,247.3631)"
         style="display:inline;fill:url(#linearGradient1639);fill-opacity:1;stroke-width:1.02986;enable-background:new"
         clip-path="none"
         id="g1577">
        <rect
           transform="scale(-1,1)"
           clip-path="none"
           ry="37.594406"
           rx="26.666666"
           y="-190.965"
           x="-429.33331"
           height="150.37761"
           width="373.33334"
           id="rect1571"
           style="opacity:1;vector-effect:none;fill:#c64600;fill-opacity:1;stroke:none;stroke-width:53.7395;stroke-linecap:butt;stroke-linejoin:miter;stroke-miterlimit:4;stroke-dasharray:none;stroke-dashoffset:0;stroke-opacity:1;marker:none;marker-start:none;marker-mid:none;marker-end:none;paint-order:normal" />
        <rect
           style="opacity:1;vector-effect:none;fill:url(#linearGradient1426);fill-opacity:1.0;stroke:none;stroke-width:53.7395;stroke-linecap:butt;stroke-linejoin:miter;stroke-miterlimit:4;stroke-dasharray:none;stroke-dashoffset:0;stroke-opacity:1;marker:none;marker-start:none;marker-mid:none;marker-end:none;paint-order:normal"
           id="rect1573"
           width="373.33334"
           height="253.76224"
           x="-429.33331"
           y="-181.56641"
           rx="26.666666"
           ry="37.594406"
           clip-path="none"
           transform="scale(-1,1)" />
        <rect
           style="opacity:1;vector-effect:none;fill:#f6f5f4;fill-opacity:1;stroke:none;stroke-width:53.7395;stroke-linecap:butt;stroke-linejoin:miter;stroke-miterlimit:4;stroke-dasharray:none;stroke-dashoffset:0;stroke-opacity:1;marker:none;marker-start:none;marker-mid:none;marker-end:none;paint-order:normal"
           id="rect1575"
           width="373.33334"
           height="375.94406"
           x="-429.33331"
           y="-153.37062"
           rx="26.666666"
           ry="37.594402"
           clip-path="none"
           transform="scale(-1,1)" />
      </g>
      <g
         id="g1384"
         style="display:inline;enable-background:new;stroke:#c0bfbc">
        <g
           id="g1418"
           style="stroke:#c0bfbc">
          <path
             inkscape:connector-curvature="0"
             id="path1274-3"
             d="M 110,250 H 18.000005 V 220 H 110 Z"
             style="display:inline;opacity:1;fill:none;fill-rule:evenodd;stroke:#c0bfbc;stroke-width:4.00001;stroke-linecap:butt;stroke-linejoin:miter;stroke-miterlimit:4;stroke-dasharray:none;stroke-opacity:1;enable-background:new"
             sodipodi:nodetypes="ccccc" />
          <path
             style="fill:none;stroke:#c0bfbc;stroke-width:4;stroke-linecap:butt;stroke-linejoin:miter;stroke-opacity:1"
             d="m 18,270 h 92 v -15 -5 H 18 Z"
             id="path1355"
             inkscape:connector-curvature="0"
             sodipodi:nodetypes="cccccc" />
          <path
             style="fill:none;stroke:#c0bfbc;stroke-width:4;stroke-linecap:butt;stroke-linejoin:miter;stroke-opacity:1"
             d="m 64,248 v 22"
             id="path1357"
             inkscape:connector-curvature="0"
             sodipodi:nodetypes="cc" />
          <path
             sodipodi:nodetypes="cc"
             inkscape:connector-curvature="0"
             id="path1374"
             d="m 41,220 v 28"
             style="fill:none;stroke:#c0bfbc;stroke-width:4;stroke-linecap:butt;stroke-linejoin:miter;stroke-opacity:1" />
          <path
             style="fill:none;stroke:#c0bfbc;stroke-width:4;stroke-linecap:butt;stroke-linejoin:miter;stroke-opacity:1"
             d="m 87,220 v 28"
             id="path1376"
             inkscape:connector-curvature="0"
             sodipodi:nodetypes="cc" />
          <path
             style="fill:none;stroke:#c0bfbc;stroke-width:4;stroke-linecap:butt;stroke-linejoin:miter;stroke-opacity:1"
             d="m 64,220 v 28"
             id="path1398"
             inkscape:connector-curvature="0"
             sodipodi:nodetypes="cc" />
        </g>
      </g>
    </g>
    <g
       inkscape:groupmode="layer"
       id="layer3"
       inkscape:label="grid"
       style="display:none"
       sodipodi:insensitive="true">
      <circle
         cx="64.000031"
         cy="236"
         r="59.504131"
         id="circle2892"
         style="display:inline;opacity:0.1;vector-effect:none;fill:none;fill-opacity:1;stroke:#000000;stroke-width:0.99;stroke-linecap:butt;stroke-linejoin:miter;stroke-miterlimit:4;stroke-dasharray:0.99, 0.99;stroke-dashoffset:0;stroke-opacity:1;marker:none;marker-start:none;marker-mid:none;marker-end:none;paint-order:normal;enable-background:new" />
      <rect
         ry="7.9292889"
         rx="8.701004"
         y="180.49496"
         x="20.495007"
         height="111.01005"
         width="87.009987"
         id="rect2894"
         style="display:inline;opacity:0.1;vector-effect:none;fill:none;fill-opacity:1;stroke:#000000;stroke-width:0.99;stroke-linecap:butt;stroke-linejoin:miter;stroke-miterlimit:4;stroke-dasharray:0.99, 0.99;stroke-dashoffset:0;stroke-opacity:1;marker:none;marker-start:none;marker-mid:none;marker-end:none;paint-order:normal;enable-background:new" />
      <rect
         ry="7.9238095"
         rx="7.9238095"
         y="184.49524"
         x="12.495266"
         height="103.00952"
         width="103.00952"
         id="rect2896"
         style="display:inline;opacity:0.1;vector-effect:none;fill:none;fill-opacity:1;stroke:#000000;stroke-width:0.99;stroke-linecap:butt;stroke-linejoin:miter;stroke-miterlimit:4;stroke-dasharray:0.99, 0.99;stroke-dashoffset:0;stroke-opacity:1;marker:none;marker-start:none;marker-mid:none;marker-end:none;paint-order:normal;enable-background:new" />
      <rect
         ry="8.701005"
         rx="7.9292889"
         y="200.49496"
         x="8.4950066"
         height="87.010048"
         width="111.01004"
         id="rect2898"
         style="display:inline;opacity:0.1;vector-effect:none;fill:none;fill-opacity:1;stroke:#000000;stroke-width:0.99;stroke-linecap:butt;stroke-linejoin:miter;stroke-miterlimit:4;stroke-dasharray:0.99, 0.99;stroke-dashoffset:0;stroke-opacity:1;marker:none;marker-start:none;marker-mid:none;marker-end:none;paint-order:normal;enable-background:new" />
      <path
         inkscape:connector-curvature="0"
         id="path2900"
         d="M 2.6203015e-5,288.99999 H 128.00003"
         style="display:inline;fill:none;stroke:#62a0ea;stroke-width:2;stroke-linecap:butt;stroke-linejoin:miter;stroke-miterlimit:4;stroke-dasharray:none;stroke-opacity:1;enable-background:new" />
    </g>
    <g
       transform="matrix(1.0606602,-1.0606602,1.0606602,1.0606602,-52.199528,228.20063)"
       id="g1739"
       style="display:inline;enable-background:new">
      <path
         sodipodi:nodetypes="ccccc"
         inkscape:connector-curvature="0"
         id="path1723"
         d="m 48.000002,77 v -6 l 4,-3 v 12 z"
         style="display:inline;opacity:1;vector-effect:none;fill:url(#linearGradient1741);fill-opacity:1;stroke:none;stroke-width:12.4898;stroke-linecap:round;stroke-linejoin:miter;stroke-miterlimit:4;stroke-dasharray:none;stroke-dashoffset:0;stroke-opacity:1;marker:none;marker-start:none;marker-mid:none;marker-end:none;paint-order:normal;enable-background:new" />
      <rect
         style="opacity:1;fill:url(#linearGradient1743);fill-opacity:1;stroke:none;stroke-width:7.55906;stroke-linecap:round;stroke-linejoin:miter;stroke-miterlimit:4;stroke-dasharray:none;stroke-dashoffset:4;stroke-opacity:1"
         id="rect1725"
         width="12.639976"
         height="12"
         x="76.693359"
         y="68"
         rx="4"
         ry="4" />
      <path
         sodipodi:nodetypes="cccc"
         inkscape:connector-curvature="0"
         id="path1727"
         d="m 44,74 4.000002,-3 v 6 z"
         style="display:inline;opacity:1;vector-effect:none;fill:#424048;fill-opacity:1;stroke:none;stroke-width:12.4898;stroke-linecap:round;stroke-linejoin:miter;stroke-miterlimit:4;stroke-dasharray:none;stroke-dashoffset:0;stroke-opacity:1;marker:none;marker-start:none;marker-mid:none;marker-end:none;paint-order:normal;enable-background:new" />
      <g
         style="stroke-width:1.27808"
         transform="matrix(0.38869256,0,0,1,38.00707,0)"
         id="g1735">
        <path
           style="display:inline;fill:#ff7800;fill-opacity:1;stroke:none;stroke-width:0.647266px;stroke-linecap:butt;stroke-linejoin:miter;stroke-opacity:1;enable-background:new"
           d="m 36,78.4 v -8.8 h 71.95756 v 8.8 z"
           id="path1729"
           inkscape:connector-curvature="0"
           sodipodi:nodetypes="ccccc" />
        <path
           style="display:inline;opacity:1;fill:#ffa348;fill-opacity:1;stroke:none;stroke-width:0.457687px;stroke-linecap:butt;stroke-linejoin:miter;stroke-opacity:1;enable-background:new"
           d="m 36,72 v -4 l 72,1e-5 L 107.9576,72 Z"
           id="path1731"
           inkscape:connector-curvature="0"
           sodipodi:nodetypes="ccccc" />
        <path
           style="display:inline;opacity:1;fill:#c64600;fill-opacity:1;stroke:none;stroke-width:0.457687px;stroke-linecap:butt;stroke-linejoin:miter;stroke-opacity:1;enable-background:new"
           d="m 36,76 v 4 h 72 l -0.0424,-4 z"
           id="path1733"
           inkscape:connector-curvature="0"
           sodipodi:nodetypes="ccccc" />
      </g>
      <rect
         style="opacity:1;fill:url(#linearGradient1745);fill-opacity:1;stroke:none;stroke-width:7.55906;stroke-linecap:round;stroke-linejoin:miter;stroke-miterlimit:4;stroke-dasharray:none;stroke-dashoffset:4;stroke-opacity:1"
         id="rect1737"
         width="4"
         height="12"
         x="78.666664"
         y="68" />
    </g>
    <g
       id="g1534">
      <g
         id="g679"
         transform="translate(-8,22)"
         style="display:inline;fill:#3d3846;stroke:#5e5c64;stroke-width:2;stroke-opacity:1;enable-background:new">
        <circle
           r="3"
           cy="187"
           cx="32"
           id="path632"
           style="opacity:1;fill:#3d3846;fill-opacity:1;stroke:#5e5c64;stroke-width:2;stroke-opacity:1" />
        <circle
           style="opacity:1;fill:#3d3846;fill-opacity:1;stroke:#5e5c64;stroke-width:2;stroke-opacity:1"
           id="circle634"
           cx="95.999992"
           cy="187"
           r="3" />
        <circle
           r="3"
           cy="187"
           cx="48"
           id="circle636"
           style="opacity:1;fill:#3d3846;fill-opacity:1;stroke:#5e5c64;stroke-width:2;stroke-opacity:1" />
        <circle
           r="3"
           cy="187"
           cx="64"
           id="circle642"
           style="opacity:1;fill:#3d3846;fill-opacity:1;stroke:#5e5c64;stroke-width:2;stroke-opacity:1" />
        <circle
           style="opacity:1;fill:#3d3846;fill-opacity:1;stroke:#5e5c64;stroke-width:2;stroke-opacity:1"
           id="circle646"
           cx="80"
           cy="187"
           r="3" />
        <circle
           r="3"
           cy="187"
           cx="111.99999"
           id="circle2001"
           style="opacity:1;fill:#3d3846;fill-opacity:1;stroke:#5e5c64;stroke-width:2;stroke-opacity:1" />
      </g>
      <g
         transform="translate(-8,19)"
         style="display:inline;enable-background:new"
         id="g1758">
        <path
           sodipodi:nodetypes="cc"
           inkscape:connector-curvature="0"
           id="path1043"
           d="M 32,190 V 174"
           style="fill:none;stroke:url(#linearGradient1440);stroke-width:4;stroke-linecap:round;stroke-linejoin:miter;stroke-miterlimit:4;stroke-dasharray:none;stroke-opacity:1" />
        <use
           height="100%"
           width="100%"
           transform="translate(16)"
           id="use1465"
           xlink:href="#path1043"
           y="0"
           x="0" />
        <use
           x="0"
           y="0"
           xlink:href="#path1043"
           id="use1467"
           transform="translate(32)"
           width="100%"
           height="100%" />
        <use
           height="100%"
           width="100%"
           transform="translate(48)"
           id="use1469"
           xlink:href="#path1043"
           y="0"
           x="0" />
        <use
           x="0"
           y="0"
           xlink:href="#path1043"
           id="use1471"
           transform="translate(64)"
           width="100%"
           height="100%" />
        <use
           height="100%"
           width="100%"
           transform="translate(80)"
           id="use2003"
           xlink:href="#path1043"
           y="0"
           x="0" />
      </g>
    </g>
    <g
       id="g1666"
       transform="translate(-330)">
      <g
         transform="matrix(0.3,0,0,-0.21279762,-8.8,247.3631)"
         style="display:inline;fill:url(#linearGradient1670);fill-opacity:1;stroke-width:1.02986;enable-background:new"
         clip-path="none"
         id="g1542">
        <rect
           transform="scale(-1,1)"
           clip-path="none"
           ry="37.594406"
           rx="26.666666"
           y="-190.965"
           x="-429.33331"
           height="150.37761"
           width="373.33334"
           id="rect1536"
           style="opacity:1;vector-effect:none;fill:#c64600;fill-opacity:1;stroke:none;stroke-width:53.7395;stroke-linecap:butt;stroke-linejoin:miter;stroke-miterlimit:4;stroke-dasharray:none;stroke-dashoffset:0;stroke-opacity:1;marker:none;marker-start:none;marker-mid:none;marker-end:none;paint-order:normal" />
        <rect
           style="opacity:1;vector-effect:none;fill:url(#linearGradient1668);fill-opacity:1;stroke:none;stroke-width:53.7395;stroke-linecap:butt;stroke-linejoin:miter;stroke-miterlimit:4;stroke-dasharray:none;stroke-dashoffset:0;stroke-opacity:1;marker:none;marker-start:none;marker-mid:none;marker-end:none;paint-order:normal"
           id="rect1538"
           width="373.33334"
           height="253.76224"
           x="-429.33331"
           y="-181.56641"
           rx="26.666666"
           ry="37.594406"
           clip-path="none"
           transform="scale(-1,1)" />
        <rect
           style="opacity:1;vector-effect:none;fill:#f6f5f4;fill-opacity:1;stroke:none;stroke-width:53.7395;stroke-linecap:butt;stroke-linejoin:miter;stroke-miterlimit:4;stroke-dasharray:none;stroke-dashoffset:0;stroke-opacity:1;marker:none;marker-start:none;marker-mid:none;marker-end:none;paint-order:normal"
           id="rect1540"
           width="373.33334"
           height="375.94406"
           x="-429.33331"
           y="-153.37062"
           rx="26.666666"
           ry="37.594402"
           clip-path="none"
           transform="scale(-1,1)" />
      </g>
      <g
         id="g1561"
         style="display:inline;stroke:#c0bfbc;enable-background:new">
        <g
           id="g1559"
           style="stroke:#c0bfbc">
          <path
             inkscape:connector-curvature="0"
             id="path1545"
             d="M 110,250 H 18.000005 V 220 H 110 Z"
             style="display:inline;opacity:1;fill:none;fill-rule:evenodd;stroke:#c0bfbc;stroke-width:4.00001;stroke-linecap:butt;stroke-linejoin:miter;stroke-miterlimit:4;stroke-dasharray:none;stroke-opacity:1;enable-background:new"
             sodipodi:nodetypes="ccccc" />
          <path
             style="fill:none;stroke:#c0bfbc;stroke-width:4;stroke-linecap:butt;stroke-linejoin:miter;stroke-opacity:1"
             d="m 18,270 h 78 l 14,-15 v -5 H 18 Z"
             id="path1547"
             inkscape:connector-curvature="0"
             sodipodi:nodetypes="cccccc" />
          <path
             style="fill:none;stroke:#c0bfbc;stroke-width:4;stroke-linecap:butt;stroke-linejoin:miter;stroke-opacity:1"
             d="m 64,248 v 22"
             id="path1550"
             inkscape:connector-curvature="0"
             sodipodi:nodetypes="cc" />
          <path
             sodipodi:nodetypes="cc"
             inkscape:connector-curvature="0"
             id="path1553"
             d="m 41,220 v 28"
             style="fill:none;stroke:#c0bfbc;stroke-width:4;stroke-linecap:butt;stroke-linejoin:miter;stroke-opacity:1" />
          <path
             style="fill:none;stroke:#c0bfbc;stroke-width:4;stroke-linecap:butt;stroke-linejoin:miter;stroke-opacity:1"
             d="m 87,220 v 28"
             id="path1555"
             inkscape:connector-curvature="0"
             sodipodi:nodetypes="cc" />
          <path
             style="fill:none;stroke:#c0bfbc;stroke-width:4;stroke-linecap:butt;stroke-linejoin:miter;stroke-opacity:1"
             d="m 64,220 v 28"
             id="path1557"
             inkscape:connector-curvature="0"
             sodipodi:nodetypes="cc" />
        </g>
      </g>
      <rect
         clip-path="url(#clipPath1609)"
         transform="matrix(0,1,1,0,4,0)"
         ry="8"
         rx="8"
         y="88"
         x="252"
         height="36"
         width="36"
         id="rect1563"
         style="display:inline;fill:url(#linearGradient1672);fill-opacity:1;stroke:none;stroke-width:0.5;stroke-linecap:butt;stroke-linejoin:miter;stroke-miterlimit:4;stroke-dasharray:none;stroke-dashoffset:0;stroke-opacity:1;marker:none;marker-start:none;marker-mid:none;marker-end:none;paint-order:normal;enable-background:new" />
      <g
         transform="matrix(1.0606602,-1.0606602,1.0606602,1.0606602,-52.199528,228.20063)"
         id="g1583"
         style="display:inline;enable-background:new">
        <path
           sodipodi:nodetypes="ccccc"
           inkscape:connector-curvature="0"
           id="path1567"
           d="m 48.000002,77 v -6 l 4,-3 v 12 z"
           style="display:inline;opacity:1;vector-effect:none;fill:url(#linearGradient1674);fill-opacity:1;stroke:none;stroke-width:12.4898;stroke-linecap:round;stroke-linejoin:miter;stroke-miterlimit:4;stroke-dasharray:none;stroke-dashoffset:0;stroke-opacity:1;marker:none;marker-start:none;marker-mid:none;marker-end:none;paint-order:normal;enable-background:new" />
        <rect
           style="opacity:1;fill:url(#linearGradient1676);fill-opacity:1;stroke:none;stroke-width:7.55906;stroke-linecap:round;stroke-linejoin:miter;stroke-miterlimit:4;stroke-dasharray:none;stroke-dashoffset:4;stroke-opacity:1"
           id="rect1569"
           width="8"
           height="12"
           x="81.333328"
           y="68"
           ry="2"
           rx="2" />
        <path
           sodipodi:nodetypes="cccc"
           inkscape:connector-curvature="0"
           id="path1571"
           d="m 44,74 4.000002,-3 v 6 z"
           style="display:inline;opacity:1;vector-effect:none;fill:#424048;fill-opacity:1;stroke:none;stroke-width:12.4898;stroke-linecap:round;stroke-linejoin:miter;stroke-miterlimit:4;stroke-dasharray:none;stroke-dashoffset:0;stroke-opacity:1;marker:none;marker-start:none;marker-mid:none;marker-end:none;paint-order:normal;enable-background:new" />
        <g
           style="stroke-width:1.27808"
           transform="matrix(0.38869256,0,0,1,38.00707,0)"
           id="g1579">
          <path
             style="display:inline;fill:#ff7800;fill-opacity:1;stroke:none;stroke-width:0.647266px;stroke-linecap:butt;stroke-linejoin:miter;stroke-opacity:1;enable-background:new"
             d="m 36,78.4 v -8.8 h 71.95756 v 8.8 z"
             id="path1573"
             inkscape:connector-curvature="0"
             sodipodi:nodetypes="ccccc" />
          <path
             style="display:inline;opacity:1;fill:#ffa348;fill-opacity:1;stroke:none;stroke-width:0.457687px;stroke-linecap:butt;stroke-linejoin:miter;stroke-opacity:1;enable-background:new"
             d="m 36,72 v -4 l 72,1e-5 L 107.9576,72 Z"
             id="path1575"
             inkscape:connector-curvature="0"
             sodipodi:nodetypes="ccccc" />
          <path
             style="display:inline;opacity:1;fill:#c64600;fill-opacity:1;stroke:none;stroke-width:0.457687px;stroke-linecap:butt;stroke-linejoin:miter;stroke-opacity:1;enable-background:new"
             d="m 36,76 v 4 h 72 l -0.0424,-4 z"
             id="path1577"
             inkscape:connector-curvature="0"
             sodipodi:nodetypes="ccccc" />
        </g>
        <rect
           style="opacity:1;fill:url(#linearGradient1678);fill-opacity:1;stroke:none;stroke-width:7.55906;stroke-linecap:round;stroke-linejoin:miter;stroke-miterlimit:4;stroke-dasharray:none;stroke-dashoffset:4;stroke-opacity:1"
           id="rect1581"
           width="4"
           height="12"
           x="78.666664"
           y="68" />
      </g>
      <g
         id="g1613">
        <g
           id="g1597"
           transform="translate(-8,22)"
           style="display:inline;fill:#3d3846;stroke:#5e5c64;stroke-width:2;stroke-opacity:1;enable-background:new">
          <circle
             r="3"
             cy="187"
             cx="32"
             id="circle1585"
             style="opacity:1;fill:#3d3846;fill-opacity:1;stroke:#5e5c64;stroke-width:2;stroke-opacity:1" />
          <circle
             style="opacity:1;fill:#3d3846;fill-opacity:1;stroke:#5e5c64;stroke-width:2;stroke-opacity:1"
             id="circle1587"
             cx="95.999992"
             cy="187"
             r="3" />
          <circle
             r="3"
             cy="187"
             cx="48"
             id="circle1589"
             style="opacity:1;fill:#3d3846;fill-opacity:1;stroke:#5e5c64;stroke-width:2;stroke-opacity:1" />
          <circle
             r="3"
             cy="187"
             cx="64"
             id="circle1591"
             style="opacity:1;fill:#3d3846;fill-opacity:1;stroke:#5e5c64;stroke-width:2;stroke-opacity:1" />
          <circle
             style="opacity:1;fill:#3d3846;fill-opacity:1;stroke:#5e5c64;stroke-width:2;stroke-opacity:1"
             id="circle1593"
             cx="80"
             cy="187"
             r="3" />
          <circle
             r="3"
             cy="187"
             cx="111.99999"
             id="circle1595"
             style="opacity:1;fill:#3d3846;fill-opacity:1;stroke:#5e5c64;stroke-width:2;stroke-opacity:1" />
        </g>
        <g
           transform="translate(-8,19)"
           style="display:inline;enable-background:new"
           id="g1611">
          <path
             sodipodi:nodetypes="cc"
             inkscape:connector-curvature="0"
             id="path1599"
             d="M 32,190 V 174"
             style="fill:none;stroke:url(#linearGradient1680);stroke-width:4;stroke-linecap:round;stroke-linejoin:miter;stroke-miterlimit:4;stroke-dasharray:none;stroke-opacity:1" />
          <use
             height="100%"
             width="100%"
             transform="translate(16)"
             id="use1601"
             xlink:href="#path1043"
             y="0"
             x="0" />
          <use
             x="0"
             y="0"
             xlink:href="#path1043"
             id="use1603"
             transform="translate(32)"
             width="100%"
             height="100%" />
          <use
             height="100%"
             width="100%"
             transform="translate(48)"
             id="use1605"
             xlink:href="#path1043"
             y="0"
             x="0" />
          <use
             x="0"
             y="0"
             xlink:href="#path1043"
             id="use1607"
             transform="translate(64)"
             width="100%"
             height="100%" />
          <use
             height="100%"
             width="100%"
             transform="translate(80)"
             id="use1609"
             xlink:href="#path1043"
             y="0"
             x="0" />
        </g>
      </g>
    </g>
    <g
       style="display:inline;enable-background:new"
       id="g1715"
       transform="matrix(1.0606602,-1.0606602,1.0606602,1.0606602,70.362498,229.26186)">
      <path
         style="display:inline;opacity:1;vector-effect:none;fill:url(#linearGradient1717);fill-opacity:1;stroke:none;stroke-width:12.4898;stroke-linecap:round;stroke-linejoin:miter;stroke-miterlimit:4;stroke-dasharray:none;stroke-dashoffset:0;stroke-opacity:1;marker:none;marker-start:none;marker-mid:none;marker-end:none;paint-order:normal;enable-background:new"
         d="m 48.000002,77 v -6 l 4,-3 v 12 z"
         id="path1696"
         inkscape:connector-curvature="0"
         sodipodi:nodetypes="ccccc" />
      <rect
         ry="4"
         rx="4"
         y="68"
         x="76.693359"
         height="12"
         width="12.639976"
         id="rect1698"
         style="opacity:1;fill:url(#linearGradient1719);fill-opacity:1;stroke:none;stroke-width:7.55906;stroke-linecap:round;stroke-linejoin:miter;stroke-miterlimit:4;stroke-dasharray:none;stroke-dashoffset:4;stroke-opacity:1" />
      <path
         style="display:inline;opacity:1;vector-effect:none;fill:#424048;fill-opacity:1;stroke:none;stroke-width:12.4898;stroke-linecap:round;stroke-linejoin:miter;stroke-miterlimit:4;stroke-dasharray:none;stroke-dashoffset:0;stroke-opacity:1;marker:none;marker-start:none;marker-mid:none;marker-end:none;paint-order:normal;enable-background:new"
         d="m 44,74 4.000002,-3 v 6 z"
         id="path1700"
         inkscape:connector-curvature="0"
         sodipodi:nodetypes="cccc" />
      <g
         id="g1711"
         transform="matrix(0.38869256,0,0,1,38.00707,0)"
         style="stroke-width:1.27808">
        <path
           sodipodi:nodetypes="ccccc"
           inkscape:connector-curvature="0"
           id="path1705"
           d="m 36,78.4 v -8.8 h 71.95756 v 8.8 z"
           style="display:inline;fill:#ff7800;fill-opacity:1;stroke:none;stroke-width:0.647266px;stroke-linecap:butt;stroke-linejoin:miter;stroke-opacity:1;enable-background:new" />
        <path
           sodipodi:nodetypes="ccccc"
           inkscape:connector-curvature="0"
           id="path1707"
           d="m 36,72 v -4 l 72,1e-5 L 107.9576,72 Z"
           style="display:inline;opacity:1;fill:#ffa348;fill-opacity:1;stroke:none;stroke-width:0.457687px;stroke-linecap:butt;stroke-linejoin:miter;stroke-opacity:1;enable-background:new" />
        <path
           sodipodi:nodetypes="ccccc"
           inkscape:connector-curvature="0"
           id="path1709"
           d="m 36,76 v 4 h 72 l -0.0424,-4 z"
           style="display:inline;opacity:1;fill:#c64600;fill-opacity:1;stroke:none;stroke-width:0.457687px;stroke-linecap:butt;stroke-linejoin:miter;stroke-opacity:1;enable-background:new" />
      </g>
      <rect
         y="68"
         x="78.666664"
         height="12"
         width="4"
         id="rect1713"
         style="opacity:1;fill:url(#linearGradient1721);fill-opacity:1;stroke:none;stroke-width:7.55906;stroke-linecap:round;stroke-linejoin:miter;stroke-miterlimit:4;stroke-dasharray:none;stroke-dashoffset:4;stroke-opacity:1" />
    </g>
    <path
       sodipodi:nodetypes="sssccscccccccs"
       inkscape:connector-curvature="0"
       transform="translate(-8,156)"
       d="m 170,19 c -1.108,0 -2,0.892 -2,2 v 7 c 0,1.108 0.892,2 2,2 h 12 c 1.108,0 2,-0.892 2,-2 v -3.585938 l -2,2 V 28 h -12 v -7 h 1 v -2 z"
       style="opacity:1;fill:#241f31;fill-opacity:1;stroke:none;stroke-width:9.31653;stroke-linecap:round;stroke-linejoin:round;stroke-opacity:0"
       id="rect1889" />
    <rect
       ry="1.9999999"
       rx="2"
       y="175"
       x="330"
       height="11"
       width="16"
       id="rect1899"
       style="opacity:1;fill:#241f31;fill-opacity:1;stroke:none;stroke-width:9.31653;stroke-linecap:round;stroke-linejoin:round;stroke-opacity:0" />
    <rect
       style="opacity:1;fill:#f0f0f0;fill-opacity:1;stroke:none;stroke-width:9.31653;stroke-linecap:round;stroke-linejoin:round;stroke-opacity:0"
       id="rect1901"
       width="12"
       height="7"
       x="332"
       y="177" />
    <rect
       y="180"
       x="331"
       height="1"
       width="14"
       id="rect1903"
       style="opacity:1;fill:#241f31;fill-opacity:1;stroke:none;stroke-width:9.31652;stroke-linecap:round;stroke-linejoin:round;stroke-opacity:0" />
    <rect
       style="opacity:1;fill:#241f31;fill-opacity:1;stroke:none;stroke-width:9.31651;stroke-linecap:round;stroke-linejoin:round;stroke-opacity:0"
       id="rect1905"
       width="1"
       height="4"
       x="335"
       y="177" />
    <rect
       y="177"
       x="340"
       height="4"
       width="1"
       id="rect1907"
       style="opacity:1;fill:#241f31;fill-opacity:1;stroke:none;stroke-width:9.31651;stroke-linecap:round;stroke-linejoin:round;stroke-opacity:0" />
    <rect
       style="opacity:1;fill:#241f31;fill-opacity:1;stroke:none;stroke-width:9.31653;stroke-linecap:round;stroke-linejoin:round;stroke-opacity:0"
       id="rect1912"
       width="1.9999993"
       height="4"
       x="313"
       y="162"
       rx="0.99999964"
       ry="0.99999964" />
    <rect
       ry="1"
       rx="1"
       y="162"
       x="321"
       height="4"
       width="2"
       id="rect1918"
       style="opacity:1;fill:#241f31;fill-opacity:1;stroke:none;stroke-width:9.31653;stroke-linecap:round;stroke-linejoin:round;stroke-opacity:0" />
    <path
       d="m 312,175 c -1.108,0 -2,0.892 -2,2 v 7 c 0,1.108 0.892,2 2,2 h 12 c 1.108,0 2,-0.892 2,-2 v -7 c 0,-1.108 -0.892,-2 -2,-2 z m 0,2 h 12 v 7 h -12 z"
       style="opacity:1;fill:#241f31;fill-opacity:1;stroke:none;stroke-width:9.31653;stroke-linecap:round;stroke-linejoin:round;stroke-opacity:0"
       id="path1920"
       inkscape:connector-curvature="0" />
    <rect
       y="180"
       x="311"
       height="1"
       width="14"
       id="rect1922"
       style="opacity:1;fill:#241f31;fill-opacity:1;stroke:none;stroke-width:9.31652;stroke-linecap:round;stroke-linejoin:round;stroke-opacity:0" />
    <rect
       style="opacity:1;fill:#241f31;fill-opacity:1;stroke:none;stroke-width:9.31651;stroke-linecap:round;stroke-linejoin:round;stroke-opacity:0"
       id="rect1924"
       width="1"
       height="4"
       x="315"
       y="177" />
    <rect
       y="177"
       x="320"
       height="4"
       width="1"
       id="rect1926"
       style="opacity:1;fill:#241f31;fill-opacity:1;stroke:none;stroke-width:9.31651;stroke-linecap:round;stroke-linejoin:round;stroke-opacity:0" />
    <rect
       ry="0.6019749"
       rx="0.6019749"
       y="173"
       x="313"
       height="3"
       width="1.2039498"
       id="rect1928"
       style="opacity:1;fill:#241f31;fill-opacity:1;stroke:none;stroke-width:9.31653;stroke-linecap:round;stroke-linejoin:round;stroke-opacity:0" />
    <rect
       style="opacity:1;fill:#241f31;fill-opacity:1;stroke:none;stroke-width:9.31653;stroke-linecap:round;stroke-linejoin:round;stroke-opacity:0"
       id="rect1930"
       width="1.2039498"
       height="3"
       x="316"
       y="173"
       rx="0.6019749"
       ry="0.6019749" />
    <rect
       ry="0.6019749"
       rx="0.6019749"
       y="173"
       x="319"
       height="3"
       width="1.2039498"
       id="rect1932"
       style="opacity:1;fill:#241f31;fill-opacity:1;stroke:none;stroke-width:9.31653;stroke-linecap:round;stroke-linejoin:round;stroke-opacity:0" />
    <rect
       style="opacity:1;fill:#241f31;fill-opacity:1;stroke:none;stroke-width:9.31653;stroke-linecap:round;stroke-linejoin:round;stroke-opacity:0"
       id="rect1934"
       width="1.2039498"
       height="3"
       x="322"
       y="173"
       rx="0.6019749"
       ry="0.6019749" />
    <path
       inkscape:connector-curvature="0"
       d="m 362,175 c -1.108,0 -2,0.892 -2,2 v 7 c 0,1.108 0.892,2 2,2 h 12 c 1.108,0 2,-0.892 2,-2 v -7 c 0,-1.108 -0.892,-2 -2,-2 z m 0,2 h 12 v 7 h -12 z"
       style="opacity:1;fill:#241f31;fill-opacity:1;stroke:none;stroke-width:9.31653;stroke-linecap:round;stroke-linejoin:round;stroke-opacity:0"
       id="path1044" />
    <rect
       y="180"
       x="361"
       height="1"
       width="14"
       id="rect1046"
       style="opacity:1;fill:#241f31;fill-opacity:1;stroke:none;stroke-width:9.31652;stroke-linecap:round;stroke-linejoin:round;stroke-opacity:0" />
    <rect
       style="opacity:1;fill:#241f31;fill-opacity:1;stroke:none;stroke-width:9.31651;stroke-linecap:round;stroke-linejoin:round;stroke-opacity:0"
       id="rect1048"
       width="1"
       height="4"
       x="365"
       y="177" />
    <rect
       y="177"
       x="370"
       height="4"
       width="1"
       id="rect1050"
       style="opacity:1;fill:#241f31;fill-opacity:1;stroke:none;stroke-width:9.31651;stroke-linecap:round;stroke-linejoin:round;stroke-opacity:0" />
    <rect
       ry="1"
       rx="1"
       y="173"
       x="170"
       height="4"
       width="2"
       id="rect1058"
       style="opacity:1;fill:#241f31;fill-opacity:1;stroke:none;stroke-width:9.3165;stroke-linecap:round;stroke-linejoin:round;stroke-opacity:0" />
    <g
       transform="translate(20)"
       style="opacity:1"
       id="g1124">
      <path
         inkscape:connector-curvature="0"
         id="path1126"
         d="m 200,185.00035 7,-7 -3,-3 -7,7.00068 v 2.99862 z"
         style="color:#000000;font-style:normal;font-variant:normal;font-weight:normal;font-stretch:normal;font-size:medium;line-height:normal;font-family:sans-serif;font-variant-ligatures:normal;font-variant-position:normal;font-variant-caps:normal;font-variant-numeric:normal;font-variant-alternates:normal;font-variant-east-asian:normal;font-feature-settings:normal;font-variation-settings:normal;text-indent:0;text-align:start;text-decoration:none;text-decoration-line:none;text-decoration-style:solid;text-decoration-color:#000000;letter-spacing:normal;word-spacing:normal;text-transform:none;writing-mode:lr-tb;direction:ltr;text-orientation:mixed;dominant-baseline:auto;baseline-shift:baseline;text-anchor:start;white-space:normal;shape-padding:0;shape-margin:0;inline-size:0;clip-rule:nonzero;display:inline;overflow:visible;visibility:visible;isolation:auto;mix-blend-mode:normal;color-interpolation:sRGB;color-interpolation-filters:linearRGB;solid-color:#000000;solid-opacity:1;vector-effect:none;fill:#241f31;fill-opacity:1;fill-rule:evenodd;stroke:none;stroke-width:2;stroke-linecap:butt;stroke-linejoin:miter;stroke-miterlimit:4;stroke-dasharray:none;stroke-dashoffset:0;stroke-opacity:1;color-rendering:auto;image-rendering:auto;shape-rendering:auto;text-rendering:auto;enable-background:new;stop-color:#000000;stop-opacity:1" />
    </g>
    <rect
       style="opacity:1;fill:#241f31;fill-opacity:1;stroke:none;stroke-width:9.3165;stroke-linecap:round;stroke-linejoin:round;stroke-opacity:0"
       id="rect1071"
       width="2"
       height="4"
       x="167"
       y="173"
       rx="1"
       ry="1" />
    <rect
       ry="1"
       rx="1"
       y="173"
       x="164"
       height="4"
       width="2"
       id="rect1073"
       style="opacity:1;fill:#241f31;fill-opacity:1;stroke:none;stroke-width:9.3165;stroke-linecap:round;stroke-linejoin:round;stroke-opacity:0" />
    <g
       transform="translate(100)"
       id="g1093">
      <path
         d="m 192,175 c -1.108,0 -2,0.892 -2,2 v 7 c 0,1.108 0.892,2 2,2 h 12 c 1.108,0 2,-0.892 2,-2 v -7 c 0,-1.108 -0.892,-2 -2,-2 h -1 v 2 h 1 v 7 h -12 v -7 h 1 v -2 z"
         style="opacity:1;fill:#241f31;fill-opacity:1;stroke:none;stroke-width:9.31653;stroke-linecap:round;stroke-linejoin:round;stroke-opacity:0"
         id="path1081"
         inkscape:connector-curvature="0" />
      <rect
         ry="1"
         rx="1"
         y="173"
         x="200"
         height="4"
         width="2"
         id="rect1083"
         style="opacity:1;fill:#241f31;fill-opacity:1;stroke:none;stroke-width:9.3165;stroke-linecap:round;stroke-linejoin:round;stroke-opacity:0" />
      <rect
         style="opacity:1;fill:#241f31;fill-opacity:1;stroke:none;stroke-width:9.3165;stroke-linecap:round;stroke-linejoin:round;stroke-opacity:0"
         id="rect1085"
         width="2"
         height="4"
         x="197"
         y="173"
         rx="1"
         ry="1" />
      <rect
         ry="1"
         rx="1"
         y="173"
         x="194"
         height="4"
         width="2"
         id="rect1087"
         style="opacity:1;fill:#241f31;fill-opacity:1;stroke:none;stroke-width:9.3165;stroke-linecap:round;stroke-linejoin:round;stroke-opacity:0" />
    </g>
    <g
       transform="translate(110)"
       id="g1120">
      <path
         inkscape:connector-curvature="0"
         transform="translate(-8,156)"
         d="m 170,19 c -1.108,0 -2,0.892 -2,2 v 7 c 0,1.108 0.892,2 2,2 h 12 c 1.108,0 2,-0.892 2,-2 v -7 c 0,-1.108 -0.892,-2 -2,-2 h -1 v 2 h 1 v 7 h -12 v -7 h 1 v -2 z"
         style="opacity:1;fill:#241f31;fill-opacity:1;stroke:none;stroke-width:9.31653;stroke-linecap:round;stroke-linejoin:round;stroke-opacity:0"
         id="path1105" />
      <rect
         ry="1"
         rx="1"
         y="173"
         x="170"
         height="4"
         width="2"
         id="rect1107"
         style="opacity:1;fill:#241f31;fill-opacity:1;stroke:none;stroke-width:9.3165;stroke-linecap:round;stroke-linejoin:round;stroke-opacity:0" />
      <path
         style="display:inline;fill:#241f31;fill-opacity:1;fill-rule:evenodd;stroke:#f0f0f0;stroke-width:2;stroke-opacity:1;enable-background:new"
         d="m 170,185.00035 7,-7 -3,-3 -7,7.00068 v 2.99862 z"
         id="path1109"
         sodipodi:nodetypes="cccccc"
         inkscape:connector-curvature="0" />
      <rect
         style="opacity:1;fill:#241f31;fill-opacity:1;stroke:none;stroke-width:9.3165;stroke-linecap:round;stroke-linejoin:round;stroke-opacity:0"
         id="rect1111"
         width="2"
         height="4"
         x="167"
         y="173"
         rx="1"
         ry="1" />
      <rect
         ry="1"
         rx="1"
         y="173"
         x="164"
         height="4"
         width="2"
         id="rect1113"
         style="opacity:1;fill:#241f31;fill-opacity:1;stroke:none;stroke-width:9.3165;stroke-linecap:round;stroke-linejoin:round;stroke-opacity:0" />
    </g>
    <path
       inkscape:connector-curvature="0"
       sodipodi:nodetypes="cccccc"
       id="path1122"
       d="m 210,185.00035 7,-7 -3,-3 -7,7.00068 v 2.99862 z"
       style="display:inline;fill:#241f31;fill-opacity:1;fill-rule:evenodd;stroke:#f0f0f0;stroke-width:2;stroke-opacity:1;enable-background:new" />
    <g
       transform="translate(1,-1)"
       style="opacity:1"
       id="g1133">
      <path
         sodipodi:nodetypes="cccccc"
         inkscape:connector-curvature="0"
         d="m 173,177.41406 -5,5.00196 V 184 h 1.58594 l 5,-5 z"
         style="color:#000000;font-style:normal;font-variant:normal;font-weight:normal;font-stretch:normal;font-size:medium;line-height:normal;font-family:sans-serif;font-variant-ligatures:normal;font-variant-position:normal;font-variant-caps:normal;font-variant-numeric:normal;font-variant-alternates:normal;font-variant-east-asian:normal;font-feature-settings:normal;font-variation-settings:normal;text-indent:0;text-align:start;text-decoration:none;text-decoration-line:none;text-decoration-style:solid;text-decoration-color:#000000;letter-spacing:normal;word-spacing:normal;text-transform:none;writing-mode:lr-tb;direction:ltr;text-orientation:mixed;dominant-baseline:auto;baseline-shift:baseline;text-anchor:start;white-space:normal;shape-padding:0;shape-margin:0;inline-size:0;clip-rule:nonzero;display:inline;overflow:visible;visibility:visible;isolation:auto;mix-blend-mode:normal;color-interpolation:sRGB;color-interpolation-filters:linearRGB;solid-color:#000000;solid-opacity:1;vector-effect:none;fill:#241f31;fill-opacity:1;fill-rule:evenodd;stroke:none;stroke-width:2;stroke-linecap:butt;stroke-linejoin:miter;stroke-miterlimit:4;stroke-dasharray:none;stroke-dashoffset:0;stroke-opacity:1;color-rendering:auto;image-rendering:auto;shape-rendering:auto;text-rendering:auto;enable-background:new;stop-color:#000000;stop-opacity:1"
         id="path1135" />
    </g>
    <g
       transform="translate(90)"
       id="g1158">
      <path
         sodipodi:nodetypes="ssssccccccsccccccssc"
         inkscape:connector-curvature="0"
         transform="translate(-8,156)"
         d="m 170,19 c -1.108,0 -2,0.892 -2,2 v 7 c 0,1.108 0.892,2 2,2 h 4 v -2 h -4 v -7 h 1 v -2 z m 14,5.414062 -2,2 V 28 h -1.58594 L 178.70703,29.707031 178.41406,30 H 182 c 1.108,0 2,-0.892 2,-2 z"
         style="opacity:1;fill:#241f31;fill-opacity:1;stroke:none;stroke-width:9.31653;stroke-linecap:round;stroke-linejoin:round;stroke-opacity:0"
         id="path1140" />
      <rect
         ry="1"
         rx="1"
         y="173"
         x="170"
         height="4"
         width="2"
         id="rect1142"
         style="opacity:1;fill:#241f31;fill-opacity:1;stroke:none;stroke-width:9.3165;stroke-linecap:round;stroke-linejoin:round;stroke-opacity:0" />
      <rect
         style="opacity:1;fill:#241f31;fill-opacity:1;stroke:none;stroke-width:9.3165;stroke-linecap:round;stroke-linejoin:round;stroke-opacity:0"
         id="rect1144"
         width="2"
         height="4"
         x="167"
         y="173"
         rx="1"
         ry="1" />
      <rect
         ry="1"
         rx="1"
         y="173"
         x="164"
         height="4"
         width="2"
         id="rect1146"
         style="opacity:1;fill:#241f31;fill-opacity:1;stroke:none;stroke-width:9.3165;stroke-linecap:round;stroke-linejoin:round;stroke-opacity:0" />
      <g
         style="opacity:1"
         id="g1150">
        <path
           inkscape:connector-curvature="0"
           d="m 174,176.41406 -6,6.00196 V 184 h 1.58594 l 6,-6 z"
           style="color:#000000;font-style:normal;font-variant:normal;font-weight:normal;font-stretch:normal;font-size:medium;line-height:normal;font-family:sans-serif;font-variant-ligatures:normal;font-variant-position:normal;font-variant-caps:normal;font-variant-numeric:normal;font-variant-alternates:normal;font-variant-east-asian:normal;font-feature-settings:normal;font-variation-settings:normal;text-indent:0;text-align:start;text-decoration:none;text-decoration-line:none;text-decoration-style:solid;text-decoration-color:#000000;letter-spacing:normal;word-spacing:normal;text-transform:none;writing-mode:lr-tb;direction:ltr;text-orientation:mixed;dominant-baseline:auto;baseline-shift:baseline;text-anchor:start;white-space:normal;shape-padding:0;shape-margin:0;inline-size:0;clip-rule:nonzero;display:inline;overflow:visible;visibility:visible;isolation:auto;mix-blend-mode:normal;color-interpolation:sRGB;color-interpolation-filters:linearRGB;solid-color:#000000;solid-opacity:1;vector-effect:none;fill:#241f31;fill-opacity:1;fill-rule:evenodd;stroke:none;stroke-width:2;stroke-linecap:butt;stroke-linejoin:miter;stroke-miterlimit:4;stroke-dasharray:none;stroke-dashoffset:0;stroke-opacity:1;color-rendering:auto;image-rendering:auto;shape-rendering:auto;text-rendering:auto;enable-background:new;stop-color:#000000;stop-opacity:1"
           id="path1148" />
      </g>
    </g>
  </g>
</svg>
