<?xml version="1.0" encoding="UTF-8" standalone="no"?>
<svg
   xmlns:dc="http://purl.org/dc/elements/1.1/"
   xmlns:cc="http://creativecommons.org/ns#"
   xmlns:rdf="http://www.w3.org/1999/02/22-rdf-syntax-ns#"
   xmlns:svg="http://www.w3.org/2000/svg"
   xmlns="http://www.w3.org/2000/svg"
   xmlns:xlink="http://www.w3.org/1999/xlink"
   xmlns:sodipodi="http://sodipodi.sourceforge.net/DTD/sodipodi-0.dtd"
   xmlns:inkscape="http://www.inkscape.org/namespaces/inkscape"
   viewBox="0 0 192 152"
   style="display:inline;enable-background:new"
   version="1.0"
   inkscape:output_extension="org.inkscape.output.svg.inkscape"
   sodipodi:docname="org.gnome.Sudoku.Source.svg"
   inkscape:version="1.0 (4035a4fb49, 2020-05-01)"
   sodipodi:version="0.32"
   id="svg11300"
   height="152"
   width="192"
   inkscape:export-filename="Template.png"
   inkscape:export-xdpi="96"
   inkscape:export-ydpi="96">
  <title
     id="title4162">Adwaita Icon Template</title>
  <defs
     id="defs3">
    <linearGradient
       id="linearGradient2426"
       inkscape:collect="always">
      <stop
         id="stop2422"
         offset="0"
         style="stop-color:#000000;stop-opacity:0.05253233" />
      <stop
         id="stop2424"
         offset="1"
         style="stop-color:#000000;stop-opacity:0;" />
    </linearGradient>
    <linearGradient
       y2="-449.39401"
       x2="536.59589"
       y1="-449.39401"
       x1="88.595886"
       gradientTransform="matrix(0.23214285,0,0,0.32894738,-376.56691,439.82697)"
       gradientUnits="userSpaceOnUse"
       id="linearGradient1064"
       xlink:href="#linearGradient1073"
       inkscape:collect="always" />
    <linearGradient
       id="linearGradient1073"
       inkscape:collect="always">
      <stop
         id="stop1060"
         offset="0"
         style="stop-color:#c0bfbc;stop-opacity:1" />
      <stop
         style="stop-color:#f6f5f4;stop-opacity:1"
         offset="0.03846154"
         id="stop1062" />
      <stop
         id="stop1064"
         offset="0.07685554"
         style="stop-color:#c0bfbc;stop-opacity:1" />
      <stop
         style="stop-color:#deddda;stop-opacity:1"
         offset="0.92307693"
         id="stop1067" />
      <stop
         id="stop1069"
         offset="0.96153849"
         style="stop-color:#c0bfbc;stop-opacity:1" />
      <stop
         id="stop1071"
         offset="1"
         style="stop-color:#c0bfbc;stop-opacity:1" />
    </linearGradient>
    <linearGradient
       xlink:href="#linearGradient1036"
       id="linearGradient1099"
       gradientUnits="userSpaceOnUse"
       gradientTransform="translate(604.81684,170.58641)"
       x1="32"
       y1="236"
       x2="96"
       y2="236" />
    <linearGradient
       id="linearGradient1036">
      <stop
         style="stop-color:#d5d3cf;stop-opacity:1;"
         offset="0"
         id="stop1032" />
      <stop
         style="stop-color:#f6f5f4;stop-opacity:1"
         offset="1"
         id="stop1034" />
    </linearGradient>
    <radialGradient
       xlink:href="#linearGradient1069"
       id="radialGradient1103"
       gradientUnits="userSpaceOnUse"
       gradientTransform="matrix(0.88333331,0,0,0.88333331,-460.35018,463.11973)"
       cx="-244"
       cy="-76"
       fx="-244"
       fy="-76"
       r="32" />
    <linearGradient
       id="linearGradient1069">
      <stop
         style="stop-color:#d5d3cf;stop-opacity:1"
         offset="0"
         id="stop1065" />
      <stop
         style="stop-color:#949390;stop-opacity:1"
         offset="1"
         id="stop1067-1" />
    </linearGradient>
    <linearGradient
       gradientTransform="translate(-470.5864,432.81685)"
       xlink:href="#linearGradient1025"
       id="linearGradient1027"
       x1="64"
       y1="262.5"
       x2="64"
       y2="232"
       gradientUnits="userSpaceOnUse" />
    <linearGradient
       id="linearGradient1025">
      <stop
         style="stop-color:#9a9996;stop-opacity:1"
         offset="0"
         id="stop1021" />
      <stop
         style="stop-color:#77767b;stop-opacity:1"
         offset="1"
         id="stop1023" />
    </linearGradient>
    <inkscape:path-effect
       is_visible="true"
       id="path-effect35304-9"
       effect="spiro" />
    <clipPath
       id="clipPath1609-7"
       clipPathUnits="userSpaceOnUse">
      <path
         style="fill:#e74747;stroke:none;stroke-width:0.25px;stroke-linecap:butt;stroke-linejoin:miter;stroke-opacity:1"
         d="m 252,116 28,-28 v -8 h -36 v 36 z"
         id="path1611-5"
         inkscape:connector-curvature="0"
         sodipodi:nodetypes="cccccc" />
    </clipPath>
    <linearGradient
       id="linearGradient1697">
      <stop
         style="stop-color:#deddda;stop-opacity:1"
         offset="0"
         id="stop1685" />
      <stop
         id="stop1687"
         offset="0.04545455"
         style="stop-color:#eeeeec;stop-opacity:1" />
      <stop
         style="stop-color:#deddda;stop-opacity:1"
         offset="0.09090909"
         id="stop1689" />
      <stop
         id="stop1691"
         offset="0.90909094"
         style="stop-color:#deddda;stop-opacity:1" />
      <stop
         style="stop-color:#eeeeec;stop-opacity:1"
         offset="0.95454544"
         id="stop1693" />
      <stop
         style="stop-color:#c0bfbc;stop-opacity:1"
         offset="1"
         id="stop1695" />
    </linearGradient>
    <clipPath
       id="clipPath1289"
       clipPathUnits="userSpaceOnUse">
      <path
         sodipodi:nodetypes="scccsssscccssss"
         inkscape:connector-curvature="0"
         id="path1291"
         d="m 64,-148 h 64 l 64,-64 64,64 h 192 c 17.728,0 32,14.272 32,32 v 288 c 0,17.728 -14.272,32 -32,32 H 256 l -64,-64 -64,64 H 64 C 46.272,204 32,189.728 32,172 v -288 c 0,-17.728 14.408898,-34.19889 32,-32 z"
         style="display:inline;opacity:1;vector-effect:none;fill:none;fill-opacity:1;stroke:#000000;stroke-width:4;stroke-linecap:round;stroke-linejoin:round;stroke-miterlimit:4;stroke-dasharray:none;stroke-dashoffset:0;stroke-opacity:1;marker:none;marker-start:none;marker-mid:none;marker-end:none;paint-order:normal;enable-background:new" />
    </clipPath>
    <linearGradient
       gradientTransform="matrix(0,6,-12,0,-64,209.99687)"
       gradientUnits="userSpaceOnUse"
       x2="1"
       id="paint3_linear-2-6-5">
      <stop
         id="stop91-0-7-4"
         stop-color="#C01C27" />
      <stop
         id="stop93-2-5-7"
         stop-color="#E01B24"
         offset="1" />
    </linearGradient>
    <clipPath
       id="clipPath1609"
       clipPathUnits="userSpaceOnUse">
      <path
         style="fill:#e74747;stroke:none;stroke-width:0.25px;stroke-linecap:butt;stroke-linejoin:miter;stroke-opacity:1"
         d="m 252,116 28,-28 v -8 h -36 v 36 z"
         id="path1611"
         inkscape:connector-curvature="0"
         sodipodi:nodetypes="cccccc" />
    </clipPath>
    <radialGradient
       gradientUnits="userSpaceOnUse"
       gradientTransform="matrix(1,0,0,0.60719707,0,100.68824)"
       r="52.002365"
       fy="311.77975"
       fx="-256"
       cy="311.77975"
       cx="-256"
       id="radialGradient2428"
       xlink:href="#linearGradient2426"
       inkscape:collect="always" />
  </defs>
  <sodipodi:namedview
     inkscape:document-rotation="0"
     borderlayer="true"
     inkscape:snap-text-baseline="true"
     inkscape:snap-smooth-nodes="true"
     inkscape:snap-midpoints="true"
     inkscape:snap-object-midpoints="true"
     inkscape:snap-center="true"
     showborder="true"
     inkscape:snap-bbox-midpoints="true"
     inkscape:snap-bbox-edge-midpoints="true"
     inkscape:snap-intersection-paths="true"
     inkscape:object-paths="true"
     inkscape:snap-global="true"
     inkscape:bbox-nodes="true"
     inkscape:object-nodes="true"
     inkscape:measure-end="0,0"
     inkscape:measure-start="0,0"
     inkscape:locked="false"
     inkscape:guide-bbox="true"
     showguides="false"
     inkscape:pagecheckerboard="false"
     inkscape:window-maximized="0"
     guidetolerance="13"
     gridtolerance="12"
     objecttolerance="7"
     inkscape:snap-bbox="true"
     inkscape:snap-nodes="true"
     height="300px"
     width="400px"
     inkscape:window-y="23"
     inkscape:window-x="26"
     inkscape:window-height="1376"
     inkscape:window-width="2560"
     inkscape:showpageshadow="false"
     inkscape:document-units="px"
     inkscape:grid-bbox="true"
     showgrid="false"
     inkscape:current-layer="layer9"
     inkscape:cy="15.588019"
     inkscape:cx="-76.041801"
     inkscape:zoom="1"
     inkscape:pageshadow="2"
     inkscape:pageopacity="0.0"
     borderopacity="0.25490196"
     bordercolor="#666666"
     pagecolor="#ffffff"
     id="base"
     fill="#f57900"
     stroke="#ef2929">
    <inkscape:grid
       originy="8"
       originx="8"
       empspacing="4"
       visible="true"
       enabled="true"
       spacingy="2"
       spacingx="2"
       id="grid5883"
       type="xygrid" />
    <sodipodi:guide
       inkscape:color="rgb(0,0,255)"
       inkscape:label=""
       inkscape:locked="false"
       id="guide1073"
       orientation="0,1"
       position="72,16" />
    <sodipodi:guide
       inkscape:color="rgb(0,0,255)"
       inkscape:label=""
       inkscape:locked="false"
       id="guide1075"
       orientation="1,0"
       position="20,72" />
    <sodipodi:guide
       inkscape:color="rgb(0,0,255)"
       inkscape:label=""
       inkscape:locked="false"
       id="guide1099"
       orientation="0,1"
       position="72,112" />
    <sodipodi:guide
       inkscape:color="rgb(0,0,255)"
       inkscape:label=""
       inkscape:locked="false"
       id="guide993"
       orientation="0,1"
       position="72,136" />
    <sodipodi:guide
       inkscape:color="rgb(0,0,255)"
       inkscape:label=""
       inkscape:locked="false"
       id="guide995"
       orientation="1,0"
       position="112,72" />
    <sodipodi:guide
       inkscape:color="rgb(0,0,255)"
       inkscape:label=""
       inkscape:locked="false"
       id="guide867"
       orientation="1,0"
       position="8.0000001,72" />
    <sodipodi:guide
       inkscape:color="rgb(0,0,255)"
       inkscape:label=""
       inkscape:locked="false"
       id="guide869"
       orientation="1,0"
       position="128,72" />
    <sodipodi:guide
       inkscape:color="rgb(0,0,255)"
       inkscape:label=""
       inkscape:locked="false"
       id="guide871"
       orientation="0,1"
       position="72,124" />
    <inkscape:grid
       originy="8"
       originx="8"
       dotted="true"
       empopacity="0.08627451"
       empcolor="#000000"
       opacity="0.49019608"
       color="#000000"
       empspacing="8"
       spacingy="1"
       spacingx="1"
       id="grid873"
       type="xygrid" />
    <sodipodi:guide
       inkscape:color="rgb(0,0,255)"
       inkscape:label=""
       inkscape:locked="false"
       id="guide877"
       orientation="1,0"
       position="32,72" />
    <sodipodi:guide
       inkscape:color="rgb(0,0,255)"
       inkscape:label=""
       inkscape:locked="false"
       id="guide879"
       orientation="1,0"
       position="124,72" />
    <sodipodi:guide
       inkscape:color="rgb(0,0,255)"
       inkscape:label=""
       inkscape:locked="false"
       id="guide881"
       orientation="0,1"
       position="72,128" />
    <sodipodi:guide
       inkscape:color="rgb(0,0,255)"
       inkscape:label=""
       inkscape:locked="false"
       id="guide883"
       orientation="0,1"
       position="72,20" />
    <sodipodi:guide
       inkscape:color="rgb(0,0,255)"
       inkscape:label=""
       inkscape:locked="false"
       id="guide885"
       orientation="1,0"
       position="16,72" />
    <sodipodi:guide
       inkscape:color="rgb(0,0,255)"
       inkscape:label=""
       inkscape:locked="false"
       id="guide887"
       orientation="1,0"
       position="136,72" />
    <sodipodi:guide
       inkscape:color="rgb(0,0,255)"
       inkscape:label=""
       inkscape:locked="false"
       id="guide897"
       orientation="0,1"
       position="72,8" />
    <sodipodi:guide
       inkscape:color="rgb(0,0,255)"
       inkscape:label=""
       inkscape:locked="false"
       id="guide899"
       orientation="0,1"
       position="72,32" />
    <sodipodi:guide
       inkscape:color="rgb(0,0,255)"
       inkscape:label=""
       inkscape:locked="false"
       id="guide950"
       orientation="-0.70710678,0.70710678"
       position="264,264" />
    <sodipodi:guide
       inkscape:color="rgb(0,0,255)"
       inkscape:label=""
       inkscape:locked="false"
       id="guide952"
       orientation="0.70710678,0.70710678"
       position="72,72" />
  </sodipodi:namedview>
  <metadata
     id="metadata4">
    <rdf:RDF>
      <cc:Work
         rdf:about="">
        <dc:format>image/svg+xml</dc:format>
        <dc:type
           rdf:resource="http://purl.org/dc/dcmitype/StillImage" />
        <dc:creator>
          <cc:Agent>
            <dc:title>GNOME Design Team</dc:title>
          </cc:Agent>
        </dc:creator>
        <dc:source />
        <cc:license
           rdf:resource="http://creativecommons.org/licenses/by-sa/4.0/" />
        <dc:title>Adwaita Icon Template</dc:title>
        <dc:subject>
          <rdf:Bag />
        </dc:subject>
        <dc:date />
        <dc:rights>
          <cc:Agent>
            <dc:title />
          </cc:Agent>
        </dc:rights>
        <dc:publisher>
          <cc:Agent>
            <dc:title />
          </cc:Agent>
        </dc:publisher>
        <dc:identifier />
        <dc:relation />
        <dc:language />
        <dc:coverage />
        <dc:description />
        <dc:contributor>
          <cc:Agent>
            <dc:title />
          </cc:Agent>
        </dc:contributor>
      </cc:Work>
      <cc:License
         rdf:about="http://creativecommons.org/licenses/by-sa/4.0/">
        <cc:permits
           rdf:resource="http://creativecommons.org/ns#Reproduction" />
        <cc:permits
           rdf:resource="http://creativecommons.org/ns#Distribution" />
        <cc:requires
           rdf:resource="http://creativecommons.org/ns#Notice" />
        <cc:requires
           rdf:resource="http://creativecommons.org/ns#Attribution" />
        <cc:permits
           rdf:resource="http://creativecommons.org/ns#DerivativeWorks" />
        <cc:requires
           rdf:resource="http://creativecommons.org/ns#ShareAlike" />
      </cc:License>
    </rdf:RDF>
  </metadata>
  <g
     transform="translate(8,-156)"
     style="display:inline"
     inkscape:groupmode="layer"
     inkscape:label="App Icon"
     id="layer1">
    <g
       sodipodi:insensitive="true"
       style="display:inline"
       inkscape:label="template"
       id="layer4"
       inkscape:groupmode="layer">
      <rect
         style="display:inline;overflow:visible;visibility:visible;fill:#f0f0f0;fill-opacity:0;fill-rule:nonzero;stroke:none;stroke-width:0.5;marker:none;enable-background:accumulate"
         id="hicolor"
         width="128"
         height="128"
         x="9.2651362e-08"
         y="172"
         inkscape:label="0" />
      <rect
         inkscape:label="0"
         y="172"
         x="160"
         height="16"
         width="16"
         id="symbolic"
         style="display:inline;overflow:visible;visibility:visible;fill:#f0f0f0;fill-opacity:0;fill-rule:nonzero;stroke:none;stroke-width:0.5;marker:none;enable-background:accumulate" />
    </g>
    <g
       style="display:inline"
       inkscape:label="baseplate"
       id="layer2"
       inkscape:groupmode="layer">
      <g
         inkscape:export-ydpi="12"
         inkscape:export-xdpi="12"
         id="g12027"
         transform="matrix(7.9911709,0,0,8.0036407,-167.7909,-4846.0776)"
         style="display:inline;fill:#000000;enable-background:new" />
      <rect
         inkscape:label="0"
         y="172"
         x="9.2651362e-08"
         height="128"
         width="128"
         id="128"
         style="display:inline;overflow:visible;visibility:visible;fill:#f0f0f0;fill-opacity:1;fill-rule:nonzero;stroke:none;stroke-width:0.5;marker:none;enable-background:accumulate" />
      <g
         transform="translate(-24,24)"
         style="fill:none;fill-opacity:0.25098;stroke:#a579b3;stroke-opacity:1"
         id="g883" />
      <g
         transform="translate(-24,24)"
         style="fill:none;fill-opacity:0.25098;stroke:#a579b3;stroke-opacity:1"
         id="g900" />
      <rect
         style="display:inline;overflow:visible;visibility:visible;fill:#f0f0f0;fill-opacity:1;fill-rule:nonzero;stroke:none;stroke-width:0.5;marker:none;enable-background:accumulate"
         id="16"
         width="16"
         height="16"
         x="160"
         y="172"
         inkscape:label="" />
      <text
         inkscape:label="icon-name"
         id="text863"
         y="167"
         x="0"
         style="font-style:normal;font-variant:normal;font-weight:bold;font-stretch:normal;font-size:4px;line-height:125%;font-family:Cantarell;-inkscape-font-specification:'Cantarell, Bold';text-align:start;writing-mode:lr-tb;text-anchor:start;display:inline;fill:#000000;fill-opacity:1;stroke:none;stroke-width:0.332649;enable-background:new"
         xml:space="preserve"><tspan
           y="167"
           x="0"
           id="tspan861"
           sodipodi:role="line"
           style="font-size:4px;stroke-width:0.332649">Hicolor</tspan></text>
      <text
         xml:space="preserve"
         style="font-style:normal;font-variant:normal;font-weight:bold;font-stretch:normal;font-size:4px;line-height:125%;font-family:Cantarell;-inkscape-font-specification:'Cantarell, Bold';text-align:start;writing-mode:lr-tb;text-anchor:start;display:inline;fill:#000000;fill-opacity:1;stroke:none;stroke-width:0.332649;enable-background:new"
         x="160"
         y="167"
         id="text867"
         inkscape:label="icon-name"><tspan
           style="font-size:4px;stroke-width:0.332649"
           sodipodi:role="line"
           id="tspan865"
           x="160"
           y="167">Symbolic</tspan></text>
    </g>
    <g
       style="display:inline"
       inkscape:label="icons"
       id="layer9"
       inkscape:groupmode="layer">
      <g
         transform="translate(368)"
         id="g1096"
         style="display:inline;enable-background:new">
        <rect
           ry="8"
           rx="7.999999"
           y="192"
           x="-356"
           height="100"
           width="104"
           id="rect1048"
           style="display:inline;opacity:1;vector-effect:none;fill:url(#linearGradient1064);fill-opacity:1;stroke:none;stroke-width:0.25;stroke-linecap:butt;stroke-linejoin:miter;stroke-miterlimit:4;stroke-dasharray:none;stroke-dashoffset:0;stroke-opacity:1;marker:none;marker-start:none;marker-mid:none;marker-end:none;paint-order:normal;enable-background:new" />
        <path
           d="m -347.50391,223.84766 c -4.70035,0 -8.5,3.79964 -8.5,8.5 v 2 2 42.15234 2 2 c 0,4.70035 3.79965,8.5 8.5,8.5 H -260.5 c 4.70035,0 8.5,-3.79965 8.5,-8.5 v -4 -42.15234 -2 -2 c 0,-4.70036 -3.79965,-8.5 -8.5,-8.5 z m 0,1 H -260.5 c 3.11118,0 5.75984,1.8641 6.90039,4.54296 -1.54186,-2.14438 -4.05292,-3.54296 -6.90039,-3.54296 h -87.00391 c -2.84746,0 -5.35852,1.39858 -6.90039,3.54296 1.14056,-2.67886 3.78922,-4.54296 6.90039,-4.54296 z m 0,2 H -260.5 c 3.11118,0 5.75984,1.8641 6.90039,4.54296 -1.54186,-2.14438 -4.05292,-3.54296 -6.90039,-3.54296 h -87.00391 c -2.84746,0 -5.35852,1.39858 -6.90039,3.54296 1.14056,-2.67886 3.78922,-4.54296 6.90039,-4.54296 z m 0,2 H -260.5 c 4.16365,0 7.5,3.33635 7.5,7.5 V 278.5 c 0,4.16365 -3.33635,7.5 -7.5,7.5 h -87.00391 c -4.16364,0 -7.5,-3.33635 -7.5,-7.5 v -42.15234 c 0,-4.16365 3.33636,-7.5 7.5,-7.5 z m -6.90039,54.60937 c 1.54187,2.14438 4.05293,3.54297 6.90039,3.54297 H -260.5 c 2.84747,0 5.35853,-1.39859 6.90039,-3.54297 C -254.74016,286.13589 -257.38882,288 -260.5,288 h -87.00391 c -3.11117,0 -5.75983,-1.86411 -6.90039,-4.54297 z m 0,2 c 1.54187,2.14438 4.05293,3.54297 6.90039,3.54297 H -260.5 c 2.84747,0 5.35853,-1.39859 6.90039,-3.54297 C -254.74016,288.13589 -257.38882,290 -260.5,290 h -87.00391 c -3.11117,0 -5.75983,-1.86411 -6.90039,-4.54297 z"
           style="color:#000000;font-style:normal;font-variant:normal;font-weight:normal;font-stretch:normal;font-size:medium;line-height:normal;font-family:sans-serif;font-variant-ligatures:normal;font-variant-position:normal;font-variant-caps:normal;font-variant-numeric:normal;font-variant-alternates:normal;font-variant-east-asian:normal;font-feature-settings:normal;font-variation-settings:normal;text-indent:0;text-align:start;text-decoration:none;text-decoration-line:none;text-decoration-style:solid;text-decoration-color:#000000;letter-spacing:normal;word-spacing:normal;text-transform:none;writing-mode:lr-tb;direction:ltr;text-orientation:mixed;dominant-baseline:auto;baseline-shift:baseline;text-anchor:start;white-space:normal;shape-padding:0;shape-margin:0;inline-size:0;clip-rule:nonzero;display:inline;overflow:visible;visibility:visible;opacity:1;isolation:auto;mix-blend-mode:normal;color-interpolation:sRGB;color-interpolation-filters:linearRGB;solid-color:#000000;solid-opacity:1;vector-effect:none;fill:url(#radialGradient2428);fill-opacity:1;fill-rule:nonzero;stroke:none;stroke-width:1;stroke-linecap:butt;stroke-linejoin:miter;stroke-miterlimit:4;stroke-dasharray:none;stroke-dashoffset:0;stroke-opacity:1;marker:none;paint-order:normal;color-rendering:auto;image-rendering:auto;shape-rendering:auto;text-rendering:auto;enable-background:new;stop-color:#000000;stop-opacity:1"
           id="path2443" />
        <rect
           style="display:inline;opacity:1;vector-effect:none;fill:#deddda;fill-opacity:1;stroke:none;stroke-width:0.25;stroke-linecap:butt;stroke-linejoin:miter;stroke-miterlimit:4;stroke-dasharray:none;stroke-dashoffset:0;stroke-opacity:1;marker:none;marker-start:none;marker-mid:none;marker-end:none;paint-order:normal;enable-background:new"
           id="rect929-36-9"
           width="104"
           height="99.999992"
           x="-356"
           y="184"
           rx="7.9999986"
           ry="8" />
      </g>
      <g
         transform="matrix(1.0184998,0,0,1.0184998,0.51324383,-4.3450825)"
         style="font-style:normal;font-variant:normal;font-weight:bold;font-stretch:normal;font-size:21.365px;line-height:1.25;font-family:Montserrat;-inkscape-font-specification:'Montserrat, Bold';font-variant-ligatures:normal;font-variant-caps:normal;font-variant-numeric:normal;font-variant-east-asian:normal;letter-spacing:0px;word-spacing:0px;fill:#241f31;fill-opacity:1;stroke:none;stroke-width:0.981835"
         id="text1340"
         aria-label="5">
        <path
           id="path1350"
           style="fill:#241f31;stroke-width:0.981835"
           d="m 63.590317,200.2045 h -1.217805 l 0.235015,-2.84155 h 6.23858 v -2.77745 h -9.122855 l -0.76914,8.41781 h 3.824335 c 2.713355,0 3.482495,0.76914 3.482495,1.94422 0,1.2178 -1.06825,1.94421 -2.798815,1.94421 -1.559645,0 -3.11929,-0.49139 -4.251635,-1.34599 l -1.36736,2.64926 c 1.45282,1.02552 3.63205,1.60237 5.704455,1.60237 4.273,0 6.217215,-2.30742 6.217215,-4.95668 0,-2.64926 -1.75193,-4.6362 -6.174485,-4.6362 z" />
      </g>
      <rect
         y="218"
         x="26"
         height="2"
         width="78"
         id="rect1318"
         style="fill:#62a0ea;fill-opacity:1;stroke-width:0.999991px;stop-color:#000000" />
      <rect
         style="fill:#62a0ea;fill-opacity:1;stroke-width:0.999991px;stop-color:#000000"
         id="rect1320"
         width="78"
         height="2"
         x="26"
         y="250" />
      <rect
         transform="rotate(90)"
         y="-50"
         x="196"
         height="2"
         width="78"
         id="rect1324"
         style="fill:#62a0ea;fill-opacity:1;stroke-width:0.999991px;stop-color:#000000" />
      <rect
         style="fill:#62a0ea;fill-opacity:1;stroke-width:0.999991px;stop-color:#000000"
         id="rect1326"
         width="78"
         height="2"
         x="196"
         y="-82"
         transform="rotate(90)" />
      <rect
         y="220.00002"
         x="50"
         height="30.000002"
         width="30"
         id="rect1328"
         style="fill:#99c1f1;fill-opacity:1;stroke-width:1px;stop-color:#000000" />
      <path
         sodipodi:nodetypes="ccccccccccccccc"
         d="m 163,175 v 10 h 10 v -10 z m 2.5,2 h 5 v 1.27632 L 168,183 h -1.49414 l 2.30469,-4.72368 H 166.75 v 0.41207 h -1.25 z"
         style="opacity:1;fill:#000000;fill-opacity:1;stroke:none;stroke-width:1;stroke-miterlimit:4;stroke-dasharray:none;stroke-opacity:1;stop-color:#000000"
         id="rect2456" />
      <g
         transform="translate(-0.064595)"
         style="font-style:normal;font-variant:normal;font-weight:bold;font-stretch:normal;font-size:25.7028px;line-height:1.25;font-family:Montserrat;-inkscape-font-specification:'Montserrat, Bold';font-variant-ligatures:normal;font-variant-caps:normal;font-variant-numeric:normal;font-variant-east-asian:normal;letter-spacing:0px;word-spacing:0px;fill:#ffffff;fill-opacity:1;stroke:none;stroke-width:0.999999"
         id="text1332"
         aria-label="7">
        <path
           id="path1359"
           style="fill:#ffffff;stroke-width:0.999999"
           d="m 57.793193,226.0525 v 6.32289 h 3.701203 v -2.93012 h 5.96305 l -6.451403,14.59919 h 4.523693 l 6.682728,-15.29316 v -2.6988 z" />
      </g>
      <g
         transform="matrix(1.0184998,0,0,1.0184998,-2.813654,-4.3450825)"
         style="font-style:normal;font-variant:normal;font-weight:bold;font-stretch:normal;font-size:21.365px;line-height:1.25;font-family:Montserrat;-inkscape-font-specification:'Montserrat, Bold';font-variant-ligatures:normal;font-variant-caps:normal;font-variant-numeric:normal;font-variant-east-asian:normal;letter-spacing:0px;word-spacing:0px;fill:#3584e4;fill-opacity:1;stroke:none;stroke-width:0.981835"
         id="text1336"
         aria-label="8">
        <path
           id="path1362"
           style="fill:#3584e4;stroke-width:0.981835"
           d="m 102.16397,201.67868 c 1.11098,-0.68368 1.75193,-1.73056 1.75193,-3.07656 0,-2.62789 -2.35015,-4.273 -5.789914,-4.273 -3.397035,0 -5.747185,1.64511 -5.747185,4.273 0,1.346 0.619585,2.39288 1.730565,3.07656 -1.431455,0.72641 -2.26469,1.92285 -2.26469,3.52523 0,2.82018 2.499705,4.59347 6.28131,4.59347 3.802974,0 6.324044,-1.77329 6.324044,-4.59347 0,-1.60238 -0.83324,-2.79882 -2.28606,-3.52523 z m -4.037984,-4.80712 c 1.41009,0 2.350154,0.70504 2.350154,1.88012 0,1.13234 -0.918699,1.83739 -2.350154,1.83739 -1.41009,0 -2.30742,-0.70505 -2.30742,-1.83739 0,-1.17508 0.918695,-1.88012 2.30742,-1.88012 z m 0,10.38339 c -1.7092,0 -2.77745,-0.83324 -2.77745,-2.15787 0,-1.32463 1.06825,-2.1365 2.77745,-2.1365 1.730565,0 2.820184,0.81187 2.820184,2.1365 0,1.32463 -1.089619,2.15787 -2.820184,2.15787 z" />
      </g>
      <g
         transform="matrix(1.0184998,0,0,1.0184998,0.80797196,-4.3450825)"
         style="font-style:normal;font-variant:normal;font-weight:bold;font-stretch:normal;font-size:21.365px;line-height:1.25;font-family:Montserrat;-inkscape-font-specification:'Montserrat, Bold';font-variant-ligatures:normal;font-variant-caps:normal;font-variant-numeric:normal;font-variant-east-asian:normal;letter-spacing:0px;word-spacing:0px;fill:#241f31;fill-opacity:1;stroke:none;stroke-width:0.981835"
         id="text1344"
         aria-label="1">
        <path
           id="path1353"
           style="fill:#241f31;stroke-width:0.981835"
           d="m 28.100578,194.5855 v 2.77745 h 2.9911 V 209.541 h 3.46113 v -14.9555 z" />
      </g>
      <g
         transform="matrix(1.0184998,0,0,1.0184998,-1.2052732,-4.4342619)"
         style="font-style:normal;font-variant:normal;font-weight:bold;font-stretch:normal;font-size:21.365px;line-height:1.25;font-family:Montserrat;-inkscape-font-specification:'Montserrat, Bold';font-variant-ligatures:normal;font-variant-caps:normal;font-variant-numeric:normal;font-variant-east-asian:normal;letter-spacing:0px;word-spacing:0px;fill:#241f31;fill-opacity:1;stroke:none;stroke-width:0.981835"
         id="text1348"
         aria-label="4">
        <path
           id="path1356"
           style="fill:#241f31;stroke-width:0.981835"
           d="m 38.965095,269.4495 h -2.43561 v -2.79881 H 33.26064 v 2.79881 h -4.01662 l 6.53769,-8.99466 h -3.63205 l -7.05045,9.48606 v 2.32878 h 8.054605 v 3.14066 h 3.37567 v -3.14066 h 2.43561 z" />
      </g>
      <path
         d="m 53,255.03125 v -3 h -3.644531 c -0.811504,0 -1.417969,-0.60646 -1.417969,-1.41797 V 247 h -3 v 3.61328 c 0,2.42161 1.996362,4.41797 4.417969,4.41797 z m 23.9375,0 v -3 h 3.644531 C 81.393535,252.03125 82,251.42479 82,250.61328 V 247 h 3 v 3.61328 c 0,2.42161 -1.996362,4.41797 -4.417969,4.41797 z M 53,215 v 3 h -3.644531 c -0.811504,0 -1.417969,0.60646 -1.417969,1.41797 v 3.61328 h -3 v -3.61328 C 44.9375,216.99636 46.933862,215 49.355469,215 Z m 23.9375,0 v 3 h 3.644531 C 81.393535,218 82,218.60646 82,219.41797 v 3.61328 h 3 v -3.61328 C 85,216.99636 83.003638,215 80.582031,215 Z"
         style="color:#000000;font-style:normal;font-variant:normal;font-weight:normal;font-stretch:normal;font-size:medium;line-height:normal;font-family:sans-serif;font-variant-ligatures:normal;font-variant-position:normal;font-variant-caps:normal;font-variant-numeric:normal;font-variant-alternates:normal;font-variant-east-asian:normal;font-feature-settings:normal;font-variation-settings:normal;text-indent:0;text-align:start;text-decoration:none;text-decoration-line:none;text-decoration-style:solid;text-decoration-color:#000000;letter-spacing:normal;word-spacing:normal;text-transform:none;writing-mode:lr-tb;direction:ltr;text-orientation:mixed;dominant-baseline:auto;baseline-shift:baseline;text-anchor:start;white-space:normal;shape-padding:0;shape-margin:0;inline-size:0;clip-rule:nonzero;display:inline;overflow:visible;visibility:visible;opacity:1;isolation:auto;mix-blend-mode:normal;color-interpolation:sRGB;color-interpolation-filters:linearRGB;solid-color:#000000;solid-opacity:1;vector-effect:none;fill:#1a5fb4;fill-opacity:1;fill-rule:nonzero;stroke:none;stroke-width:3;stroke-linecap:butt;stroke-linejoin:miter;stroke-miterlimit:4;stroke-dasharray:none;stroke-dashoffset:0;stroke-opacity:1;color-rendering:auto;image-rendering:auto;shape-rendering:auto;text-rendering:auto;enable-background:accumulate;stop-color:#000000;stop-opacity:1"
         id="path1384" />
      <path
         id="path1387"
         style="color:#000000;font-style:normal;font-variant:normal;font-weight:normal;font-stretch:normal;font-size:medium;line-height:normal;font-family:sans-serif;font-variant-ligatures:normal;font-variant-position:normal;font-variant-caps:normal;font-variant-numeric:normal;font-variant-alternates:normal;font-variant-east-asian:normal;font-feature-settings:normal;font-variation-settings:normal;text-indent:0;text-align:start;text-decoration:none;text-decoration-line:none;text-decoration-style:solid;text-decoration-color:#000000;letter-spacing:normal;word-spacing:normal;text-transform:none;writing-mode:lr-tb;direction:ltr;text-orientation:mixed;dominant-baseline:auto;baseline-shift:baseline;text-anchor:start;white-space:normal;shape-padding:0;shape-margin:0;inline-size:0;clip-rule:nonzero;display:inline;overflow:visible;visibility:visible;opacity:1;isolation:auto;mix-blend-mode:normal;color-interpolation:sRGB;color-interpolation-filters:linearRGB;solid-color:#000000;solid-opacity:1;vector-effect:none;fill:#1c71d8;fill-opacity:1;fill-rule:nonzero;stroke:none;stroke-width:3;stroke-linecap:butt;stroke-linejoin:miter;stroke-miterlimit:4;stroke-dasharray:none;stroke-dashoffset:0;stroke-opacity:1;color-rendering:auto;image-rendering:auto;shape-rendering:auto;text-rendering:auto;enable-background:accumulate;stop-color:#000000;stop-opacity:1"
         d="m 53,254 v -3 h -3.644531 c -0.811504,0 -1.417969,-0.60646 -1.417969,-1.41797 v -3.61328 h -3 v 3.61328 c 0,2.42161 1.996362,4.41797 4.417969,4.41797 z m 23.9375,0 v -3 h 3.644531 C 81.393535,251 82,250.39354 82,249.58203 v -3.61328 h 3 v 3.61328 C 85,252.00364 83.003638,254 80.582031,254 Z M 53,213.96875 v 3 h -3.644531 c -0.811504,0 -1.417969,0.60646 -1.417969,1.41797 V 222 h -3 v -3.61328 c 0,-2.42161 1.996362,-4.41797 4.417969,-4.41797 z m 23.9375,0 v 3 h 3.644531 c 0.811504,0 1.417969,0.60646 1.417969,1.41797 V 222 h 3 v -3.61328 c 0,-2.42161 -1.996362,-4.41797 -4.417969,-4.41797 z" />
      <rect
         y="171.99998"
         x="171"
         height="15.999999"
         width="1"
         id="rect2473"
         style="opacity:1;fill:#000000;fill-opacity:1;stroke:none;stroke-width:1;stroke-miterlimit:4;stroke-dasharray:none;stroke-opacity:1;stop-color:#000000" />
      <rect
         style="opacity:1;fill:#000000;fill-opacity:1;stroke:none;stroke-width:1;stroke-miterlimit:4;stroke-dasharray:none;stroke-opacity:1;stop-color:#000000"
         id="rect2475"
         width="1"
         height="15.999999"
         x="164"
         y="171.99998" />
      <rect
         transform="rotate(90)"
         style="opacity:1;fill:#000000;fill-opacity:1;stroke:none;stroke-width:1;stroke-miterlimit:4;stroke-dasharray:none;stroke-opacity:1;stop-color:#000000"
         id="rect2477"
         width="1"
         height="15.999999"
         x="183"
         y="-176" />
      <rect
         transform="rotate(90)"
         y="-176"
         x="176"
         height="15.999999"
         width="1"
         id="rect2479"
         style="opacity:1;fill:#000000;fill-opacity:1;stroke:none;stroke-width:1;stroke-miterlimit:4;stroke-dasharray:none;stroke-opacity:1;stop-color:#000000" />
    </g>
    <g
       sodipodi:insensitive="true"
       style="display:none"
       inkscape:label="grid"
       id="layer3"
       inkscape:groupmode="layer">
      <circle
         style="display:inline;opacity:0.1;vector-effect:none;fill:none;fill-opacity:1;stroke:#000000;stroke-width:0.99;stroke-linecap:butt;stroke-linejoin:miter;stroke-miterlimit:4;stroke-dasharray:0.99, 0.99;stroke-dashoffset:0;stroke-opacity:1;marker:none;marker-start:none;marker-mid:none;marker-end:none;paint-order:normal;enable-background:new"
         id="circle2892"
         r="59.504131"
         cy="236"
         cx="64.000031" />
      <rect
         style="display:inline;opacity:0.1;vector-effect:none;fill:none;fill-opacity:1;stroke:#000000;stroke-width:0.99;stroke-linecap:butt;stroke-linejoin:miter;stroke-miterlimit:4;stroke-dasharray:0.99, 0.99;stroke-dashoffset:0;stroke-opacity:1;marker:none;marker-start:none;marker-mid:none;marker-end:none;paint-order:normal;enable-background:new"
         id="rect2894"
         width="87.009987"
         height="111.01005"
         x="20.495007"
         y="180.49496"
         rx="8.701004"
         ry="7.9292889" />
      <rect
         style="display:inline;opacity:0.1;vector-effect:none;fill:none;fill-opacity:1;stroke:#000000;stroke-width:0.99;stroke-linecap:butt;stroke-linejoin:miter;stroke-miterlimit:4;stroke-dasharray:0.99, 0.99;stroke-dashoffset:0;stroke-opacity:1;marker:none;marker-start:none;marker-mid:none;marker-end:none;paint-order:normal;enable-background:new"
         id="rect2896"
         width="103.00952"
         height="103.00952"
         x="12.495266"
         y="184.49524"
         rx="7.9238095"
         ry="7.9238095" />
      <rect
         style="display:inline;opacity:0.1;vector-effect:none;fill:none;fill-opacity:1;stroke:#000000;stroke-width:0.99;stroke-linecap:butt;stroke-linejoin:miter;stroke-miterlimit:4;stroke-dasharray:0.99, 0.99;stroke-dashoffset:0;stroke-opacity:1;marker:none;marker-start:none;marker-mid:none;marker-end:none;paint-order:normal;enable-background:new"
         id="rect2898"
         width="111.01004"
         height="87.010048"
         x="8.4950066"
         y="200.49496"
         rx="7.9292889"
         ry="8.701005" />
      <path
         style="display:inline;fill:none;stroke:#62a0ea;stroke-width:2;stroke-linecap:butt;stroke-linejoin:miter;stroke-miterlimit:4;stroke-dasharray:none;stroke-opacity:1;enable-background:new"
         d="M 2.6203015e-5,288.99999 H 128.00003"
         id="path2900"
         inkscape:connector-curvature="0" />
    </g>
  </g>
</svg>
