<?xml version="1.0" encoding="UTF-8" standalone="no"?>
<!-- Created with Inkscape (http://www.inkscape.org/) -->

<svg
   inkscape:export-ydpi="96"
   inkscape:export-xdpi="96"
   inkscape:export-filename="Template.png"
   width="192"
   height="152"
   id="svg11300"
   sodipodi:version="0.32"
   inkscape:version="1.2.2 (b0a8486541, 2022-12-01)"
   sodipodi:docname="com.vixalien.muzika.Source.svg"
   inkscape:output_extension="org.inkscape.output.svg.inkscape"
   version="1.0"
   style="display:inline;enable-background:new"
   viewBox="0 0 192 152"
   xmlns:inkscape="http://www.inkscape.org/namespaces/inkscape"
   xmlns:sodipodi="http://sodipodi.sourceforge.net/DTD/sodipodi-0.dtd"
   xmlns:xlink="http://www.w3.org/1999/xlink"
   xmlns="http://www.w3.org/2000/svg"
   xmlns:svg="http://www.w3.org/2000/svg"
   xmlns:rdf="http://www.w3.org/1999/02/22-rdf-syntax-ns#"
   xmlns:cc="http://creativecommons.org/ns#"
   xmlns:dc="http://purl.org/dc/elements/1.1/">
  <title
     id="title4162">Adwaita Icon Template</title>
  <defs
     id="defs3">
    <linearGradient
       inkscape:collect="always"
       id="linearGradient27738">
      <stop
         style="stop-color:#1a5fb4;stop-opacity:1"
         offset="0"
         id="stop27726" />
      <stop
         style="stop-color:#3584e4;stop-opacity:1"
         offset="0.10400878"
         id="stop27728" />
      <stop
         style="stop-color:#175094;stop-opacity:1;"
         offset="0.23029737"
         id="stop27730" />
      <stop
         style="stop-color:#1a5fb4;stop-opacity:1"
         offset="0.85840994"
         id="stop27732" />
      <stop
         style="stop-color:#62a0ea;stop-opacity:1"
         offset="0.9351024"
         id="stop27734" />
      <stop
         style="stop-color:#1c71d8;stop-opacity:1"
         offset="1"
         id="stop27736" />
    </linearGradient>
    <inkscape:path-effect
       effect="fillet_chamfer"
       id="path-effect27205"
       is_visible="true"
       lpeversion="1"
       nodesatellites_param="IF,0,1,1,0,5.3283138,0,1 @ F,0,0,1,0,5.3283138,0,1 @ F,0,0,1,0,4,0,1 @ F,0,0,1,0,4,0,1 @ F,0,0,1,0,8,0,1 @ F,0,0,1,0,4,0,1 @ F,0,0,1,0,0,0,1 @ F,0,0,1,0,0,0,1 @ F,0,0,1,0,0,0,1 @ F,0,0,1,0,0,0,1 @ F,0,0,1,0,0,0,1 @ F,0,0,1,0,0,0,1 @ F,0,0,1,0,0,0,1 @ F,0,0,1,0,0,0,1 @ F,0,0,1,0,0,0,1 @ F,0,0,1,0,0,0,1 @ F,0,0,1,0,0,0,1 @ F,0,0,1,0,0,0,1 @ F,0,0,1,0,0,0,1 @ F,0,0,1,0,0,0,1 @ F,0,0,1,0,0,0,1 @ F,0,0,1,0,0,0,1 @ F,0,0,1,0,0,0,1"
       unit="px"
       method="auto"
       mode="F"
       radius="0"
       chamfer_steps="1"
       flexible="false"
       use_knot_distance="true"
       apply_no_radius="true"
       apply_with_radius="true"
       only_selected="false"
       hide_knots="false" />
    <inkscape:path-effect
       effect="fillet_chamfer"
       id="path-effect27201"
       is_visible="true"
       lpeversion="1"
       nodesatellites_param="IF,0,1,1,0,5.3283138,0,1 @ F,0,0,1,0,5.3283138,0,1 @ F,0,0,1,0,4,0,1 @ F,0,0,1,0,4,0,1 @ F,0,0,1,0,8,0,1 @ F,0,0,1,0,4,0,1 @ F,0,0,1,0,0,0,1 @ F,0,0,1,0,0,0,1 @ F,0,0,1,0,0,0,1 @ F,0,0,1,0,0,0,1 @ F,0,0,1,0,0,0,1 @ F,0,0,1,0,0,0,1 @ F,0,0,1,0,0,0,1 @ F,0,0,1,0,0,0,1 @ F,0,0,1,0,0,0,1 @ F,0,0,1,0,0,0,1 @ F,0,0,1,0,0,0,1 @ F,0,0,1,0,0,0,1 @ F,0,0,1,0,0,0,1 @ F,0,0,1,0,0,0,1 @ F,0,0,1,0,0,0,1 @ F,0,0,1,0,0,0,1 @ F,0,0,1,0,0,0,1"
       unit="px"
       method="auto"
       mode="F"
       radius="0"
       chamfer_steps="1"
       flexible="false"
       use_knot_distance="true"
       apply_no_radius="true"
       apply_with_radius="true"
       only_selected="false"
       hide_knots="false" />
    <inkscape:path-effect
       effect="fillet_chamfer"
       id="path-effect27197"
       is_visible="true"
       lpeversion="1"
       nodesatellites_param="F,0,0,1,0,24,0,1 @ F,0,0,1,0,24,0,1 @ F,0,0,1,0,24,0,1"
       unit="px"
       method="auto"
       mode="F"
       radius="24"
       chamfer_steps="1"
       flexible="false"
       use_knot_distance="true"
       apply_no_radius="true"
       apply_with_radius="true"
       only_selected="false"
       hide_knots="false" />
    <inkscape:path-effect
       effect="fillet_chamfer"
       id="path-effect27193"
       is_visible="true"
       lpeversion="1"
       nodesatellites_param="F,0,0,1,0,24,0,1 @ F,0,0,1,0,24,0,1 @ F,0,0,1,0,24,0,1"
       unit="px"
       method="auto"
       mode="F"
       radius="24"
       chamfer_steps="1"
       flexible="false"
       use_knot_distance="true"
       apply_no_radius="true"
       apply_with_radius="true"
       only_selected="false"
       hide_knots="false" />
    <linearGradient
       inkscape:collect="always"
       id="linearGradient25601">
      <stop
         style="stop-color:#c64600;stop-opacity:1"
         offset="0"
         id="stop25597" />
      <stop
         style="stop-color:#ffa348;stop-opacity:1"
         offset="1"
         id="stop25599" />
    </linearGradient>
    <linearGradient
       inkscape:collect="always"
       id="linearGradient25425">
      <stop
         style="stop-color:#e5a50a;stop-opacity:1;"
         offset="0"
         id="stop25421" />
      <stop
         style="stop-color:#e5cf94;stop-opacity:1;"
         offset="0.06369614"
         id="stop25429" />
      <stop
         style="stop-color:#e5a50a;stop-opacity:1;"
         offset="0.14844903"
         id="stop25431" />
      <stop
         style="stop-color:#8c6409;stop-opacity:1;"
         offset="0.27056524"
         id="stop25433" />
      <stop
         style="stop-color:#e5a50a;stop-opacity:1;"
         offset="0.32425764"
         id="stop25435" />
      <stop
         style="stop-color:#e5a50a;stop-opacity:1;"
         offset="0.38120636"
         id="stop25437" />
      <stop
         style="stop-color:#e5d29e;stop-opacity:1;"
         offset="0.47803009"
         id="stop25439" />
      <stop
         style="stop-color:#815d07;stop-opacity:1;"
         offset="0.58430463"
         id="stop25441" />
      <stop
         style="stop-color:#e5a50a;stop-opacity:1;"
         offset="0.64942467"
         id="stop25443" />
      <stop
         style="stop-color:#e5a50a;stop-opacity:1;"
         offset="0.71275747"
         id="stop25445" />
      <stop
         style="stop-color:#ffde90;stop-opacity:1;"
         offset="0.82060939"
         id="stop25447" />
      <stop
         style="stop-color:#e5a50a;stop-opacity:1;"
         offset="0.94866282"
         id="stop25449" />
      <stop
         style="stop-color:#e5a50a;stop-opacity:1;"
         offset="1"
         id="stop25423" />
    </linearGradient>
    <linearGradient
       inkscape:collect="always"
       id="linearGradient24961">
      <stop
         style="stop-color:#f8e45c;stop-opacity:1"
         offset="0"
         id="stop24957" />
      <stop
         style="stop-color:#f6d32d;stop-opacity:1"
         offset="1"
         id="stop24959" />
    </linearGradient>
    <inkscape:path-effect
       effect="fillet_chamfer"
       id="path-effect24776"
       is_visible="true"
       lpeversion="1"
       nodesatellites_param="IF,0,1,1,0,5.3283138,0,1 @ F,0,0,1,0,5.3283138,0,1 @ F,0,0,1,0,4,0,1 @ F,0,0,1,0,4,0,1 @ F,0,0,1,0,8,0,1 @ F,0,0,1,0,4,0,1 @ F,0,0,1,0,0,0,1 @ F,0,0,1,0,0,0,1 @ F,0,0,1,0,0,0,1 @ F,0,0,1,0,0,0,1 @ F,0,0,1,0,0,0,1 @ F,0,0,1,0,0,0,1 @ F,0,0,1,0,0,0,1 @ F,0,0,1,0,0,0,1 @ F,0,0,1,0,0,0,1 @ F,0,0,1,0,0,0,1 @ F,0,0,1,0,0,0,1 @ F,0,0,1,0,0,0,1 @ F,0,0,1,0,0,0,1 @ F,0,0,1,0,0,0,1 @ F,0,0,1,0,0,0,1 @ F,0,0,1,0,0,0,1 @ F,0,0,1,0,0,0,1"
       unit="px"
       method="auto"
       mode="F"
       radius="0"
       chamfer_steps="1"
       flexible="false"
       use_knot_distance="true"
       apply_no_radius="true"
       apply_with_radius="true"
       only_selected="false"
       hide_knots="false" />
    <inkscape:path-effect
       effect="fillet_chamfer"
       id="path-effect24536"
       is_visible="true"
       lpeversion="1"
       nodesatellites_param="IF,0,1,1,0,5.3283138,0,1 @ F,0,0,1,0,5.3283138,0,1 @ F,0,0,1,0,4,0,1 @ F,0,0,1,0,4,0,1 @ F,0,0,1,0,8,0,1 @ F,0,0,1,0,4,0,1 @ F,0,0,1,0,0,0,1 @ F,0,0,1,0,0,0,1 @ F,0,0,1,0,0,0,1 @ F,0,0,1,0,0,0,1 @ F,0,0,1,0,0,0,1 @ F,0,0,1,0,0,0,1 @ F,0,0,1,0,0,0,1 @ F,0,0,1,0,0,0,1 @ F,0,0,1,0,0,0,1 @ F,0,0,1,0,0,0,1 @ F,0,0,1,0,0,0,1 @ F,0,0,1,0,0,0,1 @ F,0,0,1,0,0,0,1 @ F,0,0,1,0,0,0,1 @ F,0,0,1,0,0,0,1 @ F,0,0,1,0,0,0,1 @ F,0,0,1,0,0,0,1"
       unit="px"
       method="auto"
       mode="F"
       radius="0"
       chamfer_steps="1"
       flexible="false"
       use_knot_distance="true"
       apply_no_radius="true"
       apply_with_radius="true"
       only_selected="false"
       hide_knots="false" />
    <inkscape:path-effect
       effect="fillet_chamfer"
       id="path-effect24531"
       is_visible="true"
       lpeversion="1"
       nodesatellites_param="F,0,0,1,0,0,0,1 @ F,0,0,1,0,0,0,1 @ F,0,0,1,0,0,0,1 @ F,0,0,1,0,0,0,1 @ F,0,0,1,0,0,0,1 @ F,0,0,1,0,0,0,1 @ F,0,0,1,0,0,0,1 @ F,0,0,1,0,0,0,1 @ F,0,0,1,0,0,0,1 @ F,0,0,1,0,0,0,1 @ F,0,0,1,0,0,0,1 @ F,0,0,1,0,0,0,1 @ F,0,0,1,0,0,0,1 @ F,0,0,1,0,0,0,1 @ F,0,0,1,0,0,0,1 @ F,0,0,1,0,0,0,1 @ F,0,0,1,0,0,0,1 @ F,0,0,1,0,0,0,1 @ F,0,0,1,0,0,0,1 @ F,0,0,1,0,0,0,1 @ F,0,0,1,0,0,0,1 @ F,0,0,1,0,0,0,1 @ F,0,0,1,0,0,0,1 @ F,0,0,1,0,0,0,1 @ F,0,0,1,0,0,0,1 @ F,0,0,1,0,0,0,1 | F,0,0,1,0,0,0,1 @ F,0,0,1,0,0,0,1 @ F,0,0,1,0,0,0,1 @ F,0,0,1,0,0,0,1"
       unit="px"
       method="auto"
       mode="F"
       radius="0"
       chamfer_steps="1"
       flexible="false"
       use_knot_distance="true"
       apply_no_radius="true"
       apply_with_radius="true"
       only_selected="false"
       hide_knots="false" />
    <inkscape:path-effect
       effect="fillet_chamfer"
       id="path-effect24359"
       is_visible="true"
       lpeversion="1"
       nodesatellites_param="F,0,0,1,0,0,0,1 @ F,0,0,1,0,0,0,1 @ F,0,0,1,0,0,0,1 @ F,0,0,1,0,0,0,1 @ F,0,0,1,0,0,0,1 @ F,0,0,1,0,0,0,1 @ F,0,0,1,0,0,0,1 @ F,0,0,1,0,0,0,1 @ F,0,0,1,0,0,0,1 @ F,0,0,1,0,0,0,1 @ F,0,0,1,0,0,0,1 @ F,0,0,1,0,0,0,1 @ F,0,0,1,0,0,0,1 @ F,0,0,1,0,5.42969,0,1 @ F,0,0,1,0,5.71484,0,1 @ F,0,0,1,0,0,0,1 @ F,0,0,1,0,0,0,1 @ F,0,0,1,0,0,0,1 @ F,0,0,1,0,5.14258,0,1 @ F,0,0,1,0,5.42773,0,1 @ F,0,0,1,0,0,0,1 @ F,0,0,1,0,0,0,1 @ F,0,0,1,0,0,0,1 @ F,0,0,1,0,0,0,1"
       unit="px"
       method="auto"
       mode="F"
       radius="0"
       chamfer_steps="1"
       flexible="false"
       use_knot_distance="true"
       apply_no_radius="true"
       apply_with_radius="true"
       only_selected="false"
       hide_knots="false" />
    <inkscape:path-effect
       effect="fillet_chamfer"
       id="path-effect8030"
       is_visible="true"
       lpeversion="1"
       nodesatellites_param="F,0,0,1,0,0,0,1 @ F,0,0,1,0,9.1785704,0,1 @ F,0,0,1,0,0,0,1"
       unit="px"
       method="auto"
       mode="F"
       radius="0"
       chamfer_steps="1"
       flexible="false"
       use_knot_distance="true"
       apply_no_radius="true"
       apply_with_radius="true"
       only_selected="false"
       hide_knots="false" />
    <inkscape:path-effect
       effect="fillet_chamfer"
       id="path-effect8024"
       is_visible="true"
       lpeversion="1"
       nodesatellites_param="F,0,0,1,0,0,0,1 @ F,0,0,1,0,13,0,1 @ F,0,0,1,0,0,0,1"
       unit="px"
       method="auto"
       mode="F"
       radius="0"
       chamfer_steps="1"
       flexible="false"
       use_knot_distance="true"
       apply_no_radius="true"
       apply_with_radius="true"
       only_selected="false"
       hide_knots="false" />
    <linearGradient
       inkscape:collect="always"
       id="linearGradient1863">
      <stop
         style="stop-color:#ffa348;stop-opacity:1"
         offset="0"
         id="stop1859" />
      <stop
         style="stop-color:#e66100;stop-opacity:1"
         offset="1"
         id="stop1861" />
    </linearGradient>
    <linearGradient
       y2="236"
       x2="96"
       y1="236"
       x1="32"
       gradientTransform="translate(604.81684,170.58641)"
       gradientUnits="userSpaceOnUse"
       id="linearGradient1099"
       xlink:href="#linearGradient1036" />
    <linearGradient
       id="linearGradient1036">
      <stop
         id="stop1032"
         offset="0"
         style="stop-color:#d5d3cf;stop-opacity:1;" />
      <stop
         id="stop1034"
         offset="1"
         style="stop-color:#f6f5f4;stop-opacity:1" />
    </linearGradient>
    <radialGradient
       r="32"
       fy="-76"
       fx="-244"
       cy="-76"
       cx="-244"
       gradientTransform="matrix(0.88333331,0,0,0.88333331,-460.35018,463.11973)"
       gradientUnits="userSpaceOnUse"
       id="radialGradient1103"
       xlink:href="#linearGradient1069" />
    <linearGradient
       id="linearGradient1069">
      <stop
         id="stop1065"
         offset="0"
         style="stop-color:#d5d3cf;stop-opacity:1" />
      <stop
         id="stop1067-1"
         offset="1"
         style="stop-color:#949390;stop-opacity:1" />
    </linearGradient>
    <linearGradient
       gradientUnits="userSpaceOnUse"
       y2="232"
       x2="64"
       y1="262.5"
       x1="64"
       id="linearGradient1027"
       xlink:href="#linearGradient1025"
       gradientTransform="translate(-470.5864,432.81685)" />
    <linearGradient
       id="linearGradient1025">
      <stop
         id="stop1021"
         offset="0"
         style="stop-color:#9a9996;stop-opacity:1" />
      <stop
         id="stop1023"
         offset="1"
         style="stop-color:#77767b;stop-opacity:1" />
    </linearGradient>
    <inkscape:path-effect
       effect="spiro"
       id="path-effect35304-9"
       is_visible="true" />
    <clipPath
       clipPathUnits="userSpaceOnUse"
       id="clipPath1609-7">
      <path
         sodipodi:nodetypes="cccccc"
         inkscape:connector-curvature="0"
         id="path1611-5"
         d="m 252,116 28,-28 v -8 h -36 v 36 z"
         style="fill:#e74747;stroke:none;stroke-width:0.25px;stroke-linecap:butt;stroke-linejoin:miter;stroke-opacity:1" />
    </clipPath>
    <linearGradient
       id="linearGradient1697">
      <stop
         id="stop1685"
         offset="0"
         style="stop-color:#deddda;stop-opacity:1" />
      <stop
         style="stop-color:#eeeeec;stop-opacity:1"
         offset="0.04545455"
         id="stop1687" />
      <stop
         id="stop1689"
         offset="0.09090909"
         style="stop-color:#deddda;stop-opacity:1" />
      <stop
         style="stop-color:#deddda;stop-opacity:1"
         offset="0.90909094"
         id="stop1691" />
      <stop
         id="stop1693"
         offset="0.95454544"
         style="stop-color:#eeeeec;stop-opacity:1" />
      <stop
         id="stop1695"
         offset="1"
         style="stop-color:#c0bfbc;stop-opacity:1" />
    </linearGradient>
    <clipPath
       clipPathUnits="userSpaceOnUse"
       id="clipPath1289">
      <path
         style="display:inline;opacity:1;vector-effect:none;fill:none;fill-opacity:1;stroke:#000000;stroke-width:4;stroke-linecap:round;stroke-linejoin:round;stroke-miterlimit:4;stroke-dasharray:none;stroke-dashoffset:0;stroke-opacity:1;marker:none;marker-start:none;marker-mid:none;marker-end:none;paint-order:normal;enable-background:new"
         d="m 64,-148 h 64 l 64,-64 64,64 h 192 c 17.728,0 32,14.272 32,32 v 288 c 0,17.728 -14.272,32 -32,32 H 256 l -64,-64 -64,64 H 64 C 46.272,204 32,189.728 32,172 v -288 c 0,-17.728 14.408898,-34.19889 32,-32 z"
         id="path1291"
         inkscape:connector-curvature="0"
         sodipodi:nodetypes="scccsssscccssss" />
    </clipPath>
    <linearGradient
       id="paint3_linear-2-6-5"
       x2="1"
       gradientUnits="userSpaceOnUse"
       gradientTransform="matrix(0,6,-12,0,-64,209.99687)">
      <stop
         stop-color="#C01C27"
         id="stop91-0-7-4" />
      <stop
         offset="1"
         stop-color="#E01B24"
         id="stop93-2-5-7" />
    </linearGradient>
    <clipPath
       clipPathUnits="userSpaceOnUse"
       id="clipPath1609">
      <path
         sodipodi:nodetypes="cccccc"
         inkscape:connector-curvature="0"
         id="path1611"
         d="m 252,116 28,-28 v -8 h -36 v 36 z"
         style="fill:#e74747;stroke:none;stroke-width:0.25px;stroke-linecap:butt;stroke-linejoin:miter;stroke-opacity:1" />
    </clipPath>
    <radialGradient
       inkscape:collect="always"
       xlink:href="#linearGradient1863"
       id="radialGradient1865"
       cx="61.799839"
       cy="240.09778"
       fx="61.799839"
       fy="240.09778"
       r="46.004772"
       gradientUnits="userSpaceOnUse"
       gradientTransform="matrix(0.53873491,0.93311623,-0.86602544,0.49999994,176.4369,62.382475)" />
    <linearGradient
       inkscape:collect="always"
       xlink:href="#linearGradient27738"
       id="linearGradient22789"
       gradientUnits="userSpaceOnUse"
       x1="14"
       y1="284"
       x2="112"
       y2="284" />
    <linearGradient
       inkscape:collect="always"
       id="linearGradient20794">
      <stop
         style="stop-color:#c64600;stop-opacity:1"
         offset="0"
         id="stop20790" />
      <stop
         style="stop-color:#ff7800;stop-opacity:1"
         offset="0.10400878"
         id="stop20802" />
      <stop
         style="stop-color:#c64600;stop-opacity:1"
         offset="0.23029737"
         id="stop20804" />
      <stop
         style="stop-color:#c64600;stop-opacity:1"
         offset="0.85840994"
         id="stop20800" />
      <stop
         style="stop-color:#e66100;stop-opacity:1"
         offset="0.9351024"
         id="stop20798" />
      <stop
         style="stop-color:#ff7800;stop-opacity:1"
         offset="1"
         id="stop20792" />
    </linearGradient>
    <inkscape:path-effect
       effect="fillet_chamfer"
       id="path-effect22783"
       is_visible="true"
       lpeversion="1"
       nodesatellites_param="F,0,0,1,0,24,0,1 @ F,0,0,1,0,24,0,1 @ F,0,0,1,0,24,0,1"
       unit="px"
       method="auto"
       mode="F"
       radius="24"
       chamfer_steps="1"
       flexible="false"
       use_knot_distance="true"
       apply_no_radius="true"
       apply_with_radius="true"
       only_selected="false"
       hide_knots="false" />
    <inkscape:path-effect
       effect="fillet_chamfer"
       id="path-effect22787"
       is_visible="true"
       lpeversion="1"
       nodesatellites_param="F,0,0,1,0,24,0,1 @ F,0,0,1,0,24,0,1 @ F,0,0,1,0,24,0,1"
       unit="px"
       method="auto"
       mode="F"
       radius="24"
       chamfer_steps="1"
       flexible="false"
       use_knot_distance="true"
       apply_no_radius="true"
       apply_with_radius="true"
       only_selected="false"
       hide_knots="false" />
    <clipPath
       clipPathUnits="userSpaceOnUse"
       id="clipPath19045">
      <path
         style="fill:none;stroke:#000000;stroke-width:1px;stroke-linecap:butt;stroke-linejoin:miter;stroke-opacity:1"
         d="m 10,196 v 76 a 14.489571,14.489571 31.12073 0 0 21.238037,12.82209 l 71.523923,-37.64418 a 13.049532,13.049532 90.775733 0 0 0.31043,-22.92674 L 30.927611,183.74883 A 14.049763,14.049763 149.655 0 0 10,196 Z"
         id="path19047"
         sodipodi:nodetypes="cccc" />
    </clipPath>
    <linearGradient
       inkscape:collect="always"
       xlink:href="#linearGradient20794"
       id="linearGradient27207"
       gradientUnits="userSpaceOnUse"
       x1="14"
       y1="284"
       x2="112"
       y2="284" />
    <linearGradient
       inkscape:collect="always"
       xlink:href="#linearGradient25601"
       id="linearGradient27209"
       gradientUnits="userSpaceOnUse"
       x1="82.000267"
       y1="270"
       x2="40.000271"
       y2="206" />
    <linearGradient
       inkscape:collect="always"
       xlink:href="#linearGradient25425"
       id="linearGradient27211"
       gradientUnits="userSpaceOnUse"
       x1="10.00027"
       y1="278"
       x2="112.00027"
       y2="278" />
    <linearGradient
       inkscape:collect="always"
       xlink:href="#linearGradient24961"
       id="linearGradient27213"
       gradientUnits="userSpaceOnUse"
       x1="28.000271"
       y1="204"
       x2="54.000271"
       y2="254" />
    <linearGradient
       inkscape:collect="always"
       xlink:href="#linearGradient27738-6"
       id="linearGradient22789-3"
       gradientUnits="userSpaceOnUse"
       x1="14"
       y1="284"
       x2="112"
       y2="284"
       gradientTransform="matrix(1.0285907,0,0,1.0285907,-4.2445049,-7.5721603)" />
    <linearGradient
       inkscape:collect="always"
       id="linearGradient27738-6">
      <stop
         style="stop-color:#0d3a6e;stop-opacity:1;"
         offset="0"
         id="stop27726-7" />
      <stop
         style="stop-color:#3584e4;stop-opacity:1"
         offset="0.10400878"
         id="stop27728-5" />
      <stop
         style="stop-color:#0e315a;stop-opacity:1;"
         offset="0.23029737"
         id="stop27730-3" />
      <stop
         style="stop-color:#174f96;stop-opacity:1;"
         offset="0.85840994"
         id="stop27732-5" />
      <stop
         style="stop-color:#4676ab;stop-opacity:1;"
         offset="0.9351024"
         id="stop27734-6" />
      <stop
         style="stop-color:#050f1d;stop-opacity:1;"
         offset="1"
         id="stop27736-2" />
    </linearGradient>
    <inkscape:path-effect
       effect="fillet_chamfer"
       id="path-effect22783-9"
       is_visible="true"
       lpeversion="1"
       nodesatellites_param="F,0,0,1,0,24,0,1 @ F,0,0,1,0,27.29214,0,1 @ F,0,0,1,0,24,0,1"
       unit="px"
       method="auto"
       mode="F"
       radius="24"
       chamfer_steps="1"
       flexible="false"
       use_knot_distance="true"
       apply_no_radius="true"
       apply_with_radius="true"
       only_selected="false"
       hide_knots="false" />
    <inkscape:path-effect
       effect="fillet_chamfer"
       id="path-effect22787-1"
       is_visible="true"
       lpeversion="1"
       nodesatellites_param="F,0,0,1,0,24,0,1 @ F,0,0,1,0,24,0,1 @ F,0,0,1,0,24,0,1"
       unit="px"
       method="auto"
       mode="F"
       radius="24"
       chamfer_steps="1"
       flexible="false"
       use_knot_distance="true"
       apply_no_radius="true"
       apply_with_radius="true"
       only_selected="false"
       hide_knots="false" />
    <clipPath
       clipPathUnits="userSpaceOnUse"
       id="clipPath19045-2">
      <path
         style="fill:none;stroke:#000000;stroke-width:1px;stroke-linecap:butt;stroke-linejoin:miter;stroke-opacity:1"
         d="m 10,196 v 76 a 14.489571,14.489571 31.12073 0 0 21.238037,12.82209 l 71.523923,-37.64418 a 13.049532,13.049532 90.775733 0 0 0.31043,-22.92674 L 30.927611,183.74883 A 14.049763,14.049763 149.655 0 0 10,196 Z"
         id="path19047-7"
         sodipodi:nodetypes="cccc" />
    </clipPath>
    <radialGradient
       inkscape:collect="always"
       xlink:href="#linearGradient32079"
       id="radialGradient32081"
       cx="101.24554"
       cy="193.87611"
       fx="101.24554"
       fy="193.87611"
       r="92"
       gradientTransform="matrix(0.60869569,-0.173913,0.07166627,0.25083238,10.478168,188.97751)"
       gradientUnits="userSpaceOnUse" />
    <linearGradient
       inkscape:collect="always"
       id="linearGradient32079">
      <stop
         style="stop-color:#89b2ea;stop-opacity:1;"
         offset="0"
         id="stop32075" />
      <stop
         style="stop-color:#62a0ea;stop-opacity:1;"
         offset="1"
         id="stop32077" />
    </linearGradient>
    <radialGradient
       inkscape:collect="always"
       xlink:href="#linearGradient32071"
       id="radialGradient32073"
       cx="-12.594324"
       cy="246.54118"
       fx="-12.594324"
       fy="246.54118"
       r="92"
       gradientTransform="matrix(0.5186643,0.1037328,-0.08695653,0.43478263,49.970862,138.11462)"
       gradientUnits="userSpaceOnUse" />
    <linearGradient
       inkscape:collect="always"
       id="linearGradient32071">
      <stop
         style="stop-color:#689bd8;stop-opacity:1;"
         offset="0"
         id="stop32067" />
      <stop
         style="stop-color:#1c71d8;stop-opacity:1;"
         offset="1"
         id="stop32069" />
    </linearGradient>
    <radialGradient
       inkscape:collect="always"
       xlink:href="#linearGradient32095"
       id="radialGradient32097"
       cx="86.000267"
       cy="198.66667"
       fx="86.000267"
       fy="198.66667"
       r="92"
       gradientTransform="matrix(1.80352e-8,0.34782612,-0.26086957,1.4691691e-8,137.82636,214.08686)"
       gradientUnits="userSpaceOnUse" />
    <linearGradient
       inkscape:collect="always"
       id="linearGradient32095">
      <stop
         style="stop-color:#3d8ff0;stop-opacity:1;"
         offset="0"
         id="stop32091" />
      <stop
         style="stop-color:#1c71d8;stop-opacity:1;"
         offset="1"
         id="stop32093" />
    </linearGradient>
    <radialGradient
       inkscape:collect="always"
       xlink:href="#linearGradient32087"
       id="radialGradient32089"
       cx="-6.9280138"
       cy="225.54424"
       fx="-6.9280138"
       fy="225.54424"
       r="92"
       gradientTransform="matrix(0.26086955,-0.08695652,0.08249436,0.24748255,21.20145,211.5793)"
       gradientUnits="userSpaceOnUse" />
    <linearGradient
       inkscape:collect="always"
       id="linearGradient32087">
      <stop
         style="stop-color:#1d71d4;stop-opacity:1;"
         offset="0"
         id="stop32083" />
      <stop
         style="stop-color:#1a5fb4;stop-opacity:1;"
         offset="1"
         id="stop32085" />
    </linearGradient>
    <inkscape:path-effect
       effect="fillet_chamfer"
       id="path-effect22783-9-6"
       is_visible="true"
       lpeversion="1"
       nodesatellites_param="F,0,0,1,0,24,0,1 @ F,0,0,1,0,27.29214,0,1 @ F,0,0,1,0,24,0,1"
       unit="px"
       method="auto"
       mode="F"
       radius="24"
       chamfer_steps="1"
       flexible="false"
       use_knot_distance="true"
       apply_no_radius="true"
       apply_with_radius="true"
       only_selected="false"
       hide_knots="false" />
  </defs>
  <sodipodi:namedview
     stroke="#ef2929"
     fill="#f57900"
     id="base"
     pagecolor="#ffffff"
     bordercolor="#666666"
     borderopacity="0.25490196"
     inkscape:pageopacity="0.0"
     inkscape:pageshadow="2"
     inkscape:zoom="2.8284271"
     inkscape:cx="-16.018274"
     inkscape:cy="11.797527"
     inkscape:current-layer="layer1"
     showgrid="true"
     inkscape:grid-bbox="true"
     inkscape:document-units="px"
     inkscape:showpageshadow="false"
     inkscape:window-width="1920"
     inkscape:window-height="1016"
     inkscape:window-x="0"
     inkscape:window-y="27"
     width="400px"
     height="300px"
     inkscape:snap-nodes="true"
     inkscape:snap-bbox="true"
     objecttolerance="7"
     gridtolerance="12"
     guidetolerance="13"
     inkscape:window-maximized="1"
     inkscape:pagecheckerboard="false"
     showguides="false"
     inkscape:guide-bbox="true"
     inkscape:locked="false"
     inkscape:measure-start="0,0"
     inkscape:measure-end="0,0"
     inkscape:object-nodes="true"
     inkscape:bbox-nodes="true"
     inkscape:snap-global="true"
     inkscape:object-paths="true"
     inkscape:snap-intersection-paths="true"
     inkscape:snap-bbox-edge-midpoints="true"
     inkscape:snap-bbox-midpoints="true"
     showborder="true"
     inkscape:snap-center="true"
     inkscape:snap-object-midpoints="true"
     inkscape:snap-midpoints="true"
     inkscape:snap-smooth-nodes="true"
     inkscape:snap-text-baseline="true"
     borderlayer="true"
     inkscape:deskcolor="#d1d1d1">
    <inkscape:grid
       type="xygrid"
       id="grid5883"
       spacingx="2"
       spacingy="2"
       enabled="true"
       visible="true"
       empspacing="4"
       originx="8"
       originy="8" />
    <sodipodi:guide
       position="72,16"
       orientation="0,1"
       id="guide1073"
       inkscape:locked="false"
       inkscape:label=""
       inkscape:color="rgb(0,0,255)" />
    <sodipodi:guide
       position="20,72"
       orientation="1,0"
       id="guide1075"
       inkscape:locked="false"
       inkscape:label=""
       inkscape:color="rgb(0,0,255)" />
    <sodipodi:guide
       position="72,112"
       orientation="0,1"
       id="guide1099"
       inkscape:locked="false"
       inkscape:label=""
       inkscape:color="rgb(0,0,255)" />
    <sodipodi:guide
       position="72,136"
       orientation="0,1"
       id="guide993"
       inkscape:locked="false"
       inkscape:label=""
       inkscape:color="rgb(0,0,255)" />
    <sodipodi:guide
       position="112,72"
       orientation="1,0"
       id="guide995"
       inkscape:locked="false"
       inkscape:label=""
       inkscape:color="rgb(0,0,255)" />
    <sodipodi:guide
       position="8.0000001,72"
       orientation="1,0"
       id="guide867"
       inkscape:locked="false"
       inkscape:label=""
       inkscape:color="rgb(0,0,255)" />
    <sodipodi:guide
       position="128,72"
       orientation="1,0"
       id="guide869"
       inkscape:locked="false"
       inkscape:label=""
       inkscape:color="rgb(0,0,255)" />
    <sodipodi:guide
       position="72,124"
       orientation="0,1"
       id="guide871"
       inkscape:locked="false"
       inkscape:label=""
       inkscape:color="rgb(0,0,255)" />
    <inkscape:grid
       type="xygrid"
       id="grid873"
       spacingx="1"
       spacingy="1"
       empspacing="8"
       color="#000000"
       opacity="0.49019608"
       empcolor="#000000"
       empopacity="0.08627451"
       dotted="true"
       originx="8"
       originy="8" />
    <sodipodi:guide
       position="32,72"
       orientation="1,0"
       id="guide877"
       inkscape:locked="false"
       inkscape:label=""
       inkscape:color="rgb(0,0,255)" />
    <sodipodi:guide
       position="124,72"
       orientation="1,0"
       id="guide879"
       inkscape:locked="false"
       inkscape:label=""
       inkscape:color="rgb(0,0,255)" />
    <sodipodi:guide
       position="72,128"
       orientation="0,1"
       id="guide881"
       inkscape:locked="false"
       inkscape:label=""
       inkscape:color="rgb(0,0,255)" />
    <sodipodi:guide
       position="72,20"
       orientation="0,1"
       id="guide883"
       inkscape:locked="false"
       inkscape:label=""
       inkscape:color="rgb(0,0,255)" />
    <sodipodi:guide
       position="16,72"
       orientation="1,0"
       id="guide885"
       inkscape:locked="false"
       inkscape:label=""
       inkscape:color="rgb(0,0,255)" />
    <sodipodi:guide
       position="136,72"
       orientation="1,0"
       id="guide887"
       inkscape:locked="false"
       inkscape:label=""
       inkscape:color="rgb(0,0,255)" />
    <sodipodi:guide
       position="72,8"
       orientation="0,1"
       id="guide897"
       inkscape:locked="false"
       inkscape:label=""
       inkscape:color="rgb(0,0,255)" />
    <sodipodi:guide
       position="72,32"
       orientation="0,1"
       id="guide899"
       inkscape:locked="false"
       inkscape:label=""
       inkscape:color="rgb(0,0,255)" />
    <sodipodi:guide
       position="264,264"
       orientation="-0.70710678,0.70710678"
       id="guide950"
       inkscape:locked="false"
       inkscape:label=""
       inkscape:color="rgb(0,0,255)" />
    <sodipodi:guide
       position="72,72"
       orientation="0.70710678,0.70710678"
       id="guide952"
       inkscape:locked="false"
       inkscape:label=""
       inkscape:color="rgb(0,0,255)" />
  </sodipodi:namedview>
  <metadata
     id="metadata4">
    <rdf:RDF>
      <cc:Work
         rdf:about="">
        <dc:format>image/svg+xml</dc:format>
        <dc:type
           rdf:resource="http://purl.org/dc/dcmitype/StillImage" />
        <dc:creator>
          <cc:Agent>
            <dc:title>GNOME Design Team</dc:title>
          </cc:Agent>
        </dc:creator>
        <dc:source />
        <cc:license
           rdf:resource="http://creativecommons.org/licenses/by-sa/4.0/" />
        <dc:title>Adwaita Icon Template</dc:title>
        <dc:subject>
          <rdf:Bag />
        </dc:subject>
        <dc:date />
        <dc:rights>
          <cc:Agent>
            <dc:title />
          </cc:Agent>
        </dc:rights>
        <dc:publisher>
          <cc:Agent>
            <dc:title />
          </cc:Agent>
        </dc:publisher>
        <dc:identifier />
        <dc:relation />
        <dc:language />
        <dc:coverage />
        <dc:description />
        <dc:contributor>
          <cc:Agent>
            <dc:title />
          </cc:Agent>
        </dc:contributor>
      </cc:Work>
      <cc:License
         rdf:about="http://creativecommons.org/licenses/by-sa/4.0/">
        <cc:permits
           rdf:resource="http://creativecommons.org/ns#Reproduction" />
        <cc:permits
           rdf:resource="http://creativecommons.org/ns#Distribution" />
        <cc:requires
           rdf:resource="http://creativecommons.org/ns#Notice" />
        <cc:requires
           rdf:resource="http://creativecommons.org/ns#Attribution" />
        <cc:permits
           rdf:resource="http://creativecommons.org/ns#DerivativeWorks" />
        <cc:requires
           rdf:resource="http://creativecommons.org/ns#ShareAlike" />
      </cc:License>
    </rdf:RDF>
  </metadata>
  <g
     id="layer1"
     inkscape:label="App Icon"
     inkscape:groupmode="layer"
     style="display:inline"
     transform="translate(8,-156)">
    <g
       inkscape:groupmode="layer"
       id="layer4"
       inkscape:label="template"
       style="display:inline"
       sodipodi:insensitive="true">
      <rect
         inkscape:label="0"
         y="172"
         x="9.2651362e-08"
         height="128"
         width="128"
         id="hicolor"
         style="display:inline;overflow:visible;visibility:visible;fill:#f0f0f0;fill-opacity:0;fill-rule:nonzero;stroke:none;stroke-width:0.5;marker:none;enable-background:accumulate" />
      <rect
         style="display:inline;overflow:visible;visibility:visible;fill:#f0f0f0;fill-opacity:0;fill-rule:nonzero;stroke:none;stroke-width:0.5;marker:none;enable-background:accumulate"
         id="symbolic"
         width="16"
         height="16"
         x="160"
         y="172"
         inkscape:label="0" />
    </g>
    <g
       inkscape:groupmode="layer"
       id="layer2"
       inkscape:label="baseplate"
       style="display:inline"
       sodipodi:insensitive="true">
      <g
         style="display:inline;fill:#000000;enable-background:new"
         transform="matrix(7.9911709,0,0,8.0036407,-167.7909,-4846.0776)"
         id="g12027"
         inkscape:export-xdpi="12"
         inkscape:export-ydpi="12" />
      <rect
         style="display:inline;overflow:visible;visibility:visible;fill:#f0f0f0;fill-opacity:1;fill-rule:nonzero;stroke:none;stroke-width:0.5;marker:none;enable-background:accumulate"
         id="128"
         width="128"
         height="128"
         x="9.2651362e-08"
         y="172"
         inkscape:label="0" />
      <g
         id="g883"
         style="fill:none;fill-opacity:0.25098;stroke:#a579b3;stroke-opacity:1"
         transform="translate(-24,24)" />
      <g
         id="g900"
         style="fill:none;fill-opacity:0.25098;stroke:#a579b3;stroke-opacity:1"
         transform="translate(-24,24)" />
      <rect
         inkscape:label=""
         y="172"
         x="160"
         height="16"
         width="16"
         id="16"
         style="display:inline;overflow:visible;visibility:visible;fill:#f0f0f0;fill-opacity:1;fill-rule:nonzero;stroke:none;stroke-width:0.5;marker:none;enable-background:accumulate" />
      <text
         xml:space="preserve"
         style="font-style:normal;font-variant:normal;font-weight:bold;font-stretch:normal;font-size:4px;line-height:125%;font-family:Cantarell;-inkscape-font-specification:'Cantarell, Bold';text-align:start;writing-mode:lr-tb;text-anchor:start;display:inline;fill:#000000;fill-opacity:1;stroke:none;stroke-width:0.332649;enable-background:new"
         x="0"
         y="167"
         id="text863"
         inkscape:label="icon-name"><tspan
           style="font-size:4px;stroke-width:0.332649"
           sodipodi:role="line"
           id="tspan861"
           x="0"
           y="167">Hicolor</tspan></text>
      <text
         inkscape:label="icon-name"
         id="text867"
         y="167"
         x="160"
         style="font-style:normal;font-variant:normal;font-weight:bold;font-stretch:normal;font-size:4px;line-height:125%;font-family:Cantarell;-inkscape-font-specification:'Cantarell, Bold';text-align:start;writing-mode:lr-tb;text-anchor:start;display:inline;fill:#000000;fill-opacity:1;stroke:none;stroke-width:0.332649;enable-background:new"
         xml:space="preserve"><tspan
           y="167"
           x="160"
           id="tspan865"
           sodipodi:role="line"
           style="font-size:4px;stroke-width:0.332649">Symbolic</tspan></text>
    </g>
    <g
       inkscape:groupmode="layer"
       id="layer9"
       inkscape:label="icons"
       style="display:inline">
      <g
         id="g22320"
         transform="translate(-140)">
        <rect
           style="fill:#2ec27e;fill-opacity:1;stroke-width:4;stroke-linecap:round;stroke-linejoin:round;paint-order:markers stroke fill;stop-color:#000000"
           id="rect2857"
           width="8.0000019"
           height="80"
           x="42"
           y="178"
           rx="4.000001"
           ry="4.000001" />
        <circle
           style="fill:#c64600;fill-opacity:1;stroke-width:4;stroke-linecap:round;stroke-linejoin:round;paint-order:markers stroke fill;stop-color:#000000"
           id="circle1766"
           cx="4.0000305"
           cy="251.49936"
           r="46.004772" />
        <circle
           style="fill:url(#radialGradient1865);fill-opacity:1;stroke-width:4;stroke-linecap:round;stroke-linejoin:round;paint-order:markers stroke fill;stop-color:#000000"
           id="path1033"
           cx="4.0000305"
           cy="249.49936"
           r="46.004772" />
        <path
           d="m -5.754255,230.37371 c 1.12717,-0.0305 2.29044,0.23299 3.39023,0.84862 l 27.49994,15.39997 c 4.49763,2.52106 4.49763,8.99455 0,11.51561 l -27.49994,15.39997 c -4.39913,2.46254 -9.82336,-0.71632 -9.82479,-5.75781 v -30.79993 c 10e-4,-3.78111 3.05304,-6.51495 6.43456,-6.60643 z"
           style="display:inline;fill:#c64600;stroke-width:1;enable-background:new"
           id="path1764" />
        <path
           d="m -5.754255,228.37371 c 1.12717,-0.0305 2.29044,0.23299 3.39023,0.84862 l 27.49994,15.39997 c 4.49763,2.52106 4.49763,8.99455 0,11.51561 l -27.49994,15.39997 c -4.39913,2.46254 -9.82336,-0.71632 -9.82479,-5.75781 v -30.79993 c 10e-4,-3.78111 3.05304,-6.51495 6.43456,-6.60643 z"
           style="display:inline;fill:#ffbe6f;stroke-width:1;enable-background:new"
           id="path909" />
        <circle
           style="fill:#ffa348;fill-opacity:1;stroke-width:4;stroke-linecap:round;stroke-linejoin:round;paint-order:markers stroke fill;stop-color:#000000"
           id="path3786"
           cx="-22"
           cy="222"
           r="2" />
        <circle
           style="fill:#ffa348;fill-opacity:1;stroke-width:4;stroke-linecap:round;stroke-linejoin:round;paint-order:markers stroke fill;stop-color:#000000"
           id="circle3840"
           cx="-20"
           cy="226"
           r="2" />
        <circle
           style="fill:#ffa348;fill-opacity:1;stroke-width:4;stroke-linecap:round;stroke-linejoin:round;paint-order:markers stroke fill;stop-color:#000000"
           id="circle3842"
           cx="-18"
           cy="222"
           r="2" />
        <circle
           style="fill:#ffa348;fill-opacity:1;stroke-width:4;stroke-linecap:round;stroke-linejoin:round;paint-order:markers stroke fill;stop-color:#000000"
           id="circle3844"
           cx="-16"
           cy="226"
           r="2" />
        <circle
           style="fill:#ffa348;fill-opacity:1;stroke-width:4;stroke-linecap:round;stroke-linejoin:round;paint-order:markers stroke fill;stop-color:#000000"
           id="circle5451"
           cx="-24"
           cy="226"
           r="2" />
        <circle
           style="fill:#ffa348;fill-opacity:1;stroke-width:4;stroke-linecap:round;stroke-linejoin:round;paint-order:markers stroke fill;stop-color:#000000"
           id="circle5453"
           cx="-22"
           cy="230"
           r="2" />
        <circle
           style="fill:#ffa348;fill-opacity:1;stroke-width:4;stroke-linecap:round;stroke-linejoin:round;paint-order:markers stroke fill;stop-color:#000000"
           id="circle5455"
           cx="-18"
           cy="230"
           r="2" />
        <path
           style="fill:#8ff0a4;fill-opacity:1;stroke:none;stroke-width:1px;stroke-linecap:butt;stroke-linejoin:miter;stroke-opacity:1"
           d="m 46,182 v 9 a 13,13 45 0 0 13,13 h 9 z"
           id="path5676"
           inkscape:path-effect="#path-effect8024"
           inkscape:original-d="m 46,182 v 22 h 22 z" />
        <path
           style="fill:#33d17a;fill-opacity:1;stroke:none;stroke-width:1px;stroke-linecap:butt;stroke-linejoin:miter;stroke-opacity:1"
           d="m 62,198 -0.861538,-6.89231 A 10.397321,10.397321 41.437492 0 0 50.82143,182 H 46 Z"
           id="path8026"
           inkscape:path-effect="#path-effect8030"
           inkscape:original-d="M 62,198 60,182 H 46 Z"
           sodipodi:nodetypes="cccc" />
      </g>
    </g>
    <g
       inkscape:groupmode="layer"
       id="layer3"
       inkscape:label="grid"
       style="display:inline"
       sodipodi:insensitive="true">
      <circle
         cx="64.000031"
         cy="236"
         r="59.504131"
         id="circle2892"
         style="display:inline;opacity:0.1;vector-effect:none;fill:none;fill-opacity:1;stroke:#000000;stroke-width:0.99000001;stroke-linecap:butt;stroke-linejoin:miter;stroke-miterlimit:4;stroke-dasharray:0.99000001, 0.99000001;stroke-dashoffset:0;stroke-opacity:1;marker:none;marker-start:none;marker-mid:none;marker-end:none;paint-order:normal;enable-background:new" />
      <rect
         ry="7.9292889"
         rx="8.701004"
         y="180.49496"
         x="20.495007"
         height="111.01005"
         width="87.009987"
         id="rect2894"
         style="display:inline;opacity:0.1;vector-effect:none;fill:none;fill-opacity:1;stroke:#000000;stroke-width:0.99000001;stroke-linecap:butt;stroke-linejoin:miter;stroke-miterlimit:4;stroke-dasharray:0.99000001, 0.99000001;stroke-dashoffset:0;stroke-opacity:1;marker:none;marker-start:none;marker-mid:none;marker-end:none;paint-order:normal;enable-background:new" />
      <rect
         ry="7.9238095"
         rx="7.9238095"
         y="184.49524"
         x="12.495266"
         height="103.00952"
         width="103.00952"
         id="rect2896"
         style="display:inline;opacity:0.1;vector-effect:none;fill:none;fill-opacity:1;stroke:#000000;stroke-width:0.99000001;stroke-linecap:butt;stroke-linejoin:miter;stroke-miterlimit:4;stroke-dasharray:0.99000001, 0.99000001;stroke-dashoffset:0;stroke-opacity:1;marker:none;marker-start:none;marker-mid:none;marker-end:none;paint-order:normal;enable-background:new" />
      <rect
         ry="8.701005"
         rx="7.9292889"
         y="200.49496"
         x="8.4950066"
         height="87.010048"
         width="111.01004"
         id="rect2898"
         style="display:inline;opacity:0.1;vector-effect:none;fill:none;fill-opacity:1;stroke:#000000;stroke-width:0.99000001;stroke-linecap:butt;stroke-linejoin:miter;stroke-miterlimit:4;stroke-dasharray:0.99000001, 0.99000001;stroke-dashoffset:0;stroke-opacity:1;marker:none;marker-start:none;marker-mid:none;marker-end:none;paint-order:normal;enable-background:new" />
      <path
         inkscape:connector-curvature="0"
         id="path2900"
         d="M 2.6203015e-5,288.99999 H 128.00003"
         style="display:inline;fill:none;stroke:#62a0ea;stroke-width:2;stroke-linecap:butt;stroke-linejoin:miter;stroke-miterlimit:4;stroke-dasharray:none;stroke-opacity:1;enable-background:new" />
    </g>
    <g
       id="g22779"
       transform="translate(-330.00027)"
       style="display:inline;enable-background:new">
      <path
         style="display:inline;fill:url(#linearGradient22789);fill-opacity:1;stroke:none;stroke-width:1px;stroke-linecap:butt;stroke-linejoin:miter;stroke-opacity:1;enable-background:new"
         d="m 14,205 v 70 a 14.477309,14.477309 31.099271 0 0 21.229658,12.80618 l 67.540682,-35.61236 a 12.871901,12.871901 90.4045 0 0 0.16017,-22.68627 L 35.069494,192.49245 A 14.247194,14.247194 149.30523 0 0 14,205 Z"
         id="path22735"
         sodipodi:nodetypes="cccc"
         inkscape:original-d="M 14,181 V 299 L 124,241 Z"
         inkscape:path-effect="#path-effect22783" />
      <path
         style="display:inline;fill:#3584e4;fill-opacity:1;stroke:none;stroke-width:1px;stroke-linecap:butt;stroke-linejoin:miter;stroke-opacity:1;enable-background:new"
         d="m 14,200.64644 v 70 a 14.477309,14.477309 31.099271 0 0 21.229658,12.80618 l 67.540682,-35.61236 a 12.871901,12.871901 90.4045 0 0 0.16017,-22.68627 L 35.069494,188.13889 A 14.247194,14.247194 149.30523 0 0 14,200.64644 Z"
         id="path22737"
         sodipodi:nodetypes="cccc"
         inkscape:original-d="m 14,176.64644 v 118 l 110,-58 z"
         inkscape:path-effect="#path-effect22787" />
      <g
         id="g22777"
         clip-path="url(#clipPath19045)">
        <rect
           style="fill:#99c1f1;fill-opacity:1;stroke:none;stroke-width:0;stroke-linecap:round;stroke-dasharray:none;stroke-opacity:1;stop-color:#000000"
           id="rect22739"
           width="129.0625"
           height="118"
           x="2.0002699"
           y="170"
           rx="6"
           ry="6" />
        <path
           style="fill:#62a0ea;stroke:none;stroke-width:1px;stroke-linecap:butt;stroke-linejoin:miter;stroke-opacity:1"
           d="m -9.99973,220 c 0,0 36.602086,16.78091 56,16 22.76557,-0.91648 41.21599,-24 64,-24 22.78401,0 64,24 64,24 v 24 h -184 z"
           id="path27701"
           sodipodi:nodetypes="csscccc" />
        <path
           style="fill:#3584e4;stroke:none;stroke-width:1px;stroke-linecap:butt;stroke-linejoin:miter;stroke-opacity:1"
           d="m -81.99973,236 c 0,0 36.602086,16.78091 56,16 22.76557,-0.91648 41.21599,-24 64,-24 22.78401,0 64,24 64,24 v 24 h -184 z"
           id="path27699"
           sodipodi:nodetypes="csscccc" />
        <path
           style="fill:#1c71d8;stroke:none;stroke-width:1px;stroke-linecap:butt;stroke-linejoin:miter;stroke-opacity:1"
           d="m -33.99973,244 c 0,0 36.602086,16.78091 56,16 22.76557,-0.91648 41.21599,-24 64,-24 22.78401,0 64,24 64,24 v 24 h -184 z"
           id="path27697"
           sodipodi:nodetypes="csscccc" />
        <path
           style="fill:#1a5fb4;stroke:none;stroke-width:1px;stroke-linecap:butt;stroke-linejoin:miter;stroke-opacity:1"
           d="m -49.99973,260 c 0,0 36.602086,16.78091 56,16 22.76557,-0.91648 41.21599,-24 64,-24 22.78401,0 64,24 64,24 v 24 h -184 z"
           id="path27215"
           sodipodi:nodetypes="csscccc" />
      </g>
    </g>
    <g
       id="g27189"
       transform="translate(-330.00027,-120)"
       style="display:inline;enable-background:new">
      <path
         style="display:inline;fill:url(#linearGradient27207);fill-opacity:1;stroke:none;stroke-width:1px;stroke-linecap:butt;stroke-linejoin:miter;stroke-opacity:1;enable-background:new"
         d="m 14,205 v 70 a 14.477309,14.477309 31.099271 0 0 21.229658,12.80618 l 67.540682,-35.61236 a 12.871901,12.871901 90.4045 0 0 0.16017,-22.68627 L 35.069494,192.49245 A 14.247194,14.247194 149.30523 0 0 14,205 Z"
         id="path27177"
         sodipodi:nodetypes="cccc"
         inkscape:original-d="M 14,181 V 299 L 124,241 Z"
         inkscape:path-effect="#path-effect27193" />
      <path
         style="display:inline;fill:#ff7800;fill-opacity:1;stroke:none;stroke-width:1px;stroke-linecap:butt;stroke-linejoin:miter;stroke-opacity:1;enable-background:new"
         d="m 14,200.64644 v 70 a 14.477309,14.477309 31.099271 0 0 21.229658,12.80618 l 67.540682,-35.61236 a 12.871901,12.871901 90.4045 0 0 0.16017,-22.68627 L 35.069494,188.13889 A 14.247194,14.247194 149.30523 0 0 14,200.64644 Z"
         id="path27179"
         sodipodi:nodetypes="cccc"
         inkscape:original-d="m 14,176.64644 v 118 l 110,-58 z"
         inkscape:path-effect="#path-effect27197" />
      <g
         id="g27187"
         clip-path="url(#clipPath19045)">
        <rect
           style="fill:url(#linearGradient27209);fill-opacity:1;stroke:none;stroke-width:0;stroke-linecap:round;stroke-dasharray:none;stroke-opacity:1;stop-color:#000000"
           id="rect27181"
           width="129.0625"
           height="118"
           x="2.0002699"
           y="170"
           rx="6"
           ry="6" />
        <path
           id="path27183"
           style="fill:url(#linearGradient27211);fill-opacity:1;stroke-width:2;stroke-linecap:round;stroke-linejoin:round;paint-order:markers stroke fill;stop-color:#000000"
           d="m 70.795894,204.85746 -3.591248,-0.78841 a 4.2854522,4.2854522 141.191 0 0 -5.204376,4.18577 3.8746835,3.8746835 136.88441 0 1 -4,3.74518 4,4 45 0 1 -4,-4 v -4 a 12.944272,12.944272 58.282526 0 0 -7.155418,-11.57771 l -5.266873,-2.63344 c -1.975914,-0.98795 -3.54353,-3.61151 -4.095964,-5.74437 C 35.833287,177.67898 30.437539,172 24.00027,172 c -7.755975,0 -14,6.24403 -14,14 v 86.3457 c 0,7.75599 6.244025,14 14,14 7.755975,0 14,-6.24401 14,-14 v -20.91601 c 0,-2.99873 2.430956,-5.42969 5.429688,-5.42969 2.840164,0.31605 4.886365,2.87468 4.570312,5.71484 v 6.10352 c 0,6.09397 4.906018,11 11,11 6.093982,0 11,-4.90603 11,-11 v -23.05664 c 5.12e-4,-2.81903 2.322441,-5.0845 5.140625,-5.01563 2.856701,0.22382 5.013324,2.68556 4.859375,5.54688 V 237 c 0,8.30997 6.690026,15 15,15 8.30997,0 15,-6.69003 15,-15 0,-23.5805 -16.10871,-24.89739 -29.026824,-29.0968 -2.872461,-0.6306 -7.378965,-2.13598 -10.177552,-3.04574 z"
           inkscape:path-effect="#path-effect27201"
           inkscape:original-d="m 76.00027,206 -14,-3.07349 V 212 h -8 v -16 l -16,-8 c 0,-7.75597 -6.244025,-16 -14,-16 -7.755975,0 -14,6.24403 -14,14 v 86.3457 c 0,7.75599 6.244025,14 14,14 7.755975,0 14,-6.24401 14,-14 v -20.91601 c 0,-2.99873 2.430956,-5.42969 5.429688,-5.42969 2.840164,0.31605 4.886365,2.87468 4.570312,5.71484 v 6.10352 c 0,6.09397 4.906018,11 11,11 6.093982,0 11,-4.90603 11,-11 v -23.05664 c 5.12e-4,-2.81903 2.322441,-5.0845 5.140625,-5.01563 2.856701,0.22382 5.013324,2.68556 4.859375,5.54688 V 237 c 0,8.30997 6.690026,15 15,15 8.30997,0 15,-6.69003 15,-15 0,-26.73921 -20.713431,-24.8507 -34,-31 z"
           sodipodi:nodetypes="ccccccssssssccssscccsscc" />
        <path
           id="path27185"
           style="fill:url(#linearGradient27213);fill-opacity:1;stroke-width:2;stroke-linecap:round;stroke-linejoin:round;paint-order:markers stroke fill;stop-color:#000000"
           d="m 70.795894,201.44326 -3.591248,-0.78841 a 4.2854522,4.2854522 141.191 0 0 -5.204376,4.18577 3.8746835,3.8746835 136.88441 0 1 -4,3.74518 4,4 45 0 1 -4,-4 v -4 a 12.944272,12.944272 58.282526 0 0 -7.155418,-11.57771 l -5.266873,-2.63344 c -1.975914,-0.98795 -3.54353,-3.61151 -4.095964,-5.74437 -1.648728,-6.3655 -7.044476,-12.04448 -13.481745,-12.04448 -7.755975,0 -14,6.24403 -14,14 v 86.3457 c 0,7.75599 6.244025,14 14,14 7.755975,0 14,-6.24401 14,-14 v -20.91601 c 0,-2.99873 2.430956,-5.42969 5.429688,-5.42969 2.840164,0.31605 4.886365,2.87468 4.570312,5.71484 v 6.10352 c 0,6.09397 4.906018,11 11,11 6.093982,0 11,-4.90603 11,-11 v -23.05664 c 5.12e-4,-2.81903 2.322441,-5.0845 5.140625,-5.01563 2.856701,0.22382 5.013324,2.68556 4.859375,5.54688 v 1.70703 c 0,8.30997 6.690026,15 15,15 8.30997,0 15,-6.69003 15,-15 0,-23.5805 -16.10871,-24.89739 -29.026824,-29.0968 -2.872461,-0.6306 -7.378965,-2.13598 -10.177552,-3.04574 z"
           inkscape:path-effect="#path-effect27205"
           inkscape:original-d="m 76.00027,202.5858 -14,-3.07349 v 9.07349 h -8 v -16 l -16,-8 c 0,-7.75597 -6.244025,-16 -14,-16 -7.755975,0 -14,6.24403 -14,14 v 86.3457 c 0,7.75599 6.244025,14 14,14 7.755975,0 14,-6.24401 14,-14 v -20.91601 c 0,-2.99873 2.430956,-5.42969 5.429688,-5.42969 2.840164,0.31605 4.886365,2.87468 4.570312,5.71484 v 6.10352 c 0,6.09397 4.906018,11 11,11 6.093982,0 11,-4.90603 11,-11 v -23.05664 c 5.12e-4,-2.81903 2.322441,-5.0845 5.140625,-5.01563 2.856701,0.22382 5.013324,2.68556 4.859375,5.54688 v 1.70703 c 0,8.30997 6.690026,15 15,15 8.30997,0 15,-6.69003 15,-15 0,-26.73921 -20.713431,-24.8507 -34,-31 z"
           sodipodi:nodetypes="ccccccssssssccssscccsscc" />
      </g>
    </g>
    <g
       id="g22779-0"
       transform="translate(9.99973)"
       style="display:inline;enable-background:new">
      <path
         style="display:inline;fill:url(#linearGradient22789-3);fill-opacity:1;stroke:none;stroke-width:1px;stroke-linecap:butt;stroke-linejoin:miter;stroke-opacity:1;enable-background:new"
         d="m 10.155767,202.60278 v 70.10508 a 16.460171,16.460171 31.094612 0 0 24.139713,14.55891 l 67.77745,-35.75129 a 12.874411,12.874411 90.399837 0 0 0.15834,-22.68972 L 31.225263,190.09523 a 14.247197,14.247197 149.30522 0 0 -21.069496,12.50755 z"
         id="path22735-9"
         sodipodi:nodetypes="cccc"
         inkscape:original-d="M 10.155767,178.60278 V 300 L 123.30077,240.31821 Z"
         inkscape:path-effect="#path-effect22783-9" />
      <path
         style="display:inline;fill:#76b2fa;fill-opacity:0.440841;stroke:none;stroke-width:1px;stroke-linecap:butt;stroke-linejoin:miter;stroke-opacity:1;enable-background:new"
         d="m 14,201.35355 v 70 a 14.477309,14.477309 31.099271 0 0 21.229658,12.80618 l 67.540682,-35.61236 a 12.871901,12.871901 90.4045 0 0 0.16017,-22.68627 L 35.069494,188.846 A 14.247194,14.247194 149.30523 0 0 14,201.35355 Z"
         id="path22737-3"
         sodipodi:nodetypes="cccc"
         inkscape:original-d="m 14,177.35355 v 118 l 110,-58 z"
         inkscape:path-effect="#path-effect22787-1" />
      <g
         id="g22777-6"
         clip-path="url(#clipPath19045-2)">
        <rect
           style="fill:#99c1f1;fill-opacity:1;stroke:none;stroke-width:0;stroke-linecap:round;stroke-dasharray:none;stroke-opacity:1;stop-color:#000000"
           id="rect22739-0"
           width="129.0625"
           height="118"
           x="2.0002699"
           y="170"
           rx="6"
           ry="6" />
        <path
           style="fill:url(#radialGradient32081);fill-opacity:1;stroke:none;stroke-width:1px;stroke-linecap:butt;stroke-linejoin:miter;stroke-opacity:1"
           d="m -9.99973,220 c 0,0 36.602086,16.78091 56,16 22.76557,-0.91648 41.21599,-24 64,-24 22.78401,0 64,24 64,24 v 24 h -184 z"
           id="path27701-6"
           sodipodi:nodetypes="csscccc" />
        <path
           style="fill:url(#radialGradient32073);fill-opacity:1;stroke:none;stroke-width:1px;stroke-linecap:butt;stroke-linejoin:miter;stroke-opacity:1"
           d="m -81.99973,236 c 0,0 36.602086,16.78091 56,16 22.76557,-0.91648 41.21599,-24 64,-24 22.78401,0 64,24 64,24 v 24 h -184 z"
           id="path27699-2"
           sodipodi:nodetypes="csscccc" />
        <path
           style="fill:url(#radialGradient32097);fill-opacity:1;stroke:none;stroke-width:1px;stroke-linecap:butt;stroke-linejoin:miter;stroke-opacity:1"
           d="m -33.99973,244 c 0,0 36.602086,16.78091 56,16 22.76557,-0.91648 41.21599,-24 64,-24 22.78401,0 64,24 64,24 v 24 h -184 z"
           id="path27697-6"
           sodipodi:nodetypes="csscccc" />
        <path
           style="fill:url(#radialGradient32089);fill-opacity:1;stroke:none;stroke-width:1px;stroke-linecap:butt;stroke-linejoin:miter;stroke-opacity:1"
           d="m -49.99973,260 c 0,0 36.602086,16.78091 56,16 22.76557,-0.91648 41.21599,-24 64,-24 22.78401,0 64,24 64,24 v 24 h -184 z"
           id="path27215-1"
           sodipodi:nodetypes="csscccc" />
      </g>
    </g>
    <path
       id="path22735-9-2"
       style="display:inline;fill:#241f31;fill-opacity:1;stroke:none;stroke-width:0.999999px;stroke-linecap:butt;stroke-linejoin:miter;stroke-opacity:1;enable-background:new"
       d="M 162.21484 172 A 2.2557327 2.2557327 0 0 0 160 174.25586 L 160 176.14648 C 160.31478 176.05393 160.64737 176 161 176 C 162.94189 176 164.37666 177.49068 165.87305 178.72852 C 167.36943 179.96634 168.84992 181 170 181 C 171.04233 181 173.01992 179.91241 174.56445 178.71094 C 174.6384 178.65341 174.70714 178.59648 174.7793 178.53906 A 2.038382 2.038382 0 0 0 174.57812 178.4082 L 163.33594 172.27539 A 2.2557327 2.2557327 0 0 0 162.21484 172 z M 161 178 C 160.73084 178 160.37879 178.16035 160 178.42188 L 160 185.35547 A 2.6061088 2.6061088 0 0 0 163.82227 187.66016 L 174.55273 182 A 2.038382 2.038382 0 0 0 175.62305 180.41992 C 173.98683 181.68106 172.03259 183 170 183 C 167.84222 183 166.12344 181.53364 164.59766 180.27148 C 163.07187 179.00933 161.66153 178 161 178 z " />
  </g>
</svg>
