<?xml version="1.0" encoding="UTF-8" standalone="no"?>
<svg
   viewBox="0 0 192 152"
   style="display:inline;enable-background:new"
   version="1.0"
   inkscape:output_extension="org.inkscape.output.svg.inkscape"
   sodipodi:docname="null.daknig.dewduct.Source.svg"
   inkscape:version="1.3.2 (091e20ef0f, 2023-11-25)"
   sodipodi:version="0.32"
   id="svg11300"
   height="152"
   width="192"
   inkscape:export-filename="Template.png"
   inkscape:export-xdpi="96"
   inkscape:export-ydpi="96"
   xmlns:inkscape="http://www.inkscape.org/namespaces/inkscape"
   xmlns:sodipodi="http://sodipodi.sourceforge.net/DTD/sodipodi-0.dtd"
   xmlns:xlink="http://www.w3.org/1999/xlink"
   xmlns="http://www.w3.org/2000/svg"
   xmlns:svg="http://www.w3.org/2000/svg"
   xmlns:rdf="http://www.w3.org/1999/02/22-rdf-syntax-ns#"
   xmlns:cc="http://creativecommons.org/ns#"
   xmlns:dc="http://purl.org/dc/elements/1.1/">
  <title
     id="title4162">Adwaita Icon Template</title>
  <defs
     id="defs3">
    <inkscape:path-effect
       effect="fillet_chamfer"
       id="path-effect7"
       is_visible="true"
       lpeversion="1"
       satellites_param="F,0,0,1,0,0,0,1 @ F,0,0,1,0,16,0,1 @ F,0,0,1,0,16,0,1 @ F,0,0,1,0,0,0,1"
       unit="px"
       method="auto"
       mode="F"
       radius="16"
       chamfer_steps="1"
       flexible="false"
       use_knot_distance="true"
       apply_no_radius="true"
       apply_with_radius="true"
       only_selected="false"
       hide_knots="false"
       nodesatellites_param="F,0,0,1,0,0,0,1 @ F,0,0,1,0,16,0,1 @ F,0,0,1,0,16,0,1 @ F,0,0,1,0,0,0,1" />
    <linearGradient
       inkscape:collect="always"
       id="linearGradient74482">
      <stop
         style="stop-color:#e66100;stop-opacity:1;"
         offset="0"
         id="stop74478" />
      <stop
         style="stop-color:#b84200;stop-opacity:1"
         offset="1"
         id="stop74480" />
    </linearGradient>
    <linearGradient
       inkscape:collect="always"
       id="linearGradient73142">
      <stop
         style="stop-color:#ff7800;stop-opacity:1"
         offset="0"
         id="stop73136" />
      <stop
         style="stop-color:#ffa348;stop-opacity:1"
         offset="0.25"
         id="stop73138" />
      <stop
         style="stop-color:#c64600;stop-opacity:1"
         offset="1"
         id="stop73140" />
    </linearGradient>
    <linearGradient
       inkscape:collect="always"
       id="linearGradient73134">
      <stop
         style="stop-color:#f6d32d;stop-opacity:1"
         offset="0"
         id="stop73126" />
      <stop
         style="stop-color:#ff7800;stop-opacity:1"
         offset="0.3333334"
         id="stop73128" />
      <stop
         style="stop-color:#ffa348;stop-opacity:1"
         offset="0.5"
         id="stop73130" />
      <stop
         style="stop-color:#c64600;stop-opacity:1"
         offset="1"
         id="stop73132" />
    </linearGradient>
    <linearGradient
       inkscape:collect="always"
       id="linearGradient73124">
      <stop
         style="stop-color:#ff7800;stop-opacity:1"
         offset="0"
         id="stop73118" />
      <stop
         style="stop-color:#ffa348;stop-opacity:1"
         offset="0.5"
         id="stop73120" />
      <stop
         style="stop-color:#c64600;stop-opacity:1"
         offset="1"
         id="stop73122" />
    </linearGradient>
    <inkscape:path-effect
       effect="fillet_chamfer"
       id="path-effect71022"
       is_visible="true"
       lpeversion="1"
       satellites_param="F,0,0,1,0,0,0,1 @ F,0,0,1,0,16,0,1 @ F,0,0,1,0,16,0,1 @ F,0,0,1,0,0,0,1"
       unit="px"
       method="auto"
       mode="F"
       radius="16"
       chamfer_steps="1"
       flexible="false"
       use_knot_distance="true"
       apply_no_radius="true"
       apply_with_radius="true"
       only_selected="false"
       hide_knots="false"
       nodesatellites_param="F,0,0,1,0,0,0,1 @ F,0,0,1,0,16,0,1 @ F,0,0,1,0,16,0,1 @ F,0,0,1,0,0,0,1" />
    <linearGradient
       inkscape:collect="always"
       id="linearGradient69952">
      <stop
         style="stop-color:#3d3846;stop-opacity:1"
         offset="0"
         id="stop69948" />
      <stop
         style="stop-color:#241f31;stop-opacity:0;"
         offset="1"
         id="stop69950" />
    </linearGradient>
    <linearGradient
       inkscape:collect="always"
       id="linearGradient68885">
      <stop
         style="stop-color:#e5a50a;stop-opacity:1"
         offset="0"
         id="stop68881" />
      <stop
         style="stop-color:#d4990a;stop-opacity:1"
         offset="1"
         id="stop68883" />
    </linearGradient>
    <linearGradient
       inkscape:collect="always"
       id="linearGradient67578">
      <stop
         style="stop-color:#f6d32d;stop-opacity:1"
         offset="0"
         id="stop67572" />
      <stop
         style="stop-color:#f5c211;stop-opacity:1"
         offset="0.3333334"
         id="stop67580" />
      <stop
         style="stop-color:#f9f06b;stop-opacity:1"
         offset="0.5"
         id="stop67574" />
      <stop
         style="stop-color:#e5a50a;stop-opacity:1"
         offset="1"
         id="stop67576" />
    </linearGradient>
    <linearGradient
       inkscape:collect="always"
       id="linearGradient67314">
      <stop
         style="stop-color:#f5c211;stop-opacity:1"
         offset="0"
         id="stop67308" />
      <stop
         style="stop-color:#f9f06b;stop-opacity:1"
         offset="0.25"
         id="stop67310" />
      <stop
         style="stop-color:#e5a50a;stop-opacity:1"
         offset="1"
         id="stop67312" />
    </linearGradient>
    <linearGradient
       inkscape:collect="always"
       id="linearGradient66203">
      <stop
         style="stop-color:#f6d32d;stop-opacity:1"
         offset="0"
         id="stop66197" />
      <stop
         style="stop-color:#f9f06b;stop-opacity:1"
         offset="0.5"
         id="stop66199" />
      <stop
         style="stop-color:#e5a50a;stop-opacity:1"
         offset="1"
         id="stop66201" />
    </linearGradient>
    <linearGradient
       inkscape:collect="always"
       id="linearGradient66195">
      <stop
         style="stop-color:#f5c211;stop-opacity:1"
         offset="0"
         id="stop66189" />
      <stop
         style="stop-color:#f9f06b;stop-opacity:1"
         offset="0.5"
         id="stop66191" />
      <stop
         style="stop-color:#e5a50a;stop-opacity:1"
         offset="1"
         id="stop66193" />
    </linearGradient>
    <inkscape:path-effect
       effect="fillet_chamfer"
       id="path-effect66118"
       is_visible="true"
       lpeversion="1"
       satellites_param="F,0,0,1,0,0,0,1 @ F,0,0,1,0,16,0,1 @ F,0,0,1,0,16,0,1 @ F,0,0,1,0,0,0,1"
       unit="px"
       method="auto"
       mode="F"
       radius="16"
       chamfer_steps="1"
       flexible="false"
       use_knot_distance="true"
       apply_no_radius="true"
       apply_with_radius="true"
       only_selected="false"
       hide_knots="false"
       nodesatellites_param="F,0,0,1,0,0,0,1 @ F,0,0,1,0,16,0,1 @ F,0,0,1,0,16,0,1 @ F,0,0,1,0,0,0,1" />
    <linearGradient
       inkscape:collect="always"
       id="linearGradient64164">
      <stop
         style="stop-color:#000000;stop-opacity:1"
         offset="0"
         id="stop64160" />
      <stop
         style="stop-color:#241f31;stop-opacity:0;"
         offset="1"
         id="stop64162" />
    </linearGradient>
    <inkscape:path-effect
       effect="fillet_chamfer"
       id="path-effect62106"
       is_visible="true"
       lpeversion="1"
       satellites_param="F,0,0,1,0,0,0,1 @ F,0,0,1,0,16,0,1 @ F,0,0,1,0,16,0,1 @ F,0,0,1,0,0,0,1"
       unit="px"
       method="auto"
       mode="F"
       radius="16"
       chamfer_steps="1"
       flexible="false"
       use_knot_distance="true"
       apply_no_radius="true"
       apply_with_radius="true"
       only_selected="false"
       hide_knots="false"
       nodesatellites_param="F,0,0,1,0,0,0,1 @ F,0,0,1,0,16,0,1 @ F,0,0,1,0,16,0,1 @ F,0,0,1,0,0,0,1" />
    <linearGradient
       inkscape:collect="always"
       id="linearGradient58776">
      <stop
         style="stop-color:#3584e4;stop-opacity:1;"
         offset="0"
         id="stop58770" />
      <stop
         style="stop-color:#62a0ea;stop-opacity:1"
         offset="0.3125"
         id="stop58772" />
      <stop
         style="stop-color:#1c71d8;stop-opacity:1"
         offset="1"
         id="stop58774" />
    </linearGradient>
    <linearGradient
       inkscape:collect="always"
       id="linearGradient51375">
      <stop
         style="stop-color:#3584e4;stop-opacity:1;"
         offset="0"
         id="stop51369" />
      <stop
         style="stop-color:#3584e4;stop-opacity:1"
         offset="0.3333334"
         id="stop51377" />
      <stop
         style="stop-color:#62a0ea;stop-opacity:1"
         offset="0.54166675"
         id="stop51371" />
      <stop
         style="stop-color:#1c71d8;stop-opacity:1"
         offset="1"
         id="stop51373" />
    </linearGradient>
    <linearGradient
       inkscape:collect="always"
       id="linearGradient43329">
      <stop
         style="stop-color:#241f31;stop-opacity:1;"
         offset="0"
         id="stop43325" />
      <stop
         style="stop-color:#241f31;stop-opacity:0;"
         offset="1"
         id="stop43327" />
    </linearGradient>
    <linearGradient
       inkscape:collect="always"
       id="linearGradient41680">
      <stop
         style="stop-color:#3584e4;stop-opacity:1;"
         offset="0"
         id="stop41676" />
      <stop
         style="stop-color:#62a0ea;stop-opacity:1"
         offset="0.5"
         id="stop41898" />
      <stop
         style="stop-color:#1c71d8;stop-opacity:1"
         offset="1"
         id="stop41678" />
    </linearGradient>
    <inkscape:path-effect
       effect="fillet_chamfer"
       id="path-effect32639"
       is_visible="true"
       lpeversion="1"
       satellites_param="F,0,1,1,0,2,0,1 @ F,0,1,1,0,2,0,1 @ F,0,0,1,0,0,0,1 @ F,0,0,1,0,2,0,1 @ F,0,0,1,0,2,0,1 @ F,0,0,1,0,0,0,1 @ F,0,0,1,0,2,0,1 @ F,0,0,1,0,2,0,1"
       unit="px"
       method="auto"
       mode="F"
       radius="2"
       chamfer_steps="1"
       flexible="false"
       use_knot_distance="true"
       apply_no_radius="true"
       apply_with_radius="true"
       only_selected="false"
       hide_knots="false"
       nodesatellites_param="F,0,1,1,0,2,0,1 @ F,0,1,1,0,2,0,1 @ F,0,0,1,0,0,0,1 @ F,0,0,1,0,2,0,1 @ F,0,0,1,0,2,0,1 @ F,0,0,1,0,0,0,1 @ F,0,0,1,0,2,0,1 @ F,0,0,1,0,2,0,1" />
    <inkscape:path-effect
       effect="fillet_chamfer"
       id="path-effect32635"
       is_visible="true"
       lpeversion="1"
       satellites_param="F,0,1,1,0,2,0,1 @ F,0,1,1,0,2,0,1 @ F,0,0,1,0,0,0,1 @ F,0,0,1,0,2,0,1 @ F,0,0,1,0,2,0,1 @ F,0,0,1,0,0,0,1 @ F,0,0,1,0,2,0,1 @ F,0,0,1,0,2,0,1"
       unit="px"
       method="auto"
       mode="F"
       radius="2"
       chamfer_steps="1"
       flexible="false"
       use_knot_distance="true"
       apply_no_radius="true"
       apply_with_radius="true"
       only_selected="false"
       hide_knots="false"
       nodesatellites_param="F,0,1,1,0,2,0,1 @ F,0,1,1,0,2,0,1 @ F,0,0,1,0,0,0,1 @ F,0,0,1,0,2,0,1 @ F,0,0,1,0,2,0,1 @ F,0,0,1,0,0,0,1 @ F,0,0,1,0,2,0,1 @ F,0,0,1,0,2,0,1" />
    <inkscape:path-effect
       effect="fillet_chamfer"
       id="path-effect29884"
       is_visible="true"
       lpeversion="1"
       satellites_param="F,0,1,1,0,2,0,1 @ F,0,1,1,0,2,0,1 @ F,0,0,1,0,0,0,1 @ F,0,0,1,0,2,0,1 @ F,0,0,1,0,2,0,1 @ F,0,0,1,0,0,0,1 @ F,0,0,1,0,2,0,1 @ F,0,0,1,0,2,0,1"
       unit="px"
       method="auto"
       mode="F"
       radius="2"
       chamfer_steps="1"
       flexible="false"
       use_knot_distance="true"
       apply_no_radius="true"
       apply_with_radius="true"
       only_selected="false"
       hide_knots="false"
       nodesatellites_param="F,0,1,1,0,2,0,1 @ F,0,1,1,0,2,0,1 @ F,0,0,1,0,0,0,1 @ F,0,0,1,0,2,0,1 @ F,0,0,1,0,2,0,1 @ F,0,0,1,0,0,0,1 @ F,0,0,1,0,2,0,1 @ F,0,0,1,0,2,0,1" />
    <inkscape:path-effect
       effect="fillet_chamfer"
       id="path-effect29880"
       is_visible="true"
       lpeversion="1"
       satellites_param="F,0,1,1,0,2,0,1 @ F,0,1,1,0,2,0,1 @ F,0,0,1,0,0,0,1 @ F,0,0,1,0,2,0,1 @ F,0,0,1,0,2,0,1 @ F,0,0,1,0,0,0,1 @ F,0,0,1,0,2,0,1 @ F,0,0,1,0,2,0,1"
       unit="px"
       method="auto"
       mode="F"
       radius="2"
       chamfer_steps="1"
       flexible="false"
       use_knot_distance="true"
       apply_no_radius="true"
       apply_with_radius="true"
       only_selected="false"
       hide_knots="false"
       nodesatellites_param="F,0,1,1,0,2,0,1 @ F,0,1,1,0,2,0,1 @ F,0,0,1,0,0,0,1 @ F,0,0,1,0,2,0,1 @ F,0,0,1,0,2,0,1 @ F,0,0,1,0,0,0,1 @ F,0,0,1,0,2,0,1 @ F,0,0,1,0,2,0,1" />
    <inkscape:path-effect
       effect="fillet_chamfer"
       id="path-effect23466"
       is_visible="true"
       lpeversion="1"
       satellites_param="F,0,1,1,0,2,0,1 @ F,0,1,1,0,2,0,1 @ F,0,0,1,0,0,0,1 @ F,0,0,1,0,2,0,1 @ F,0,0,1,0,2,0,1 @ F,0,0,1,0,0,0,1 @ F,0,0,1,0,2,0,1 @ F,0,0,1,0,2,0,1"
       unit="px"
       method="auto"
       mode="F"
       radius="2"
       chamfer_steps="1"
       flexible="false"
       use_knot_distance="true"
       apply_no_radius="true"
       apply_with_radius="true"
       only_selected="false"
       hide_knots="false"
       nodesatellites_param="F,0,1,1,0,2,0,1 @ F,0,1,1,0,2,0,1 @ F,0,0,1,0,0,0,1 @ F,0,0,1,0,2,0,1 @ F,0,0,1,0,2,0,1 @ F,0,0,1,0,0,0,1 @ F,0,0,1,0,2,0,1 @ F,0,0,1,0,2,0,1" />
    <inkscape:path-effect
       effect="fillet_chamfer"
       id="path-effect23460"
       is_visible="true"
       lpeversion="1"
       satellites_param="F,0,1,1,0,2,0,1 @ F,0,1,1,0,2,0,1 @ F,0,0,1,0,0,0,1 @ F,0,0,1,0,2,0,1 @ F,0,0,1,0,2,0,1 @ F,0,0,1,0,0,0,1 @ F,0,0,1,0,2,0,1 @ F,0,0,1,0,2,0,1"
       unit="px"
       method="auto"
       mode="F"
       radius="2"
       chamfer_steps="1"
       flexible="false"
       use_knot_distance="true"
       apply_no_radius="true"
       apply_with_radius="true"
       only_selected="false"
       hide_knots="false"
       nodesatellites_param="F,0,1,1,0,2,0,1 @ F,0,1,1,0,2,0,1 @ F,0,0,1,0,0,0,1 @ F,0,0,1,0,2,0,1 @ F,0,0,1,0,2,0,1 @ F,0,0,1,0,0,0,1 @ F,0,0,1,0,2,0,1 @ F,0,0,1,0,2,0,1" />
    <inkscape:path-effect
       effect="fillet_chamfer"
       id="path-effect20410"
       is_visible="true"
       lpeversion="1"
       satellites_param="F,0,1,1,0,2,0,1 @ F,0,1,1,0,2,0,1 @ F,0,0,1,0,0,0,1 @ F,0,0,1,0,2,0,1 @ F,0,0,1,0,2,0,1 @ F,0,0,1,0,0,0,1 @ F,0,0,1,0,2,0,1 @ F,0,0,1,0,2,0,1"
       unit="px"
       method="auto"
       mode="F"
       radius="2"
       chamfer_steps="1"
       flexible="false"
       use_knot_distance="true"
       apply_no_radius="true"
       apply_with_radius="true"
       only_selected="false"
       hide_knots="false"
       nodesatellites_param="F,0,1,1,0,2,0,1 @ F,0,1,1,0,2,0,1 @ F,0,0,1,0,0,0,1 @ F,0,0,1,0,2,0,1 @ F,0,0,1,0,2,0,1 @ F,0,0,1,0,0,0,1 @ F,0,0,1,0,2,0,1 @ F,0,0,1,0,2,0,1" />
    <inkscape:path-effect
       effect="fillet_chamfer"
       id="path-effect20404"
       is_visible="true"
       lpeversion="1"
       satellites_param="F,0,1,1,0,2,0,1 @ F,0,1,1,0,2,0,1 @ F,0,0,1,0,0,0,1 @ F,0,0,1,0,2,0,1 @ F,0,0,1,0,2,0,1 @ F,0,0,1,0,0,0,1 @ F,0,0,1,0,2,0,1 @ F,0,0,1,0,2,0,1"
       unit="px"
       method="auto"
       mode="F"
       radius="2"
       chamfer_steps="1"
       flexible="false"
       use_knot_distance="true"
       apply_no_radius="true"
       apply_with_radius="true"
       only_selected="false"
       hide_knots="false"
       nodesatellites_param="F,0,1,1,0,2,0,1 @ F,0,1,1,0,2,0,1 @ F,0,0,1,0,0,0,1 @ F,0,0,1,0,2,0,1 @ F,0,0,1,0,2,0,1 @ F,0,0,1,0,0,0,1 @ F,0,0,1,0,2,0,1 @ F,0,0,1,0,2,0,1" />
    <inkscape:path-effect
       effect="fillet_chamfer"
       id="path-effect11773"
       is_visible="true"
       lpeversion="1"
       satellites_param="F,0,1,1,0,2,0,1 @ F,0,1,1,0,2,0,1 @ F,0,0,1,0,0,0,1 @ F,0,0,1,0,2,0,1 @ F,0,0,1,0,2,0,1 @ F,0,0,1,0,0,0,1 @ F,0,0,1,0,2,0,1 @ F,0,0,1,0,2,0,1"
       unit="px"
       method="auto"
       mode="F"
       radius="2"
       chamfer_steps="1"
       flexible="false"
       use_knot_distance="true"
       apply_no_radius="true"
       apply_with_radius="true"
       only_selected="false"
       hide_knots="false"
       nodesatellites_param="F,0,1,1,0,2,0,1 @ F,0,1,1,0,2,0,1 @ F,0,0,1,0,0,0,1 @ F,0,0,1,0,2,0,1 @ F,0,0,1,0,2,0,1 @ F,0,0,1,0,0,0,1 @ F,0,0,1,0,2,0,1 @ F,0,0,1,0,2,0,1" />
    <inkscape:path-effect
       effect="fillet_chamfer"
       id="path-effect11767"
       is_visible="true"
       lpeversion="1"
       satellites_param="F,0,1,1,0,2,0,1 @ F,0,1,1,0,2,0,1 @ F,0,0,1,0,0,0,1 @ F,0,0,1,0,2,0,1 @ F,0,0,1,0,2,0,1 @ F,0,0,1,0,0,0,1 @ F,0,0,1,0,2,0,1 @ F,0,0,1,0,2,0,1"
       unit="px"
       method="auto"
       mode="F"
       radius="2"
       chamfer_steps="1"
       flexible="false"
       use_knot_distance="true"
       apply_no_radius="true"
       apply_with_radius="true"
       only_selected="false"
       hide_knots="false"
       nodesatellites_param="F,0,1,1,0,2,0,1 @ F,0,1,1,0,2,0,1 @ F,0,0,1,0,0,0,1 @ F,0,0,1,0,2,0,1 @ F,0,0,1,0,2,0,1 @ F,0,0,1,0,0,0,1 @ F,0,0,1,0,2,0,1 @ F,0,0,1,0,2,0,1" />
    <inkscape:path-effect
       effect="fillet_chamfer"
       id="path-effect97178"
       is_visible="true"
       lpeversion="1"
       satellites_param="F,0,1,1,0,2,0,1 @ F,0,1,1,0,2,0,1 @ F,0,0,1,0,0,0,1 @ F,0,0,1,0,2,0,1 @ F,0,0,1,0,2,0,1 @ F,0,0,1,0,0,0,1 @ F,0,0,1,0,2,0,1 @ F,0,0,1,0,2,0,1"
       unit="px"
       method="auto"
       mode="F"
       radius="2"
       chamfer_steps="1"
       flexible="false"
       use_knot_distance="true"
       apply_no_radius="true"
       apply_with_radius="true"
       only_selected="false"
       hide_knots="false"
       nodesatellites_param="F,0,1,1,0,2,0,1 @ F,0,1,1,0,2,0,1 @ F,0,0,1,0,0,0,1 @ F,0,0,1,0,2,0,1 @ F,0,0,1,0,2,0,1 @ F,0,0,1,0,0,0,1 @ F,0,0,1,0,2,0,1 @ F,0,0,1,0,2,0,1" />
    <inkscape:path-effect
       effect="fillet_chamfer"
       id="path-effect97172"
       is_visible="true"
       lpeversion="1"
       satellites_param="F,0,1,1,0,2,0,1 @ F,0,1,1,0,2,0,1 @ F,0,0,1,0,0,0,1 @ F,0,0,1,0,2,0,1 @ F,0,0,1,0,2,0,1 @ F,0,0,1,0,0,0,1 @ F,0,0,1,0,2,0,1 @ F,0,0,1,0,2,0,1"
       unit="px"
       method="auto"
       mode="F"
       radius="2"
       chamfer_steps="1"
       flexible="false"
       use_knot_distance="true"
       apply_no_radius="true"
       apply_with_radius="true"
       only_selected="false"
       hide_knots="false"
       nodesatellites_param="F,0,1,1,0,2,0,1 @ F,0,1,1,0,2,0,1 @ F,0,0,1,0,0,0,1 @ F,0,0,1,0,2,0,1 @ F,0,0,1,0,2,0,1 @ F,0,0,1,0,0,0,1 @ F,0,0,1,0,2,0,1 @ F,0,0,1,0,2,0,1" />
    <inkscape:path-effect
       effect="fillet_chamfer"
       id="path-effect89429"
       is_visible="true"
       lpeversion="1"
       satellites_param="F,0,1,1,0,2,0,1 @ F,0,1,1,0,2,0,1 @ F,0,0,1,0,0,0,1 @ F,0,0,1,0,2,0,1 @ F,0,0,1,0,2,0,1 @ F,0,0,1,0,0,0,1 @ F,0,0,1,0,2,0,1 @ F,0,0,1,0,2,0,1"
       unit="px"
       method="auto"
       mode="F"
       radius="2"
       chamfer_steps="1"
       flexible="false"
       use_knot_distance="true"
       apply_no_radius="true"
       apply_with_radius="true"
       only_selected="false"
       hide_knots="false"
       nodesatellites_param="F,0,1,1,0,2,0,1 @ F,0,1,1,0,2,0,1 @ F,0,0,1,0,0,0,1 @ F,0,0,1,0,2,0,1 @ F,0,0,1,0,2,0,1 @ F,0,0,1,0,0,0,1 @ F,0,0,1,0,2,0,1 @ F,0,0,1,0,2,0,1" />
    <inkscape:path-effect
       effect="fillet_chamfer"
       id="path-effect89423"
       is_visible="true"
       lpeversion="1"
       satellites_param="F,0,1,1,0,2,0,1 @ F,0,1,1,0,2,0,1 @ F,0,0,1,0,0,0,1 @ F,0,0,1,0,2,0,1 @ F,0,0,1,0,2,0,1 @ F,0,0,1,0,0,0,1 @ F,0,0,1,0,2,0,1 @ F,0,0,1,0,2,0,1"
       unit="px"
       method="auto"
       mode="F"
       radius="2"
       chamfer_steps="1"
       flexible="false"
       use_knot_distance="true"
       apply_no_radius="true"
       apply_with_radius="true"
       only_selected="false"
       hide_knots="false"
       nodesatellites_param="F,0,1,1,0,2,0,1 @ F,0,1,1,0,2,0,1 @ F,0,0,1,0,0,0,1 @ F,0,0,1,0,2,0,1 @ F,0,0,1,0,2,0,1 @ F,0,0,1,0,0,0,1 @ F,0,0,1,0,2,0,1 @ F,0,0,1,0,2,0,1" />
    <inkscape:path-effect
       effect="fillet_chamfer"
       id="path-effect86085"
       is_visible="true"
       lpeversion="1"
       satellites_param="F,0,1,1,0,2,0,1 @ F,0,1,1,0,2,0,1 @ F,0,0,1,0,0,0,1 @ F,0,0,1,0,2,0,1 @ F,0,0,1,0,2,0,1 @ F,0,0,1,0,0,0,1 @ F,0,0,1,0,2,0,1 @ F,0,0,1,0,2,0,1"
       unit="px"
       method="auto"
       mode="F"
       radius="2"
       chamfer_steps="1"
       flexible="false"
       use_knot_distance="true"
       apply_no_radius="true"
       apply_with_radius="true"
       only_selected="false"
       hide_knots="false"
       nodesatellites_param="F,0,1,1,0,2,0,1 @ F,0,1,1,0,2,0,1 @ F,0,0,1,0,0,0,1 @ F,0,0,1,0,2,0,1 @ F,0,0,1,0,2,0,1 @ F,0,0,1,0,0,0,1 @ F,0,0,1,0,2,0,1 @ F,0,0,1,0,2,0,1" />
    <inkscape:path-effect
       effect="fillet_chamfer"
       id="path-effect86079"
       is_visible="true"
       lpeversion="1"
       satellites_param="F,0,1,1,0,2,0,1 @ F,0,1,1,0,2,0,1 @ F,0,0,1,0,0,0,1 @ F,0,0,1,0,2,0,1 @ F,0,0,1,0,2,0,1 @ F,0,0,1,0,0,0,1 @ F,0,0,1,0,2,0,1 @ F,0,0,1,0,2,0,1"
       unit="px"
       method="auto"
       mode="F"
       radius="2"
       chamfer_steps="1"
       flexible="false"
       use_knot_distance="true"
       apply_no_radius="true"
       apply_with_radius="true"
       only_selected="false"
       hide_knots="false"
       nodesatellites_param="F,0,1,1,0,2,0,1 @ F,0,1,1,0,2,0,1 @ F,0,0,1,0,0,0,1 @ F,0,0,1,0,2,0,1 @ F,0,0,1,0,2,0,1 @ F,0,0,1,0,0,0,1 @ F,0,0,1,0,2,0,1 @ F,0,0,1,0,2,0,1" />
    <inkscape:path-effect
       effect="fillet_chamfer"
       id="path-effect80496"
       is_visible="true"
       lpeversion="1"
       satellites_param="F,0,1,1,0,2,0,1 @ F,0,1,1,0,2,0,1 @ F,0,0,1,0,0,0,1 @ F,0,0,1,0,2,0,1 @ F,0,0,1,0,2,0,1 @ F,0,0,1,0,0,0,1 @ F,0,0,1,0,2,0,1 @ F,0,0,1,0,2,0,1"
       unit="px"
       method="auto"
       mode="F"
       radius="2"
       chamfer_steps="1"
       flexible="false"
       use_knot_distance="true"
       apply_no_radius="true"
       apply_with_radius="true"
       only_selected="false"
       hide_knots="false"
       nodesatellites_param="F,0,1,1,0,2,0,1 @ F,0,1,1,0,2,0,1 @ F,0,0,1,0,0,0,1 @ F,0,0,1,0,2,0,1 @ F,0,0,1,0,2,0,1 @ F,0,0,1,0,0,0,1 @ F,0,0,1,0,2,0,1 @ F,0,0,1,0,2,0,1" />
    <inkscape:path-effect
       effect="fillet_chamfer"
       id="path-effect80490"
       is_visible="true"
       lpeversion="1"
       satellites_param="F,0,1,1,0,2,0,1 @ F,0,1,1,0,2,0,1 @ F,0,0,1,0,0,0,1 @ F,0,0,1,0,2,0,1 @ F,0,0,1,0,2,0,1 @ F,0,0,1,0,0,0,1 @ F,0,0,1,0,2,0,1 @ F,0,0,1,0,2,0,1"
       unit="px"
       method="auto"
       mode="F"
       radius="2"
       chamfer_steps="1"
       flexible="false"
       use_knot_distance="true"
       apply_no_radius="true"
       apply_with_radius="true"
       only_selected="false"
       hide_knots="false"
       nodesatellites_param="F,0,1,1,0,2,0,1 @ F,0,1,1,0,2,0,1 @ F,0,0,1,0,0,0,1 @ F,0,0,1,0,2,0,1 @ F,0,0,1,0,2,0,1 @ F,0,0,1,0,0,0,1 @ F,0,0,1,0,2,0,1 @ F,0,0,1,0,2,0,1" />
    <inkscape:path-effect
       effect="fillet_chamfer"
       id="path-effect79894"
       is_visible="true"
       lpeversion="1"
       satellites_param="F,0,1,1,0,2,0,1 @ F,0,1,1,0,2,0,1 @ F,0,0,1,0,0,0,1 @ F,0,0,1,0,2,0,1 @ F,0,0,1,0,2,0,1 @ F,0,0,1,0,0,0,1 @ F,0,0,1,0,2,0,1 @ F,0,0,1,0,2,0,1"
       unit="px"
       method="auto"
       mode="F"
       radius="2"
       chamfer_steps="1"
       flexible="false"
       use_knot_distance="true"
       apply_no_radius="true"
       apply_with_radius="true"
       only_selected="false"
       hide_knots="false"
       nodesatellites_param="F,0,1,1,0,2,0,1 @ F,0,1,1,0,2,0,1 @ F,0,0,1,0,0,0,1 @ F,0,0,1,0,2,0,1 @ F,0,0,1,0,2,0,1 @ F,0,0,1,0,0,0,1 @ F,0,0,1,0,2,0,1 @ F,0,0,1,0,2,0,1" />
    <inkscape:path-effect
       effect="fillet_chamfer"
       id="path-effect75546"
       is_visible="true"
       lpeversion="1"
       satellites_param="F,0,1,1,0,2,0,1 @ F,0,1,1,0,2,0,1 @ F,0,0,1,0,0,0,1 @ F,0,0,1,0,2,0,1 @ F,0,0,1,0,2,0,1 @ F,0,0,1,0,0,0,1 @ F,0,0,1,0,2,0,1 @ F,0,0,1,0,2,0,1"
       unit="px"
       method="auto"
       mode="F"
       radius="2"
       chamfer_steps="1"
       flexible="false"
       use_knot_distance="true"
       apply_no_radius="true"
       apply_with_radius="true"
       only_selected="false"
       hide_knots="false"
       nodesatellites_param="F,0,1,1,0,2,0,1 @ F,0,1,1,0,2,0,1 @ F,0,0,1,0,0,0,1 @ F,0,0,1,0,2,0,1 @ F,0,0,1,0,2,0,1 @ F,0,0,1,0,0,0,1 @ F,0,0,1,0,2,0,1 @ F,0,0,1,0,2,0,1" />
    <linearGradient
       inkscape:collect="always"
       xlink:href="#linearGradient73124"
       id="linearGradient41682"
       x1="220"
       y1="32"
       x2="220"
       y2="64"
       gradientUnits="userSpaceOnUse"
       gradientTransform="matrix(0.91666667,0,0,1,23.666667,-16)" />
    <linearGradient
       inkscape:collect="always"
       xlink:href="#linearGradient73142"
       id="linearGradient42208"
       x1="260"
       y1="28.000004"
       x2="260"
       y2="68"
       gradientUnits="userSpaceOnUse"
       gradientTransform="matrix(0.85714282,0,0,1,42.285724,-16)" />
    <linearGradient
       inkscape:collect="always"
       xlink:href="#linearGradient73142"
       id="linearGradient43137"
       gradientUnits="userSpaceOnUse"
       x1="260"
       y1="28.000004"
       x2="260"
       y2="68"
       gradientTransform="matrix(0.85714282,0,0,1,-21.714277,-16)" />
    <linearGradient
       inkscape:collect="always"
       xlink:href="#linearGradient69952"
       id="linearGradient43331"
       x1="32"
       y1="276"
       x2="74.649414"
       y2="276"
       gradientUnits="userSpaceOnUse"
       gradientTransform="translate(228,-308)" />
    <linearGradient
       inkscape:collect="always"
       xlink:href="#linearGradient73142"
       id="linearGradient49351"
       gradientUnits="userSpaceOnUse"
       gradientTransform="matrix(0.85714282,0,0,1,-25.714277,0)"
       x1="260"
       y1="28.000004"
       x2="260"
       y2="68" />
    <radialGradient
       inkscape:collect="always"
       xlink:href="#linearGradient73134"
       id="radialGradient51179"
       cx="56"
       cy="195.99988"
       fx="56"
       fy="195.99988"
       r="32.000019"
       gradientTransform="matrix(1.4999991,0,0,1.4999991,-19.999951,-93.999637)"
       gradientUnits="userSpaceOnUse" />
    <linearGradient
       inkscape:collect="always"
       xlink:href="#linearGradient41680"
       id="linearGradient56506"
       gradientUnits="userSpaceOnUse"
       gradientTransform="matrix(0.85714282,0,0,1,-25.714277,0)"
       x1="260"
       y1="28.000004"
       x2="260"
       y2="68" />
    <linearGradient
       inkscape:collect="always"
       xlink:href="#linearGradient41680"
       id="linearGradient56508"
       gradientUnits="userSpaceOnUse"
       gradientTransform="matrix(0.91666667,0,0,1,23.666667,-8)"
       x1="220"
       y1="32"
       x2="220"
       y2="64" />
    <linearGradient
       inkscape:collect="always"
       xlink:href="#linearGradient41680"
       id="linearGradient56510"
       gradientUnits="userSpaceOnUse"
       gradientTransform="matrix(0.85714282,0,0,1,42.285724,-8)"
       x1="260"
       y1="28.000004"
       x2="260"
       y2="68" />
    <linearGradient
       inkscape:collect="always"
       xlink:href="#linearGradient43329"
       id="linearGradient56512"
       gradientUnits="userSpaceOnUse"
       gradientTransform="translate(228,-316)"
       x1="32"
       y1="276"
       x2="74.649414"
       y2="276" />
    <linearGradient
       inkscape:collect="always"
       xlink:href="#linearGradient41680"
       id="linearGradient56514"
       gradientUnits="userSpaceOnUse"
       gradientTransform="matrix(0.85714282,0,0,1,-25.714277,0)"
       x1="260"
       y1="28.000004"
       x2="260"
       y2="68" />
    <radialGradient
       inkscape:collect="always"
       xlink:href="#linearGradient51375"
       id="radialGradient56516"
       gradientUnits="userSpaceOnUse"
       gradientTransform="matrix(1.4999991,0,0,1.4999991,-27.999951,-93.999637)"
       cx="56"
       cy="195.99988"
       fx="56"
       fy="195.99988"
       r="32.000019" />
    <linearGradient
       inkscape:collect="always"
       xlink:href="#linearGradient73142"
       id="linearGradient56538"
       gradientUnits="userSpaceOnUse"
       gradientTransform="matrix(0.33333333,0,0,1,-126.66666,184)"
       x1="220"
       y1="32"
       x2="220"
       y2="64" />
    <linearGradient
       inkscape:collect="always"
       xlink:href="#linearGradient41680"
       id="linearGradient66153"
       gradientUnits="userSpaceOnUse"
       gradientTransform="matrix(0.85714282,0,0,1,-21.714277,-16)"
       x1="260"
       y1="28.000004"
       x2="260"
       y2="68" />
    <linearGradient
       inkscape:collect="always"
       xlink:href="#linearGradient41680"
       id="linearGradient66155"
       gradientUnits="userSpaceOnUse"
       gradientTransform="matrix(0.91666667,0,0,1,23.666667,-16)"
       x1="220"
       y1="32"
       x2="220"
       y2="64" />
    <linearGradient
       inkscape:collect="always"
       xlink:href="#linearGradient41680"
       id="linearGradient66157"
       gradientUnits="userSpaceOnUse"
       gradientTransform="matrix(0.85714282,0,0,1,42.285724,-16)"
       x1="260"
       y1="28.000004"
       x2="260"
       y2="68" />
    <linearGradient
       inkscape:collect="always"
       xlink:href="#linearGradient64164"
       id="linearGradient66159"
       gradientUnits="userSpaceOnUse"
       gradientTransform="translate(228,-308)"
       x1="32"
       y1="276"
       x2="74.649414"
       y2="276" />
    <linearGradient
       inkscape:collect="always"
       xlink:href="#linearGradient41680"
       id="linearGradient66161"
       gradientUnits="userSpaceOnUse"
       gradientTransform="matrix(0.85714282,0,0,1,-25.714277,0)"
       x1="260"
       y1="28.000004"
       x2="260"
       y2="68" />
    <radialGradient
       inkscape:collect="always"
       xlink:href="#linearGradient51375"
       id="radialGradient66163"
       gradientUnits="userSpaceOnUse"
       gradientTransform="matrix(1.4999991,0,0,1.4999991,-19.999951,-93.999637)"
       cx="56"
       cy="195.99988"
       fx="56"
       fy="195.99988"
       r="32.000019" />
    <linearGradient
       inkscape:collect="always"
       xlink:href="#linearGradient58776"
       id="linearGradient66165"
       gradientUnits="userSpaceOnUse"
       gradientTransform="matrix(0.33333333,0,0,1,-126.66666,184)"
       x1="220"
       y1="32"
       x2="220"
       y2="64" />
    <linearGradient
       inkscape:collect="always"
       xlink:href="#linearGradient66195"
       id="linearGradient71056"
       gradientUnits="userSpaceOnUse"
       gradientTransform="matrix(0.85714282,0,0,1,-21.714277,-16)"
       x1="260"
       y1="28.000004"
       x2="260"
       y2="68" />
    <linearGradient
       inkscape:collect="always"
       xlink:href="#linearGradient68885"
       id="linearGradient71058"
       gradientUnits="userSpaceOnUse"
       x1="12"
       y1="212"
       x2="52"
       y2="212" />
    <linearGradient
       inkscape:collect="always"
       xlink:href="#linearGradient66203"
       id="linearGradient71060"
       gradientUnits="userSpaceOnUse"
       gradientTransform="matrix(0.91666667,0,0,1,23.666667,-16)"
       x1="220"
       y1="32"
       x2="220"
       y2="64" />
    <linearGradient
       inkscape:collect="always"
       xlink:href="#linearGradient66195"
       id="linearGradient71062"
       gradientUnits="userSpaceOnUse"
       gradientTransform="matrix(0.85714282,0,0,1,42.285724,-16)"
       x1="260"
       y1="28.000004"
       x2="260"
       y2="68" />
    <linearGradient
       inkscape:collect="always"
       xlink:href="#linearGradient69952"
       id="linearGradient71064"
       gradientUnits="userSpaceOnUse"
       gradientTransform="translate(228,-308)"
       x1="32"
       y1="276"
       x2="74.649414"
       y2="276" />
    <linearGradient
       inkscape:collect="always"
       xlink:href="#linearGradient67314"
       id="linearGradient71066"
       gradientUnits="userSpaceOnUse"
       gradientTransform="matrix(0.85714282,0,0,1,-25.714277,0)"
       x1="260"
       y1="28.000004"
       x2="260"
       y2="68" />
    <linearGradient
       inkscape:collect="always"
       xlink:href="#linearGradient68885"
       id="linearGradient71068"
       gradientUnits="userSpaceOnUse"
       x1="28"
       y1="208"
       x2="68"
       y2="208" />
    <radialGradient
       inkscape:collect="always"
       xlink:href="#linearGradient67578"
       id="radialGradient71070"
       gradientUnits="userSpaceOnUse"
       gradientTransform="matrix(1.4999991,0,0,1.4999991,-19.999951,-93.999637)"
       cx="56"
       cy="195.99988"
       fx="56"
       fy="195.99988"
       r="32.000019" />
    <linearGradient
       inkscape:collect="always"
       xlink:href="#linearGradient67314"
       id="linearGradient71072"
       gradientUnits="userSpaceOnUse"
       gradientTransform="matrix(0.33333333,0,0,1,-126.66666,184)"
       x1="220"
       y1="32"
       x2="220"
       y2="64" />
    <linearGradient
       inkscape:collect="always"
       xlink:href="#linearGradient74482"
       id="linearGradient74342"
       x1="12"
       y1="212"
       x2="52"
       y2="212"
       gradientUnits="userSpaceOnUse" />
    <linearGradient
       inkscape:collect="always"
       xlink:href="#linearGradient74482"
       id="linearGradient74452"
       x1="28"
       y1="208"
       x2="68"
       y2="208"
       gradientUnits="userSpaceOnUse" />
    <linearGradient
       inkscape:collect="always"
       xlink:href="#linearGradient74482"
       id="linearGradient74454"
       x1="12"
       y1="276"
       x2="52"
       y2="276"
       gradientUnits="userSpaceOnUse" />
    <linearGradient
       inkscape:collect="always"
       xlink:href="#linearGradient73142"
       id="linearGradient7"
       gradientUnits="userSpaceOnUse"
       gradientTransform="matrix(0.85714282,0,0,1,-21.714277,-16)"
       x1="260"
       y1="28.000004"
       x2="260"
       y2="68" />
    <linearGradient
       inkscape:collect="always"
       xlink:href="#linearGradient74482"
       id="linearGradient8"
       gradientUnits="userSpaceOnUse"
       x1="12"
       y1="212"
       x2="52"
       y2="212" />
    <linearGradient
       inkscape:collect="always"
       xlink:href="#linearGradient73124"
       id="linearGradient9"
       gradientUnits="userSpaceOnUse"
       gradientTransform="matrix(0.91666667,0,0,1,23.666667,-16)"
       x1="220"
       y1="32"
       x2="220"
       y2="64" />
    <linearGradient
       inkscape:collect="always"
       xlink:href="#linearGradient73142"
       id="linearGradient10"
       gradientUnits="userSpaceOnUse"
       gradientTransform="matrix(0.85714282,0,0,1,42.285724,-16)"
       x1="260"
       y1="28.000004"
       x2="260"
       y2="68" />
    <linearGradient
       inkscape:collect="always"
       xlink:href="#linearGradient74482"
       id="linearGradient11"
       gradientUnits="userSpaceOnUse"
       x1="12"
       y1="276"
       x2="52"
       y2="276" />
    <linearGradient
       inkscape:collect="always"
       xlink:href="#linearGradient69952"
       id="linearGradient12"
       gradientUnits="userSpaceOnUse"
       gradientTransform="translate(228,-308)"
       x1="32"
       y1="276"
       x2="74.649414"
       y2="276" />
    <linearGradient
       inkscape:collect="always"
       xlink:href="#linearGradient73142"
       id="linearGradient13"
       gradientUnits="userSpaceOnUse"
       gradientTransform="matrix(0.85714282,0,0,1,-25.714277,0)"
       x1="260"
       y1="28.000004"
       x2="260"
       y2="68" />
    <linearGradient
       inkscape:collect="always"
       xlink:href="#linearGradient74482"
       id="linearGradient14"
       gradientUnits="userSpaceOnUse"
       x1="28"
       y1="208"
       x2="68"
       y2="208" />
    <radialGradient
       inkscape:collect="always"
       xlink:href="#linearGradient73134"
       id="radialGradient14"
       gradientUnits="userSpaceOnUse"
       gradientTransform="matrix(1.4999991,0,0,1.4999991,-19.999951,-93.999637)"
       cx="56"
       cy="195.99988"
       fx="56"
       fy="195.99988"
       r="32.000019" />
    <linearGradient
       inkscape:collect="always"
       xlink:href="#linearGradient73142"
       id="linearGradient15"
       gradientUnits="userSpaceOnUse"
       gradientTransform="matrix(0.33333333,0,0,1,-126.66666,184)"
       x1="220"
       y1="32"
       x2="220"
       y2="64" />
  </defs>
  <sodipodi:namedview
     inkscape:document-rotation="0"
     borderlayer="true"
     inkscape:snap-text-baseline="true"
     inkscape:snap-smooth-nodes="true"
     inkscape:snap-midpoints="false"
     inkscape:snap-object-midpoints="true"
     inkscape:snap-center="true"
     showborder="true"
     inkscape:snap-bbox-midpoints="true"
     inkscape:snap-bbox-edge-midpoints="true"
     inkscape:snap-intersection-paths="true"
     inkscape:object-paths="true"
     inkscape:snap-global="true"
     inkscape:bbox-nodes="true"
     inkscape:object-nodes="true"
     inkscape:measure-end="0,0"
     inkscape:measure-start="0,0"
     inkscape:locked="false"
     inkscape:guide-bbox="true"
     showguides="false"
     inkscape:pagecheckerboard="false"
     inkscape:window-maximized="1"
     guidetolerance="13"
     gridtolerance="12"
     objecttolerance="7"
     inkscape:snap-bbox="true"
     inkscape:snap-nodes="true"
     height="300px"
     width="400px"
     inkscape:window-y="0"
     inkscape:window-x="0"
     inkscape:window-height="1011"
     inkscape:window-width="1920"
     inkscape:showpageshadow="false"
     inkscape:document-units="px"
     inkscape:grid-bbox="true"
     showgrid="false"
     inkscape:current-layer="layer9"
     inkscape:cy="19.061858"
     inkscape:cx="158.4517"
     inkscape:zoom="1.678745"
     inkscape:pageshadow="2"
     inkscape:pageopacity="0.0"
     borderopacity="0.25490196"
     bordercolor="#666666"
     pagecolor="#ffffff"
     id="base"
     fill="#f57900"
     stroke="#ef2929"
     inkscape:snap-others="true"
     inkscape:deskcolor="#d1d1d1">
    <inkscape:grid
       originy="8"
       originx="8"
       empspacing="4"
       visible="false"
       enabled="true"
       spacingy="2"
       spacingx="2"
       id="grid5883"
       type="xygrid"
       units="px" />
    <sodipodi:guide
       inkscape:color="rgb(0,0,255)"
       inkscape:label=""
       inkscape:locked="false"
       id="guide1073"
       orientation="0,1"
       position="72,16" />
    <sodipodi:guide
       inkscape:color="rgb(0,0,255)"
       inkscape:label=""
       inkscape:locked="false"
       id="guide1075"
       orientation="1,0"
       position="20,72" />
    <sodipodi:guide
       inkscape:color="rgb(0,0,255)"
       inkscape:label=""
       inkscape:locked="false"
       id="guide1099"
       orientation="0,1"
       position="72,112" />
    <sodipodi:guide
       inkscape:color="rgb(0,0,255)"
       inkscape:label=""
       inkscape:locked="false"
       id="guide993"
       orientation="0,1"
       position="72,136" />
    <sodipodi:guide
       inkscape:color="rgb(0,0,255)"
       inkscape:label=""
       inkscape:locked="false"
       id="guide995"
       orientation="1,0"
       position="112,72" />
    <sodipodi:guide
       inkscape:color="rgb(0,0,255)"
       inkscape:label=""
       inkscape:locked="false"
       id="guide867"
       orientation="1,0"
       position="8.0000001,72" />
    <sodipodi:guide
       inkscape:color="rgb(0,0,255)"
       inkscape:label=""
       inkscape:locked="false"
       id="guide869"
       orientation="1,0"
       position="128,72" />
    <sodipodi:guide
       inkscape:color="rgb(0,0,255)"
       inkscape:label=""
       inkscape:locked="false"
       id="guide871"
       orientation="0,1"
       position="72,124" />
    <inkscape:grid
       originy="8"
       originx="8"
       dotted="true"
       empopacity="0.08627451"
       empcolor="#000000"
       opacity="0.49019608"
       color="#000000"
       empspacing="8"
       spacingy="1"
       spacingx="1"
       id="grid873"
       type="xygrid"
       units="px"
       visible="false" />
    <sodipodi:guide
       inkscape:color="rgb(0,0,255)"
       inkscape:label=""
       inkscape:locked="false"
       id="guide877"
       orientation="1,0"
       position="32,72" />
    <sodipodi:guide
       inkscape:color="rgb(0,0,255)"
       inkscape:label=""
       inkscape:locked="false"
       id="guide879"
       orientation="1,0"
       position="124,72" />
    <sodipodi:guide
       inkscape:color="rgb(0,0,255)"
       inkscape:label=""
       inkscape:locked="false"
       id="guide881"
       orientation="0,1"
       position="72,128" />
    <sodipodi:guide
       inkscape:color="rgb(0,0,255)"
       inkscape:label=""
       inkscape:locked="false"
       id="guide883"
       orientation="0,1"
       position="72,20" />
    <sodipodi:guide
       inkscape:color="rgb(0,0,255)"
       inkscape:label=""
       inkscape:locked="false"
       id="guide885"
       orientation="1,0"
       position="16,72" />
    <sodipodi:guide
       inkscape:color="rgb(0,0,255)"
       inkscape:label=""
       inkscape:locked="false"
       id="guide887"
       orientation="1,0"
       position="136,72" />
    <sodipodi:guide
       inkscape:color="rgb(0,0,255)"
       inkscape:label=""
       inkscape:locked="false"
       id="guide897"
       orientation="0,1"
       position="72,8" />
    <sodipodi:guide
       inkscape:color="rgb(0,0,255)"
       inkscape:label=""
       inkscape:locked="false"
       id="guide899"
       orientation="0,1"
       position="72,32" />
    <sodipodi:guide
       inkscape:color="rgb(0,0,255)"
       inkscape:label=""
       inkscape:locked="false"
       id="guide950"
       orientation="-0.70710678,0.70710678"
       position="264,264" />
    <sodipodi:guide
       inkscape:color="rgb(0,0,255)"
       inkscape:label=""
       inkscape:locked="false"
       id="guide952"
       orientation="0.70710678,0.70710678"
       position="72,72" />
  </sodipodi:namedview>
  <metadata
     id="metadata4">
    <rdf:RDF>
      <cc:Work
         rdf:about="">
        <dc:title>Adwaita Icon Template</dc:title>
      </cc:Work>
    </rdf:RDF>
  </metadata>
  <g
     transform="translate(8,-156)"
     style="display:inline"
     inkscape:groupmode="layer"
     inkscape:label="App Icon"
     id="layer1">
    <g
       sodipodi:insensitive="true"
       style="display:inline"
       inkscape:label="template"
       id="layer4"
       inkscape:groupmode="layer">
      <rect
         style="display:inline;overflow:visible;visibility:visible;fill:#f0f0f0;fill-opacity:0;fill-rule:nonzero;stroke:none;stroke-width:0.5;marker:none;enable-background:accumulate"
         id="hicolor"
         width="128"
         height="128"
         x="9.2651362e-08"
         y="172"
         inkscape:label="0" />
      <rect
         inkscape:label="0"
         y="172"
         x="160"
         height="16"
         width="16"
         id="symbolic"
         style="display:inline;overflow:visible;visibility:visible;fill:#f0f0f0;fill-opacity:0;fill-rule:nonzero;stroke:none;stroke-width:0.5;marker:none;enable-background:accumulate" />
    </g>
    <g
       style="display:inline"
       inkscape:label="baseplate"
       id="layer2"
       inkscape:groupmode="layer"
       sodipodi:insensitive="true">
      <g
         inkscape:export-ydpi="12"
         inkscape:export-xdpi="12"
         id="g12027"
         transform="matrix(7.9911709,0,0,8.0036407,-167.7909,-4846.0776)"
         style="display:inline;fill:#000000;enable-background:new" />
      <rect
         inkscape:label="0"
         y="172"
         x="9.2651362e-08"
         height="128"
         width="128"
         id="128"
         style="display:inline;overflow:visible;visibility:visible;fill:#f0f0f0;fill-opacity:1;fill-rule:nonzero;stroke:none;stroke-width:0.5;marker:none;enable-background:accumulate" />
      <g
         transform="translate(-24,24)"
         style="fill:none;fill-opacity:0.25098;stroke:#a579b3;stroke-opacity:1"
         id="g883" />
      <g
         transform="translate(-24,24)"
         style="fill:none;fill-opacity:0.25098;stroke:#a579b3;stroke-opacity:1"
         id="g900" />
      <rect
         style="display:inline;overflow:visible;visibility:visible;fill:#f0f0f0;fill-opacity:1;fill-rule:nonzero;stroke:none;stroke-width:0.5;marker:none;enable-background:accumulate"
         id="16"
         width="16"
         height="16"
         x="160"
         y="172"
         inkscape:label="" />
      <text
         inkscape:label="icon-name"
         id="text863"
         y="167"
         x="0"
         style="font-style:normal;font-variant:normal;font-weight:bold;font-stretch:normal;font-size:4px;line-height:125%;font-family:Cantarell;-inkscape-font-specification:'Cantarell, Bold';text-align:start;writing-mode:lr-tb;text-anchor:start;display:inline;fill:#000000;fill-opacity:1;stroke:none;stroke-width:0.332649;enable-background:new"
         xml:space="preserve"><tspan
           y="167"
           x="0"
           id="tspan861"
           sodipodi:role="line"
           style="font-size:4px;stroke-width:0.332649">Hicolor</tspan></text>
      <text
         xml:space="preserve"
         style="font-style:normal;font-variant:normal;font-weight:bold;font-stretch:normal;font-size:4px;line-height:125%;font-family:Cantarell;-inkscape-font-specification:'Cantarell, Bold';text-align:start;writing-mode:lr-tb;text-anchor:start;display:inline;fill:#000000;fill-opacity:1;stroke:none;stroke-width:0.332649;enable-background:new"
         x="160"
         y="167"
         id="text867"
         inkscape:label="icon-name"><tspan
           style="font-size:4px;stroke-width:0.332649"
           sodipodi:role="line"
           id="tspan865"
           x="160"
           y="167">Symbolic</tspan></text>
    </g>
    <g
       style="display:inline"
       inkscape:label="icons"
       id="layer9"
       inkscape:groupmode="layer">
      <g
         id="g38046"
         transform="translate(0,4)"
         style="stroke:#5e5c64" />
      <g
         id="g48529"
         style="fill:#f6f5f4"
         transform="translate(-2.7e-4,-3.999878)" />
      <path
         style="fill:none;stroke:#000000;stroke-width:4;stroke-linecap:round;stroke-linejoin:miter;stroke-opacity:1"
         d="M 277.5,160 H 274"
         id="path77597"
         sodipodi:nodetypes="cc" />
      <g
         id="g98176">
        <path
           style="fill:none;stroke:#000000;stroke-width:4;stroke-linecap:square;stroke-linejoin:miter;stroke-opacity:1"
           d="m 164,175 v 6.60827"
           id="path75731"
           sodipodi:nodetypes="cc" />
        <path
           style="fill:none;fill-opacity:1;stroke:#000000;stroke-width:4;stroke-linecap:square;stroke-linejoin:round;stroke-miterlimit:4;stroke-dasharray:none;stroke-dashoffset:1.8;stroke-opacity:1"
           id="path75871"
           sodipodi:type="arc"
           sodipodi:cx="167"
           sodipodi:cy="175"
           sodipodi:rx="5"
           sodipodi:ry="5"
           sodipodi:start="0"
           sodipodi:end="1.5707963"
           sodipodi:open="true"
           sodipodi:arc-type="arc"
           d="m 172,175 a 5,5 0 0 1 -5,5" />
        <path
           id="path86228"
           style="fill:#000000;fill-opacity:1;stroke:none;stroke-width:4;stroke-linecap:round;stroke-linejoin:round;stroke-miterlimit:4;stroke-dasharray:none;stroke-dashoffset:1.8;stroke-opacity:1"
           d="m 172,26 a 3.0000033,3.0000033 0 0 0 -3,3 3.0000033,3.0000033 0 0 0 3,3 3.0000033,3.0000033 0 0 0 3,-3 3.0000033,3.0000033 0 0 0 -3,-3 z m 0,2 a 1,1 0 0 1 1,1 1,1 0 0 1 -1,1 1,1 0 0 1 -1,-1 1,1 0 0 1 1,-1 z"
           transform="translate(-8,156)" />
      </g>
      <g
         id="g87390"
         transform="translate(140)">
        <path
           style="fill:none;stroke:#000000;stroke-width:4;stroke-linecap:round;stroke-linejoin:miter;stroke-opacity:1"
           d="m 164.5,175.39173 v 10.21654"
           id="path87369" />
        <path
           style="fill:none;stroke:#000000;stroke-width:4;stroke-linecap:round;stroke-linejoin:miter;stroke-opacity:1"
           d="m 168,180 h -3.5"
           id="path87371"
           sodipodi:nodetypes="cc" />
        <path
           style="fill:none;fill-opacity:1;stroke:#000000;stroke-width:4;stroke-linecap:round;stroke-linejoin:round;stroke-miterlimit:4;stroke-dasharray:none;stroke-dashoffset:1.8;stroke-opacity:1"
           id="path87373"
           sodipodi:type="arc"
           sodipodi:cx="168"
           sodipodi:cy="175"
           sodipodi:rx="5"
           sodipodi:ry="5"
           sodipodi:start="0"
           sodipodi:end="1.5707963"
           sodipodi:open="true"
           sodipodi:arc-type="arc"
           d="m 173,175 a 5,5 0 0 1 -5,5" />
        <circle
           style="fill:#000000;fill-opacity:1;stroke:none;stroke-width:4;stroke-linecap:round;stroke-linejoin:round;stroke-miterlimit:4;stroke-dasharray:none;stroke-dashoffset:1.8;stroke-opacity:1"
           id="circle87375"
           cx="164.5"
           cy="185"
           r="3.0000033" />
        <circle
           style="fill:#ffffff;fill-opacity:1;stroke:none;stroke-width:4;stroke-linecap:round;stroke-linejoin:round;stroke-miterlimit:4;stroke-dasharray:none;stroke-dashoffset:1.8;stroke-opacity:1"
           id="circle87377"
           cx="164.5"
           cy="185"
           r="1" />
        <circle
           style="fill:#000000;fill-opacity:1;stroke:none;stroke-width:4;stroke-linecap:round;stroke-linejoin:round;stroke-miterlimit:4;stroke-dasharray:none;stroke-dashoffset:1.8;stroke-opacity:1"
           id="circle87379"
           cx="164.5"
           cy="175"
           r="3.0000033" />
        <circle
           style="fill:#000000;fill-opacity:1;stroke:none;stroke-width:4;stroke-linecap:round;stroke-linejoin:round;stroke-miterlimit:4;stroke-dasharray:none;stroke-dashoffset:1.8;stroke-opacity:1"
           id="circle87381"
           cx="173"
           cy="175"
           r="3.0000033" />
      </g>
      <g
         id="g91140"
         transform="translate(120)">
        <path
           style="fill:none;stroke:#000000;stroke-width:4;stroke-linecap:square;stroke-linejoin:miter;stroke-opacity:1"
           d="m 164,175 v 6.60827"
           id="path91131"
           sodipodi:nodetypes="cc" />
        <path
           style="fill:none;fill-opacity:1;stroke:#000000;stroke-width:4;stroke-linecap:square;stroke-linejoin:round;stroke-miterlimit:4;stroke-dasharray:none;stroke-dashoffset:1.8;stroke-opacity:1"
           id="path91133"
           sodipodi:type="arc"
           sodipodi:cx="167"
           sodipodi:cy="175"
           sodipodi:rx="5"
           sodipodi:ry="5"
           sodipodi:start="0"
           sodipodi:end="1.5707963"
           sodipodi:open="true"
           sodipodi:arc-type="arc"
           d="m 172,175 a 5,5 0 0 1 -5,5" />
        <path
           id="path91135"
           style="fill:#000000;fill-opacity:1;stroke:none;stroke-width:4;stroke-linecap:round;stroke-linejoin:round;stroke-miterlimit:4;stroke-dasharray:none;stroke-dashoffset:1.8;stroke-opacity:1"
           d="m 172,26 a 3.0000033,3.0000033 0 0 0 -3,3 3.0000033,3.0000033 0 0 0 3,3 3.0000033,3.0000033 0 0 0 3,-3 3.0000033,3.0000033 0 0 0 -3,-3 z m 0,2 a 1,1 0 0 1 1,1 1,1 0 0 1 -1,1 1,1 0 0 1 -1,-1 1,1 0 0 1 1,-1 z"
           transform="translate(-8,156)" />
      </g>
      <g
         id="g56486"
         transform="translate(-700,10)"
         style="display:inline;enable-background:new">
        <g
           id="g56454"
           transform="translate(-8,4)">
          <rect
             style="fill:url(#linearGradient56506);fill-opacity:1;stroke-width:2;stroke-linejoin:round;stroke-dasharray:8, 3.99998;stroke-dashoffset:1.80001"
             id="rect56450"
             width="47.999985"
             height="39.999996"
             x="180"
             y="28.000004"
             transform="matrix(0,1,1,0,0,0)"
             rx="19.999998"
             ry="19.999998" />
          <circle
             style="fill:#1a5fb4;fill-opacity:1;stroke-width:2;stroke-linejoin:round;stroke-dasharray:8, 4;stroke-dashoffset:1.8"
             id="circle56452"
             cx="48"
             cy="208"
             r="20" />
        </g>
        <rect
           style="fill:url(#linearGradient56508);fill-opacity:1;stroke-width:2;stroke-linejoin:round;stroke-dasharray:8, 3.99998;stroke-dashoffset:1.80001"
           id="rect56456"
           width="88"
           height="32"
           x="196"
           y="24"
           transform="matrix(0,1,1,0,0,0)"
           rx="16"
           ry="16" />
        <path
           id="path56458"
           style="fill:#1c71d8;fill-opacity:1;stroke-width:2;stroke-linejoin:round;stroke-dasharray:8, 3.99998;stroke-dashoffset:1.80001"
           d="m 40,247 c -6.557212,0 -12.356953,3.12562 -16,7.97266 V 269 c 0,8.864 7.136,16 16,16 8.864,0 16,-7.136 16,-16 V 254.97266 C 52.356953,250.12562 46.557212,247 40,247 Z" />
        <rect
           style="fill:url(#linearGradient56510);fill-opacity:1;stroke-width:2;stroke-linejoin:round;stroke-dasharray:8, 3.99998;stroke-dashoffset:1.80001"
           id="rect56460"
           width="47.999985"
           height="39.999996"
           x="248"
           y="20.000004"
           transform="matrix(0,1,1,0,0,0)"
           rx="19.999998"
           ry="19.999998" />
        <circle
           style="fill:#1a5fb4;fill-opacity:1;stroke-width:2;stroke-linejoin:round;stroke-dasharray:8, 4;stroke-dashoffset:1.8"
           id="circle56462"
           cx="40"
           cy="276"
           r="20" />
        <circle
           style="fill:url(#linearGradient56512);fill-opacity:1;stroke-width:2;stroke-linejoin:round;stroke-dasharray:8, 4;stroke-dashoffset:1.8"
           id="circle56464"
           cx="276"
           cy="-40"
           r="16"
           transform="rotate(90)" />
        <g
           id="g56470"
           transform="translate(40,-8)">
          <rect
             style="fill:url(#linearGradient56514);fill-opacity:1;stroke-width:2;stroke-linejoin:round;stroke-dasharray:8, 3.99998;stroke-dashoffset:1.80001"
             id="rect56466"
             width="47.999985"
             height="39.999996"
             x="180"
             y="28.000004"
             transform="matrix(0,1,1,0,0,0)"
             rx="19.999998"
             ry="19.999998" />
          <circle
             style="fill:#1a5fb4;fill-opacity:1;stroke-width:2;stroke-linejoin:round;stroke-dasharray:8, 4;stroke-dashoffset:1.8"
             id="circle56468"
             cx="48"
             cy="208"
             r="20" />
        </g>
        <path
           style="fill:none;fill-opacity:1;stroke:url(#radialGradient56516);stroke-width:32;stroke-linecap:round;stroke-linejoin:round;stroke-miterlimit:4;stroke-dasharray:none;stroke-dashoffset:1.8;stroke-opacity:1"
           id="path56472"
           sodipodi:type="arc"
           sodipodi:cx="56"
           sodipodi:cy="200"
           sodipodi:rx="32.000038"
           sodipodi:ry="32"
           sodipodi:start="0"
           sodipodi:end="1.5707963"
           sodipodi:arc-type="arc"
           d="M 88.000038,200 A 32.000038,32 0 0 1 56,232"
           sodipodi:open="true" />
      </g>
      <g
         id="g98190"
         transform="translate(-350,10)"
         style="display:inline;enable-background:new">
        <rect
           style="fill:url(#linearGradient43137);fill-opacity:1;stroke-width:2;stroke-linejoin:round;stroke-dasharray:8, 3.99998;stroke-dashoffset:1.80001"
           id="rect43133"
           width="47.999985"
           height="39.999996"
           x="184"
           y="12.000004"
           transform="matrix(0,1,1,0,0,0)"
           rx="19.999998"
           ry="19.999998" />
        <circle
           style="fill:url(#linearGradient74342);fill-opacity:1;stroke-width:2;stroke-linejoin:round;stroke-dasharray:8, 4;stroke-dashoffset:1.8"
           id="circle43135"
           cx="32"
           cy="212"
           r="20" />
        <rect
           style="display:inline;fill:url(#linearGradient41682);fill-opacity:1;stroke-width:2;stroke-linejoin:round;stroke-dasharray:8, 3.99998;stroke-dashoffset:1.80001;enable-background:new"
           id="rect41266"
           width="88"
           height="32"
           x="196"
           y="16"
           transform="matrix(0,1,1,0,0,0)"
           rx="16"
           ry="16" />
        <path
           id="rect52841"
           style="display:inline;fill:#241f31;fill-opacity:0.2;stroke-width:2;stroke-linejoin:round;stroke-dasharray:8, 3.99998;stroke-dashoffset:1.80001;enable-background:new"
           d="m 32,247 c -6.557212,0 -12.356953,3.12562 -16,7.97266 V 269 c 0,8.864 7.136,16 16,16 8.864,0 16,-7.136 16,-16 V 254.97266 C 44.356953,250.12562 38.557212,247 32,247 Z" />
        <rect
           style="display:inline;fill:url(#linearGradient42208);fill-opacity:1;stroke-width:2;stroke-linejoin:round;stroke-dasharray:8, 3.99998;stroke-dashoffset:1.80001;enable-background:new"
           id="rect41516"
           width="47.999985"
           height="39.999996"
           x="248"
           y="12.000004"
           transform="matrix(0,1,1,0,0,0)"
           rx="19.999998"
           ry="19.999998" />
        <circle
           style="display:inline;fill:url(#linearGradient74454);fill-opacity:1;stroke-width:2;stroke-linejoin:round;stroke-dasharray:8, 4;stroke-dashoffset:1.8;enable-background:new"
           id="path41312"
           cx="32"
           cy="276"
           r="20" />
        <circle
           style="display:inline;fill:url(#linearGradient43331);fill-opacity:1;stroke-width:2;stroke-linejoin:round;stroke-dasharray:8, 4;stroke-dashoffset:1.8;enable-background:new"
           id="circle41638"
           cx="276"
           cy="-32"
           r="16"
           transform="rotate(90)" />
        <g
           id="g49345"
           transform="translate(48,-8)"
           style="display:inline;enable-background:new">
          <rect
             style="fill:url(#linearGradient49351);fill-opacity:1;stroke-width:2;stroke-linejoin:round;stroke-dasharray:8, 3.99998;stroke-dashoffset:1.80001"
             id="rect49341"
             width="47.999985"
             height="39.999996"
             x="180"
             y="28.000004"
             transform="matrix(0,1,1,0,0,0)"
             rx="19.999998"
             ry="19.999998" />
          <circle
             style="fill:url(#linearGradient74452);fill-opacity:1;stroke-width:2;stroke-linejoin:round;stroke-dasharray:8, 4;stroke-dashoffset:1.8"
             id="circle49343"
             cx="48"
             cy="208"
             r="20" />
        </g>
        <path
           style="display:inline;fill:none;fill-opacity:1;stroke:url(#radialGradient51179);stroke-width:32;stroke-linecap:round;stroke-linejoin:round;stroke-miterlimit:4;stroke-dasharray:none;stroke-dashoffset:1.8;stroke-opacity:1;enable-background:new"
           id="ellipse51025"
           sodipodi:type="arc"
           sodipodi:cx="64"
           sodipodi:cy="200"
           sodipodi:rx="32.000038"
           sodipodi:ry="32"
           sodipodi:start="0"
           sodipodi:end="1.5707963"
           sodipodi:arc-type="arc"
           d="M 96.000038,200 A 32.000038,32 0 0 1 64,232"
           sodipodi:open="true" />
        <path
           style="display:inline;fill:url(#linearGradient56538);fill-opacity:1;stroke-width:2.34522;stroke-linejoin:round;stroke-dasharray:9.38085, 4.69039;stroke-dashoffset:2.1107;enable-background:new"
           id="rect56536"
           width="32"
           height="32"
           x="-64"
           y="216"
           transform="scale(-1,1)"
           inkscape:path-effect="#path-effect62106"
           d="m -64,216 h 16 a 16,16 45 0 1 16,16 16,16 135 0 1 -16,16 h -16 z"
           sodipodi:type="rect" />
      </g>
      <g
         id="g66133"
         transform="translate(-590,10)"
         style="display:inline;enable-background:new">
        <g
           id="g66094">
          <rect
             style="fill:url(#linearGradient66153);fill-opacity:1;stroke-width:2;stroke-linejoin:round;stroke-dasharray:8, 3.99998;stroke-dashoffset:1.80001"
             id="rect66090"
             width="47.999985"
             height="39.999996"
             x="184"
             y="12.000004"
             transform="matrix(0,1,1,0,0,0)"
             rx="19.999998"
             ry="19.999998" />
          <circle
             style="fill:#1a5fb4;fill-opacity:1;stroke-width:2;stroke-linejoin:round;stroke-dasharray:8, 4;stroke-dashoffset:1.8"
             id="circle66092"
             cx="32"
             cy="212"
             r="20" />
        </g>
        <rect
           style="display:inline;fill:url(#linearGradient66155);fill-opacity:1;stroke-width:2;stroke-linejoin:round;stroke-dasharray:8, 3.99998;stroke-dashoffset:1.80001;enable-background:new"
           id="rect66096"
           width="88"
           height="32"
           x="196"
           y="16"
           transform="matrix(0,1,1,0,0,0)"
           rx="16"
           ry="16" />
        <path
           id="path66098"
           style="display:inline;fill:#1c71d8;fill-opacity:1;stroke-width:2;stroke-linejoin:round;stroke-dasharray:8, 3.99998;stroke-dashoffset:1.80001;enable-background:new"
           d="m 32,247 c -6.557212,0 -12.356953,3.12562 -16,7.97266 V 269 c 0,8.864 7.136,16 16,16 8.864,0 16,-7.136 16,-16 V 254.97266 C 44.356953,250.12562 38.557212,247 32,247 Z" />
        <rect
           style="display:inline;fill:url(#linearGradient66157);fill-opacity:1;stroke-width:2;stroke-linejoin:round;stroke-dasharray:8, 3.99998;stroke-dashoffset:1.80001;enable-background:new"
           id="rect66100"
           width="47.999985"
           height="39.999996"
           x="248"
           y="12.000004"
           transform="matrix(0,1,1,0,0,0)"
           rx="19.999998"
           ry="19.999998" />
        <circle
           style="display:inline;fill:#1a5fb4;fill-opacity:1;stroke-width:2;stroke-linejoin:round;stroke-dasharray:8, 4;stroke-dashoffset:1.8;enable-background:new"
           id="circle66102"
           cx="32"
           cy="276"
           r="20" />
        <circle
           style="display:inline;fill:url(#linearGradient66159);fill-opacity:1;stroke-width:2;stroke-linejoin:round;stroke-dasharray:8, 4;stroke-dashoffset:1.8;enable-background:new"
           id="circle66104"
           cx="276"
           cy="-32"
           r="16"
           transform="rotate(90)" />
        <g
           id="g66110"
           transform="translate(48,-8)"
           style="display:inline;enable-background:new">
          <rect
             style="fill:url(#linearGradient66161);fill-opacity:1;stroke-width:2;stroke-linejoin:round;stroke-dasharray:8, 3.99998;stroke-dashoffset:1.80001"
             id="rect66106"
             width="47.999985"
             height="39.999996"
             x="180"
             y="28.000004"
             transform="matrix(0,1,1,0,0,0)"
             rx="19.999998"
             ry="19.999998" />
          <circle
             style="fill:#1a5fb4;fill-opacity:1;stroke-width:2;stroke-linejoin:round;stroke-dasharray:8, 4;stroke-dashoffset:1.8"
             id="circle66108"
             cx="48"
             cy="208"
             r="20" />
        </g>
        <path
           style="display:inline;fill:none;fill-opacity:1;stroke:url(#radialGradient66163);stroke-width:32;stroke-linecap:round;stroke-linejoin:round;stroke-miterlimit:4;stroke-dasharray:none;stroke-dashoffset:1.8;stroke-opacity:1;enable-background:new"
           id="path66112"
           sodipodi:type="arc"
           sodipodi:cx="64"
           sodipodi:cy="200"
           sodipodi:rx="32.000038"
           sodipodi:ry="32"
           sodipodi:start="0"
           sodipodi:end="1.5707963"
           sodipodi:arc-type="arc"
           d="M 96.000038,200 A 32.000038,32 0 0 1 64,232"
           sodipodi:open="true" />
        <path
           style="display:inline;fill:url(#linearGradient66165);fill-opacity:1;stroke-width:2.34522;stroke-linejoin:round;stroke-dasharray:9.38085, 4.69039;stroke-dashoffset:2.1107;enable-background:new"
           id="path66114"
           width="32"
           height="32"
           x="-64"
           y="216"
           transform="scale(-1,1)"
           inkscape:path-effect="#path-effect66118"
           d="m -64,216 h 16 a 16,16 45 0 1 16,16 16,16 135 0 1 -16,16 h -16 z"
           sodipodi:type="rect" />
      </g>
      <g
         id="g71036"
         transform="translate(-470,10)"
         style="display:inline;enable-background:new">
        <rect
           style="fill:url(#linearGradient71056);fill-opacity:1;stroke-width:2;stroke-linejoin:round;stroke-dasharray:8, 3.99998;stroke-dashoffset:1.80001"
           id="rect70996"
           width="47.999985"
           height="39.999996"
           x="184"
           y="12.000004"
           transform="matrix(0,1,1,0,0,0)"
           rx="19.999998"
           ry="19.999998" />
        <circle
           style="fill:url(#linearGradient71058);fill-opacity:1;stroke-width:2;stroke-linejoin:round;stroke-dasharray:8, 4;stroke-dashoffset:1.8"
           id="circle70998"
           cx="32"
           cy="212"
           r="20" />
        <rect
           style="display:inline;fill:url(#linearGradient71060);fill-opacity:1;stroke-width:2;stroke-linejoin:round;stroke-dasharray:8, 3.99998;stroke-dashoffset:1.80001;enable-background:new"
           id="rect71000"
           width="88"
           height="32"
           x="196"
           y="16"
           transform="matrix(0,1,1,0,0,0)"
           rx="16"
           ry="16" />
        <path
           id="path71002"
           style="display:inline;fill:#e5a50a;fill-opacity:1;stroke-width:2;stroke-linejoin:round;stroke-dasharray:8, 3.99998;stroke-dashoffset:1.80001;enable-background:new"
           d="m 32,247 c -6.557212,0 -12.356953,3.12562 -16,7.97266 V 269 c 0,8.864 7.136,16 16,16 8.864,0 16,-7.136 16,-16 V 254.97266 C 44.356953,250.12562 38.557212,247 32,247 Z" />
        <rect
           style="display:inline;fill:url(#linearGradient71062);fill-opacity:1;stroke-width:2;stroke-linejoin:round;stroke-dasharray:8, 3.99998;stroke-dashoffset:1.80001;enable-background:new"
           id="rect71004"
           width="47.999985"
           height="39.999996"
           x="248"
           y="12.000004"
           transform="matrix(0,1,1,0,0,0)"
           rx="19.999998"
           ry="19.999998" />
        <circle
           style="display:inline;fill:#e5a50a;fill-opacity:1;stroke-width:2;stroke-linejoin:round;stroke-dasharray:8, 4;stroke-dashoffset:1.8;enable-background:new"
           id="circle71006"
           cx="32"
           cy="276"
           r="20" />
        <circle
           style="display:inline;fill:url(#linearGradient71064);fill-opacity:1;stroke-width:2;stroke-linejoin:round;stroke-dasharray:8, 4;stroke-dashoffset:1.8;enable-background:new"
           id="circle71008"
           cx="276"
           cy="-32"
           r="16"
           transform="rotate(90)" />
        <g
           id="g71014"
           transform="translate(48,-8)"
           style="display:inline;enable-background:new">
          <rect
             style="fill:url(#linearGradient71066);fill-opacity:1;stroke-width:2;stroke-linejoin:round;stroke-dasharray:8, 3.99998;stroke-dashoffset:1.80001"
             id="rect71010"
             width="47.999985"
             height="39.999996"
             x="180"
             y="28.000004"
             transform="matrix(0,1,1,0,0,0)"
             rx="19.999998"
             ry="19.999998" />
          <circle
             style="fill:url(#linearGradient71068);fill-opacity:1;stroke-width:2;stroke-linejoin:round;stroke-dasharray:8, 4;stroke-dashoffset:1.8"
             id="circle71012"
             cx="48"
             cy="208"
             r="20" />
        </g>
        <path
           style="display:inline;fill:none;fill-opacity:1;stroke:url(#radialGradient71070);stroke-width:32;stroke-linecap:round;stroke-linejoin:round;stroke-miterlimit:4;stroke-dasharray:none;stroke-dashoffset:1.8;stroke-opacity:1;enable-background:new"
           id="path71016"
           sodipodi:type="arc"
           sodipodi:cx="64"
           sodipodi:cy="200"
           sodipodi:rx="32.000038"
           sodipodi:ry="32"
           sodipodi:start="0"
           sodipodi:end="1.5707963"
           sodipodi:arc-type="arc"
           d="M 96.000038,200 A 32.000038,32 0 0 1 64,232"
           sodipodi:open="true" />
        <path
           style="display:inline;fill:url(#linearGradient71072);fill-opacity:1;stroke-width:2.34522;stroke-linejoin:round;stroke-dasharray:9.38085, 4.69039;stroke-dashoffset:2.1107;enable-background:new"
           id="path71018"
           width="32"
           height="32"
           x="-64"
           y="216"
           transform="scale(-1,1)"
           inkscape:path-effect="#path-effect71022"
           d="m -64,216 h 16 a 16,16 45 0 1 16,16 16,16 135 0 1 -16,16 h -16 z"
           sodipodi:type="rect" />
      </g>
      <g
         id="g120914" />
      <g
         id="g6"
         style="display:inline;enable-background:new"
         transform="translate(0,2)">
        <rect
           style="fill:url(#linearGradient7);fill-opacity:1;stroke-width:2;stroke-linejoin:round;stroke-dasharray:8, 3.99998;stroke-dashoffset:1.80001"
           id="rect1"
           width="47.999985"
           height="39.999996"
           x="184"
           y="12.000004"
           transform="matrix(0,1,1,0,0,0)"
           rx="19.999998"
           ry="19.999998" />
        <circle
           style="fill:url(#linearGradient8);fill-opacity:1;stroke-width:2;stroke-linejoin:round;stroke-dasharray:8, 4;stroke-dashoffset:1.8"
           id="circle1"
           cx="32"
           cy="212"
           r="20" />
        <rect
           style="display:inline;fill:url(#linearGradient9);fill-opacity:1;stroke-width:2;stroke-linejoin:round;stroke-dasharray:8, 3.99998;stroke-dashoffset:1.80001;enable-background:new"
           id="rect2"
           width="88"
           height="32"
           x="196"
           y="16"
           transform="matrix(0,1,1,0,0,0)"
           rx="16"
           ry="16" />
        <path
           id="path2"
           style="display:inline;fill:#241f31;fill-opacity:0.2;stroke-width:2;stroke-linejoin:round;stroke-dasharray:8, 3.99998;stroke-dashoffset:1.80001;enable-background:new"
           d="m 32,247 c -6.557212,0 -12.356953,3.12562 -16,7.97266 V 269 c 0,8.864 7.136,16 16,16 8.864,0 16,-7.136 16,-16 V 254.97266 C 44.356953,250.12562 38.557212,247 32,247 Z" />
        <rect
           style="display:inline;fill:url(#linearGradient10);fill-opacity:1;stroke-width:2;stroke-linejoin:round;stroke-dasharray:8, 3.99998;stroke-dashoffset:1.80001;enable-background:new"
           id="rect3"
           width="47.999985"
           height="39.999996"
           x="248"
           y="12.000004"
           transform="matrix(0,1,1,0,0,0)"
           rx="19.999998"
           ry="19.999998" />
        <circle
           style="display:inline;fill:url(#linearGradient11);fill-opacity:1;stroke-width:2;stroke-linejoin:round;stroke-dasharray:8, 4;stroke-dashoffset:1.8;enable-background:new"
           id="circle3"
           cx="32"
           cy="276"
           r="20" />
        <circle
           style="display:inline;fill:url(#linearGradient12);fill-opacity:1;stroke-width:2;stroke-linejoin:round;stroke-dasharray:8, 4;stroke-dashoffset:1.8;enable-background:new"
           id="circle4"
           cx="276"
           cy="-32"
           r="16"
           transform="rotate(90)" />
        <g
           id="g5"
           transform="translate(48,-8)"
           style="display:inline;enable-background:new">
          <rect
             style="fill:url(#linearGradient13);fill-opacity:1;stroke-width:2;stroke-linejoin:round;stroke-dasharray:8, 3.99998;stroke-dashoffset:1.80001"
             id="rect4"
             width="47.999985"
             height="39.999996"
             x="180"
             y="28.000004"
             transform="matrix(0,1,1,0,0,0)"
             rx="19.999998"
             ry="19.999998" />
          <circle
             style="fill:url(#linearGradient14);fill-opacity:1;stroke-width:2;stroke-linejoin:round;stroke-dasharray:8, 4;stroke-dashoffset:1.8"
             id="circle5"
             cx="48"
             cy="208"
             r="20" />
        </g>
        <path
           style="display:inline;fill:none;fill-opacity:1;stroke:url(#radialGradient14);stroke-width:32;stroke-linecap:round;stroke-linejoin:round;stroke-miterlimit:4;stroke-dasharray:none;stroke-dashoffset:1.8;stroke-opacity:1;enable-background:new"
           id="path5"
           sodipodi:type="arc"
           sodipodi:cx="64"
           sodipodi:cy="200"
           sodipodi:rx="32.000038"
           sodipodi:ry="32"
           sodipodi:start="0"
           sodipodi:end="1.5707963"
           sodipodi:arc-type="arc"
           d="M 96.000038,200 A 32.000038,32 0 0 1 64,232"
           sodipodi:open="true" />
        <path
           style="display:inline;fill:url(#linearGradient15);fill-opacity:1;stroke-width:2.34522;stroke-linejoin:round;stroke-dasharray:9.38085, 4.69039;stroke-dashoffset:2.1107;enable-background:new"
           id="path6"
           width="32"
           height="32"
           x="-64"
           y="216"
           transform="scale(-1,1)"
           inkscape:path-effect="#path-effect7"
           d="m -64,216 h 16 a 16,16 45 0 1 16,16 16,16 135 0 1 -16,16 h -16 z"
           sodipodi:type="rect" />
      </g>
    </g>
    <g
       style="display:none"
       inkscape:label="grid"
       id="layer3"
       inkscape:groupmode="layer"
       sodipodi:insensitive="true">
      <circle
         style="display:inline;opacity:0.1;vector-effect:none;fill:none;fill-opacity:1;stroke:#000000;stroke-width:0.99;stroke-linecap:butt;stroke-linejoin:miter;stroke-miterlimit:4;stroke-dasharray:0.99, 0.99;stroke-dashoffset:0;stroke-opacity:1;marker:none;marker-start:none;marker-mid:none;marker-end:none;paint-order:normal;enable-background:new"
         id="circle2892"
         r="59.504131"
         cy="236"
         cx="64.000031" />
      <rect
         style="display:inline;opacity:0.1;vector-effect:none;fill:none;fill-opacity:1;stroke:#000000;stroke-width:0.99;stroke-linecap:butt;stroke-linejoin:miter;stroke-miterlimit:4;stroke-dasharray:0.99, 0.99;stroke-dashoffset:0;stroke-opacity:1;marker:none;marker-start:none;marker-mid:none;marker-end:none;paint-order:normal;enable-background:new"
         id="rect2896"
         width="103.00952"
         height="103.00952"
         x="12.495266"
         y="184.49524"
         rx="7.9238095"
         ry="7.9238095" />
      <rect
         style="display:inline;opacity:0.1;fill:none;fill-opacity:1;stroke:#000000;stroke-width:0.99;stroke-linecap:butt;stroke-linejoin:miter;stroke-miterlimit:4;stroke-dasharray:0.99, 0.99;stroke-dashoffset:0;stroke-opacity:1;marker:none;marker-start:none;marker-mid:none;marker-end:none;paint-order:normal;enable-background:new"
         id="rect2898"
         width="111.01004"
         height="87.010048"
         x="8.4950066"
         y="200.49496"
         rx="7.9292889"
         ry="8.701005" />
      <path
         style="display:inline;fill:none;stroke:#62a0ea;stroke-width:2;stroke-linecap:butt;stroke-linejoin:miter;stroke-miterlimit:4;stroke-dasharray:none;stroke-opacity:1;enable-background:new"
         d="M 2.6203015e-5,288.99999 H 128.00003"
         id="path2900"
         inkscape:connector-curvature="0" />
      <rect
         style="display:inline;opacity:0.1;fill:none;fill-opacity:1;stroke:#000000;stroke-width:0.99;stroke-linecap:butt;stroke-linejoin:miter;stroke-miterlimit:4;stroke-dasharray:0.99, 0.99;stroke-dashoffset:0;stroke-opacity:1;marker:none;marker-start:none;marker-mid:none;marker-end:none;paint-order:normal;enable-background:new"
         id="rect2894"
         width="87.009987"
         height="111.01005"
         x="20.495007"
         y="180.49496"
         rx="8.701004"
         ry="7.9292889" />
    </g>
    <g
       id="g5716"
       transform="matrix(0.49999986,0,0,0.49999986,88.2154,88.753552)"
       style="fill:#241f31" />
    <filter
       id="a"
       height="1"
       width="1"
       x="0"
       y="0">
      <feColorMatrix
         in="SourceGraphic"
         type="matrix"
         values="0 0 0 0 1 0 0 0 0 1 0 0 0 0 1 0 0 0 1 0"
         id="feColorMatrix6431" />
    </filter>
    <mask
       id="b">
      <g
         filter="url(#a)"
         id="g6436">
        <path
           d="m 0 0 h 16 v 16 h -16 z"
           fill-opacity="0.3"
           id="path6434" />
      </g>
    </mask>
    <clipPath
       id="c">
      <path
         d="m 0 0 h 1024 v 800 h -1024 z"
         id="path6439" />
    </clipPath>
    <mask
       id="d">
      <g
         filter="url(#a)"
         id="g6444">
        <path
           d="m 0 0 h 16 v 16 h -16 z"
           fill-opacity="0.05"
           id="path6442" />
      </g>
    </mask>
    <clipPath
       id="e">
      <path
         d="m 0 0 h 1024 v 800 h -1024 z"
         id="path6447" />
    </clipPath>
    <mask
       id="f">
      <g
         filter="url(#a)"
         id="g6452">
        <path
           d="m 0 0 h 16 v 16 h -16 z"
           fill-opacity="0.05"
           id="path6450" />
      </g>
    </mask>
    <clipPath
       id="g">
      <path
         d="m 0 0 h 1024 v 800 h -1024 z"
         id="path6455" />
    </clipPath>
    <mask
       id="h">
      <g
         filter="url(#a)"
         id="g6460">
        <path
           d="m 0 0 h 16 v 16 h -16 z"
           fill-opacity="0.05"
           id="path6458" />
      </g>
    </mask>
    <clipPath
       id="i">
      <path
         d="m 0 0 h 1024 v 800 h -1024 z"
         id="path6463" />
    </clipPath>
    <mask
       id="j">
      <g
         filter="url(#a)"
         id="g6468">
        <path
           d="m 0 0 h 16 v 16 h -16 z"
           fill-opacity="0.05"
           id="path6466" />
      </g>
    </mask>
    <clipPath
       id="k">
      <path
         d="m 0 0 h 1024 v 800 h -1024 z"
         id="path6471" />
    </clipPath>
    <mask
       id="l">
      <g
         filter="url(#a)"
         id="g6476">
        <path
           d="m 0 0 h 16 v 16 h -16 z"
           fill-opacity="0.05"
           id="path6474" />
      </g>
    </mask>
    <clipPath
       id="m">
      <path
         d="m 0 0 h 1024 v 800 h -1024 z"
         id="path6479" />
    </clipPath>
    <mask
       id="n">
      <g
         filter="url(#a)"
         id="g6484">
        <path
           d="m 0 0 h 16 v 16 h -16 z"
           fill-opacity="0.05"
           id="path6482" />
      </g>
    </mask>
    <clipPath
       id="o">
      <path
         d="m 0 0 h 1024 v 800 h -1024 z"
         id="path6487" />
    </clipPath>
    <mask
       id="p">
      <g
         filter="url(#a)"
         id="g6492">
        <path
           d="m 0 0 h 16 v 16 h -16 z"
           fill-opacity="0.3"
           id="path6490" />
      </g>
    </mask>
    <clipPath
       id="q">
      <path
         d="m 0 0 h 1024 v 800 h -1024 z"
         id="path6495" />
    </clipPath>
    <mask
       id="r">
      <g
         filter="url(#a)"
         id="g6500">
        <path
           d="m 0 0 h 16 v 16 h -16 z"
           fill-opacity="0.5"
           id="path6498" />
      </g>
    </mask>
    <clipPath
       id="s">
      <path
         d="m 0 0 h 1024 v 800 h -1024 z"
         id="path6503" />
    </clipPath>
    <mask
       id="t">
      <g
         filter="url(#a)"
         id="g6508">
        <path
           d="m 0 0 h 16 v 16 h -16 z"
           fill-opacity="0.4"
           id="path6506" />
      </g>
    </mask>
    <clipPath
       id="u">
      <path
         d="m 0 0 h 1024 v 800 h -1024 z"
         id="path6511" />
    </clipPath>
    <mask
       id="v">
      <g
         filter="url(#a)"
         id="g6516">
        <path
           d="m 0 0 h 16 v 16 h -16 z"
           fill-opacity="0.4"
           id="path6514" />
      </g>
    </mask>
    <clipPath
       id="w">
      <path
         d="m 0 0 h 1024 v 800 h -1024 z"
         id="path6519" />
    </clipPath>
    <mask
       id="x">
      <g
         filter="url(#a)"
         id="g6524">
        <path
           d="m 0 0 h 16 v 16 h -16 z"
           fill-opacity="0.5"
           id="path6522" />
      </g>
    </mask>
    <clipPath
       id="y">
      <path
         d="m 0 0 h 1024 v 800 h -1024 z"
         id="path6527" />
    </clipPath>
    <mask
       id="z">
      <g
         filter="url(#a)"
         id="g6532">
        <path
           d="m 0 0 h 16 v 16 h -16 z"
           fill-opacity="0.5"
           id="path6530" />
      </g>
    </mask>
    <clipPath
       id="A">
      <path
         d="m 0 0 h 1024 v 800 h -1024 z"
         id="path6535" />
    </clipPath>
    <g
       clip-path="url(#c)"
       mask="url(#b)"
       transform="translate(-372.95013,-574.06255)"
       id="g6542">
      <path
         d="m 562.46094,212.05859 h 10.44922 c -1.1836,0.49219 -1.29688,2.46094 0,3 h -10.44922 z m 0,0"
         fill="#2e3436"
         id="path6540" />
    </g>
    <g
       clip-path="url(#e)"
       mask="url(#d)"
       transform="translate(-372.95013,-574.06255)"
       id="g6546">
      <path
         d="m 16,632 h 1 v 1 h -1 z m 0,0"
         fill="#2e3436"
         fill-rule="evenodd"
         id="path6544" />
    </g>
    <g
       clip-path="url(#g)"
       mask="url(#f)"
       transform="translate(-372.95013,-574.06255)"
       id="g6550">
      <path
         d="m 17,631 h 1 v 1 h -1 z m 0,0"
         fill="#2e3436"
         fill-rule="evenodd"
         id="path6548" />
    </g>
    <g
       clip-path="url(#i)"
       mask="url(#h)"
       transform="translate(-372.95013,-574.06255)"
       id="g6554">
      <path
         d="m 18,634 h 1 v 1 h -1 z m 0,0"
         fill="#2e3436"
         fill-rule="evenodd"
         id="path6552" />
    </g>
    <g
       clip-path="url(#k)"
       mask="url(#j)"
       transform="translate(-372.95013,-574.06255)"
       id="g6558">
      <path
         d="m 16,634 h 1 v 1 h -1 z m 0,0"
         fill="#2e3436"
         fill-rule="evenodd"
         id="path6556" />
    </g>
    <g
       clip-path="url(#m)"
       mask="url(#l)"
       transform="translate(-372.95013,-574.06255)"
       id="g6562">
      <path
         d="m 17,635 h 1 v 1 h -1 z m 0,0"
         fill="#2e3436"
         fill-rule="evenodd"
         id="path6560" />
    </g>
    <g
       clip-path="url(#o)"
       mask="url(#n)"
       transform="translate(-372.95013,-574.06255)"
       id="g6566">
      <path
         d="m 19,635 h 1 v 1 h -1 z m 0,0"
         fill="#2e3436"
         fill-rule="evenodd"
         id="path6564" />
    </g>
    <g
       clip-path="url(#q)"
       mask="url(#p)"
       transform="translate(-372.95013,-574.06255)"
       id="g6570">
      <path
         d="m 136,660 v 7 h 7 v -7 z m 0,0"
         fill="#2e3436"
         id="path6568" />
    </g>
    <g
       clip-path="url(#s)"
       mask="url(#r)"
       transform="translate(-372.95013,-574.06255)"
       id="g6574">
      <path
         d="m 199,642 h 3 v 12 h -3 z m 0,0"
         fill="#2e3436"
         id="path6572" />
    </g>
    <g
       clip-path="url(#u)"
       mask="url(#t)"
       transform="translate(-372.95013,-574.06255)"
       id="g6578">
      <path
         d="m 209.5,144.16016 c 0.27734,0 0.5,0.22265 0.5,0.5 v 1 c 0,0.27734 -0.22266,0.5 -0.5,0.5 -0.27734,0 -0.5,-0.22266 -0.5,-0.5 v -1 c 0,-0.27735 0.22266,-0.5 0.5,-0.5 z m 0,0"
         fill="#2e3436"
         id="path6576" />
    </g>
    <g
       clip-path="url(#w)"
       mask="url(#v)"
       transform="translate(-372.95013,-574.06255)"
       id="g6582">
      <path
         d="m 206.5,144.16016 c 0.27734,0 0.5,0.22265 0.5,0.5 v 1 c 0,0.27734 -0.22266,0.5 -0.5,0.5 -0.27734,0 -0.5,-0.22266 -0.5,-0.5 v -1 c 0,-0.27735 0.22266,-0.5 0.5,-0.5 z m 0,0"
         fill="#2e3436"
         id="path6580" />
    </g>
    <g
       clip-path="url(#y)"
       mask="url(#x)"
       transform="translate(-372.95013,-574.06255)"
       id="g6586">
      <path
         d="m 229.5,143.16016 c -0.54688,0 -1,0.45703 -1,1 0,0.54687 0.45312,1 1,1 0.54687,0 1,-0.45313 1,-1 0,-0.54297 -0.45313,-1 -1,-1 z m 0,0"
         fill="#2e3436"
         id="path6584" />
    </g>
    <g
       clip-path="url(#A)"
       mask="url(#z)"
       transform="translate(-372.95013,-574.06255)"
       id="g6590">
      <path
         d="m 226.45312,143.16016 c -0.51953,0 -0.95312,0.43359 -0.95312,0.95312 v 0.0937 c 0,0.51953 0.43359,0.95313 0.95312,0.95313 h 0.0937 c 0.51954,0 0.95313,-0.4336 0.95313,-0.95313 v -0.0937 c 0,-0.51953 -0.43359,-0.95312 -0.95313,-0.95312 z m 0,0"
         fill="#2e3436"
         id="path6588" />
    </g>
  </g>
</svg>
