<?xml version="1.0" encoding="UTF-8" standalone="no"?>
<!-- Created with Inkscape (http://www.inkscape.org/) -->

<svg
   xmlns:dc="http://purl.org/dc/elements/1.1/"
   xmlns:cc="http://creativecommons.org/ns#"
   xmlns:rdf="http://www.w3.org/1999/02/22-rdf-syntax-ns#"
   xmlns:svg="http://www.w3.org/2000/svg"
   xmlns="http://www.w3.org/2000/svg"
   xmlns:xlink="http://www.w3.org/1999/xlink"
   xmlns:sodipodi="http://sodipodi.sourceforge.net/DTD/sodipodi-0.dtd"
   xmlns:inkscape="http://www.inkscape.org/namespaces/inkscape"
   inkscape:export-ydpi="96"
   inkscape:export-xdpi="96"
   inkscape:export-filename="Template.png"
   width="192"
   height="152"
   id="svg11300"
   sodipodi:version="0.32"
   inkscape:version="0.92.4 (5da689c313, 2019-01-14)"
   sodipodi:docname="org.gnome.Podcast.svg"
   inkscape:output_extension="org.inkscape.output.svg.inkscape"
   version="1.0"
   style="display:inline;enable-background:new"
   viewBox="0 0 192 152">
  <title
     id="title4162">Adwaita Icon Template</title>
  <defs
     id="defs3">
    <linearGradient
       y2="236"
       x2="96"
       y1="236"
       x1="32"
       gradientTransform="translate(604.81684,170.58641)"
       gradientUnits="userSpaceOnUse"
       id="linearGradient1099"
       xlink:href="#linearGradient1036" />
    <linearGradient
       id="linearGradient1036">
      <stop
         id="stop1032"
         offset="0"
         style="stop-color:#d5d3cf;stop-opacity:1;" />
      <stop
         id="stop1034"
         offset="1"
         style="stop-color:#f6f5f4;stop-opacity:1" />
    </linearGradient>
    <radialGradient
       r="32"
       fy="-76"
       fx="-244"
       cy="-76"
       cx="-244"
       gradientTransform="matrix(0.88333331,0,0,0.88333331,-460.35018,463.11973)"
       gradientUnits="userSpaceOnUse"
       id="radialGradient1103"
       xlink:href="#linearGradient1069" />
    <linearGradient
       id="linearGradient1069">
      <stop
         id="stop1065"
         offset="0"
         style="stop-color:#d5d3cf;stop-opacity:1" />
      <stop
         id="stop1067-1"
         offset="1"
         style="stop-color:#949390;stop-opacity:1" />
    </linearGradient>
    <linearGradient
       gradientUnits="userSpaceOnUse"
       y2="232"
       x2="64"
       y1="262.5"
       x1="64"
       id="linearGradient1027"
       xlink:href="#linearGradient1025"
       gradientTransform="translate(-470.5864,432.81685)" />
    <linearGradient
       id="linearGradient1025">
      <stop
         id="stop1021"
         offset="0"
         style="stop-color:#9a9996;stop-opacity:1" />
      <stop
         id="stop1023"
         offset="1"
         style="stop-color:#77767b;stop-opacity:1" />
    </linearGradient>
    <inkscape:path-effect
       effect="spiro"
       id="path-effect35304-9"
       is_visible="true" />
    <clipPath
       clipPathUnits="userSpaceOnUse"
       id="clipPath1609-7">
      <path
         sodipodi:nodetypes="cccccc"
         inkscape:connector-curvature="0"
         id="path1611-5"
         d="m 252,116 28,-28 v -8 h -36 v 36 z"
         style="fill:#e74747;stroke:none;stroke-width:0.25px;stroke-linecap:butt;stroke-linejoin:miter;stroke-opacity:1" />
    </clipPath>
    <linearGradient
       id="linearGradient1697">
      <stop
         id="stop1685"
         offset="0"
         style="stop-color:#deddda;stop-opacity:1" />
      <stop
         style="stop-color:#eeeeec;stop-opacity:1"
         offset="0.04545455"
         id="stop1687" />
      <stop
         id="stop1689"
         offset="0.09090909"
         style="stop-color:#deddda;stop-opacity:1" />
      <stop
         style="stop-color:#deddda;stop-opacity:1"
         offset="0.90909094"
         id="stop1691" />
      <stop
         id="stop1693"
         offset="0.95454544"
         style="stop-color:#eeeeec;stop-opacity:1" />
      <stop
         id="stop1695"
         offset="1"
         style="stop-color:#c0bfbc;stop-opacity:1" />
    </linearGradient>
    <clipPath
       clipPathUnits="userSpaceOnUse"
       id="clipPath1289">
      <path
         style="display:inline;opacity:1;vector-effect:none;fill:none;fill-opacity:1;stroke:#000000;stroke-width:4;stroke-linecap:round;stroke-linejoin:round;stroke-miterlimit:4;stroke-dasharray:none;stroke-dashoffset:0;stroke-opacity:1;marker:none;marker-start:none;marker-mid:none;marker-end:none;paint-order:normal;enable-background:new"
         d="m 64,-148 h 64 l 64,-64 64,64 h 192 c 17.728,0 32,14.272 32,32 v 288 c 0,17.728 -14.272,32 -32,32 H 256 l -64,-64 -64,64 H 64 C 46.272,204 32,189.728 32,172 v -288 c 0,-17.728 14.408898,-34.19889 32,-32 z"
         id="path1291"
         inkscape:connector-curvature="0"
         sodipodi:nodetypes="scccsssscccssss" />
    </clipPath>
    <linearGradient
       id="paint3_linear-2-6-5"
       x2="1"
       gradientUnits="userSpaceOnUse"
       gradientTransform="matrix(0,6,-12,0,-64,209.99687)">
      <stop
         stop-color="#C01C27"
         id="stop91-0-7-4" />
      <stop
         offset="1"
         stop-color="#E01B24"
         id="stop93-2-5-7" />
    </linearGradient>
    <clipPath
       clipPathUnits="userSpaceOnUse"
       id="clipPath1609">
      <path
         sodipodi:nodetypes="cccccc"
         inkscape:connector-curvature="0"
         id="path1611"
         d="m 252,116 28,-28 v -8 h -36 v 36 z"
         style="fill:#e74747;stroke:none;stroke-width:0.25px;stroke-linecap:butt;stroke-linejoin:miter;stroke-opacity:1" />
    </clipPath>
    <linearGradient
       inkscape:collect="always"
       xlink:href="#linearGradient1654"
       id="linearGradient1027-5"
       gradientUnits="userSpaceOnUse"
       x1="8"
       y1="264"
       x2="120"
       y2="264"
       gradientTransform="translate(-180,11.999989)" />
    <linearGradient
       inkscape:collect="always"
       id="linearGradient1654">
      <stop
         style="stop-color:#a51d2d;stop-opacity:1"
         offset="0"
         id="stop1642" />
      <stop
         id="stop1644"
         offset="0.03432177"
         style="stop-color:#ed333b;stop-opacity:1" />
      <stop
         style="stop-color:#c01c28;stop-opacity:1"
         offset="0.07062413"
         id="stop1646" />
      <stop
         id="stop1648"
         offset="0.92767543"
         style="stop-color:#c01c28;stop-opacity:1" />
      <stop
         style="stop-color:#ed333b;stop-opacity:1"
         offset="0.96428573"
         id="stop1650" />
      <stop
         style="stop-color:#c01c28;stop-opacity:1"
         offset="1"
         id="stop1652" />
    </linearGradient>
    <clipPath
       clipPathUnits="userSpaceOnUse"
       id="clipPath904">
      <rect
         y="4"
         x="208"
         height="48"
         width="96"
         id="rect906"
         style="opacity:1;fill:#949390;fill-opacity:1;stroke:none;stroke-width:15.99999905;stroke-linecap:round;stroke-linejoin:round;stroke-miterlimit:4;stroke-dasharray:none;stroke-dashoffset:11.19999981;stroke-opacity:1" />
    </clipPath>
    <linearGradient
       gradientTransform="translate(183.7525,5.9041743)"
       inkscape:collect="always"
       xlink:href="#linearGradient1654-5"
       id="linearGradient1640-7"
       x1="8"
       y1="264"
       x2="120"
       y2="264"
       gradientUnits="userSpaceOnUse" />
    <linearGradient
       inkscape:collect="always"
       id="linearGradient1654-5">
      <stop
         style="stop-color:#c65f00;stop-opacity:1"
         offset="0"
         id="stop1642-3" />
      <stop
         id="stop1644-5"
         offset="0.03432177"
         style="stop-color:#ff7b00;stop-opacity:1" />
      <stop
         style="stop-color:#c65f00;stop-opacity:1"
         offset="0.07062413"
         id="stop1646-6" />
      <stop
         id="stop1648-2"
         offset="0.92767543"
         style="stop-color:#c65f00;stop-opacity:1" />
      <stop
         style="stop-color:#ff7b00;stop-opacity:1"
         offset="0.96428573"
         id="stop1650-9" />
      <stop
         style="stop-color:#c65f00;stop-opacity:1"
         offset="1"
         id="stop1652-1" />
    </linearGradient>
    <clipPath
       clipPathUnits="userSpaceOnUse"
       id="clipPath904-3">
      <rect
         y="4"
         x="208"
         height="48"
         width="96"
         id="rect906-6"
         style="opacity:1;fill:#949390;fill-opacity:1;stroke:none;stroke-width:15.99999905;stroke-linecap:round;stroke-linejoin:round;stroke-miterlimit:4;stroke-dasharray:none;stroke-dashoffset:11.19999981;stroke-opacity:1" />
    </clipPath>
    <clipPath
       clipPathUnits="userSpaceOnUse"
       id="clipPath1251">
      <rect
         y="4"
         x="208"
         height="48"
         width="96"
         id="rect1249"
         style="opacity:1;fill:#949390;fill-opacity:1;stroke:none;stroke-width:15.99999905;stroke-linecap:round;stroke-linejoin:round;stroke-miterlimit:4;stroke-dasharray:none;stroke-dashoffset:11.19999981;stroke-opacity:1" />
    </clipPath>
    <clipPath
       clipPathUnits="userSpaceOnUse"
       id="clipPath1255">
      <rect
         y="4"
         x="208"
         height="48"
         width="96"
         id="rect1253"
         style="opacity:1;fill:#949390;fill-opacity:1;stroke:none;stroke-width:15.99999905;stroke-linecap:round;stroke-linejoin:round;stroke-miterlimit:4;stroke-dasharray:none;stroke-dashoffset:11.19999981;stroke-opacity:1" />
    </clipPath>
    <clipPath
       clipPathUnits="userSpaceOnUse"
       id="clipPath1090">
      <rect
         ry="31.999998"
         rx="32"
         y="-115.99999"
         x="32.5"
         height="320"
         width="447"
         id="rect1092"
         style="opacity:1;fill:#fb8c14;fill-opacity:1;stroke:none;stroke-width:0.99999994;stroke-linejoin:round;stroke-miterlimit:4;stroke-dasharray:3.9999998, 1.9999999;stroke-dashoffset:0;stroke-opacity:1" />
    </clipPath>
    <clipPath
       clipPathUnits="userSpaceOnUse"
       id="clipPath1261">
      <rect
         ry="31.999998"
         rx="32"
         y="-115.99999"
         x="32.5"
         height="320"
         width="447"
         id="rect1259"
         style="opacity:1;fill:#fb8c14;fill-opacity:1;stroke:none;stroke-width:0.99999994;stroke-linejoin:round;stroke-miterlimit:4;stroke-dasharray:3.9999998, 1.9999999;stroke-dashoffset:0;stroke-opacity:1" />
    </clipPath>
    <clipPath
       clipPathUnits="userSpaceOnUse"
       id="clipPath1017">
      <rect
         ry="96.000015"
         rx="96.000015"
         y="-163.5"
         x="159.99997"
         height="367.5"
         width="192.00003"
         id="rect1020"
         style="opacity:1;fill:#f1bd10;fill-opacity:1;stroke:none;stroke-width:0.99999988;stroke-linejoin:round;stroke-miterlimit:4;stroke-dasharray:4.00000002, 2.00000002;stroke-dashoffset:0;stroke-opacity:1" />
    </clipPath>
    <linearGradient
       gradientTransform="translate(0,11.999989)"
       inkscape:collect="always"
       xlink:href="#linearGradient1654"
       id="linearGradient1640"
       x1="8"
       y1="264"
       x2="120"
       y2="264"
       gradientUnits="userSpaceOnUse" />
    <clipPath
       clipPathUnits="userSpaceOnUse"
       id="clipPath1282">
      <rect
         y="4"
         x="208"
         height="48"
         width="96"
         id="rect1280"
         style="opacity:1;fill:#949390;fill-opacity:1;stroke:none;stroke-width:15.99999905;stroke-linecap:round;stroke-linejoin:round;stroke-miterlimit:4;stroke-dasharray:none;stroke-dashoffset:11.19999981;stroke-opacity:1" />
    </clipPath>
  </defs>
  <sodipodi:namedview
     stroke="#ef2929"
     fill="#f57900"
     id="base"
     pagecolor="#ffffff"
     bordercolor="#666666"
     borderopacity="0.25490196"
     inkscape:pageopacity="0.0"
     inkscape:pageshadow="2"
     inkscape:zoom="2"
     inkscape:cx="37.017963"
     inkscape:cy="42.671001"
     inkscape:current-layer="layer9"
     showgrid="false"
     inkscape:grid-bbox="true"
     inkscape:document-units="px"
     inkscape:showpageshadow="false"
     inkscape:window-width="1920"
     inkscape:window-height="1016"
     inkscape:window-x="0"
     inkscape:window-y="27"
     width="400px"
     height="300px"
     inkscape:snap-nodes="true"
     inkscape:snap-bbox="true"
     objecttolerance="7"
     gridtolerance="12"
     guidetolerance="13"
     inkscape:window-maximized="1"
     inkscape:pagecheckerboard="false"
     showguides="false"
     inkscape:guide-bbox="true"
     inkscape:locked="false"
     inkscape:measure-start="0,0"
     inkscape:measure-end="0,0"
     inkscape:object-nodes="true"
     inkscape:bbox-nodes="true"
     inkscape:snap-global="true"
     inkscape:object-paths="true"
     inkscape:snap-intersection-paths="true"
     inkscape:snap-bbox-edge-midpoints="true"
     inkscape:snap-bbox-midpoints="true"
     showborder="true"
     inkscape:snap-center="true"
     inkscape:snap-object-midpoints="true"
     inkscape:snap-midpoints="true"
     inkscape:snap-smooth-nodes="true"
     inkscape:snap-text-baseline="true"
     borderlayer="true">
    <inkscape:grid
       type="xygrid"
       id="grid5883"
       spacingx="2"
       spacingy="2"
       enabled="true"
       visible="true"
       empspacing="4"
       originx="8"
       originy="8" />
    <sodipodi:guide
       position="72,16"
       orientation="0,1"
       id="guide1073"
       inkscape:locked="false"
       inkscape:label=""
       inkscape:color="rgb(0,0,255)" />
    <sodipodi:guide
       position="20,72"
       orientation="1,0"
       id="guide1075"
       inkscape:locked="false"
       inkscape:label=""
       inkscape:color="rgb(0,0,255)" />
    <sodipodi:guide
       position="72,112"
       orientation="0,1"
       id="guide1099"
       inkscape:locked="false"
       inkscape:label=""
       inkscape:color="rgb(0,0,255)" />
    <sodipodi:guide
       position="72,136"
       orientation="0,1"
       id="guide993"
       inkscape:locked="false"
       inkscape:label=""
       inkscape:color="rgb(0,0,255)" />
    <sodipodi:guide
       position="112,72"
       orientation="1,0"
       id="guide995"
       inkscape:locked="false"
       inkscape:label=""
       inkscape:color="rgb(0,0,255)" />
    <sodipodi:guide
       position="8.0000001,72"
       orientation="1,0"
       id="guide867"
       inkscape:locked="false"
       inkscape:label=""
       inkscape:color="rgb(0,0,255)" />
    <sodipodi:guide
       position="128,72"
       orientation="1,0"
       id="guide869"
       inkscape:locked="false"
       inkscape:label=""
       inkscape:color="rgb(0,0,255)" />
    <sodipodi:guide
       position="72,124"
       orientation="0,1"
       id="guide871"
       inkscape:locked="false"
       inkscape:label=""
       inkscape:color="rgb(0,0,255)" />
    <inkscape:grid
       type="xygrid"
       id="grid873"
       spacingx="1"
       spacingy="1"
       empspacing="8"
       color="#000000"
       opacity="0.49019608"
       empcolor="#000000"
       empopacity="0.08627451"
       dotted="true"
       originx="8"
       originy="8" />
    <sodipodi:guide
       position="32,72"
       orientation="1,0"
       id="guide877"
       inkscape:locked="false"
       inkscape:label=""
       inkscape:color="rgb(0,0,255)" />
    <sodipodi:guide
       position="124,72"
       orientation="1,0"
       id="guide879"
       inkscape:locked="false"
       inkscape:label=""
       inkscape:color="rgb(0,0,255)" />
    <sodipodi:guide
       position="72,128"
       orientation="0,1"
       id="guide881"
       inkscape:locked="false"
       inkscape:label=""
       inkscape:color="rgb(0,0,255)" />
    <sodipodi:guide
       position="72,20"
       orientation="0,1"
       id="guide883"
       inkscape:locked="false"
       inkscape:label=""
       inkscape:color="rgb(0,0,255)" />
    <sodipodi:guide
       position="16,72"
       orientation="1,0"
       id="guide885"
       inkscape:locked="false"
       inkscape:label=""
       inkscape:color="rgb(0,0,255)" />
    <sodipodi:guide
       position="136,72"
       orientation="1,0"
       id="guide887"
       inkscape:locked="false"
       inkscape:label=""
       inkscape:color="rgb(0,0,255)" />
    <sodipodi:guide
       position="72,8"
       orientation="0,1"
       id="guide897"
       inkscape:locked="false"
       inkscape:label=""
       inkscape:color="rgb(0,0,255)" />
    <sodipodi:guide
       position="72,32"
       orientation="0,1"
       id="guide899"
       inkscape:locked="false"
       inkscape:label=""
       inkscape:color="rgb(0,0,255)" />
    <sodipodi:guide
       position="264,264"
       orientation="-0.70710678,0.70710678"
       id="guide950"
       inkscape:locked="false"
       inkscape:label=""
       inkscape:color="rgb(0,0,255)" />
    <sodipodi:guide
       position="72,72"
       orientation="0.70710678,0.70710678"
       id="guide952"
       inkscape:locked="false"
       inkscape:label=""
       inkscape:color="rgb(0,0,255)" />
  </sodipodi:namedview>
  <metadata
     id="metadata4">
    <rdf:RDF>
      <cc:Work
         rdf:about="">
        <dc:format>image/svg+xml</dc:format>
        <dc:type
           rdf:resource="http://purl.org/dc/dcmitype/StillImage" />
        <dc:creator>
          <cc:Agent>
            <dc:title>GNOME Design Team</dc:title>
          </cc:Agent>
        </dc:creator>
        <dc:source />
        <cc:license
           rdf:resource="http://creativecommons.org/licenses/by-sa/4.0/" />
        <dc:title>Adwaita Icon Template</dc:title>
        <dc:subject>
          <rdf:Bag />
        </dc:subject>
        <dc:date />
        <dc:rights>
          <cc:Agent>
            <dc:title />
          </cc:Agent>
        </dc:rights>
        <dc:publisher>
          <cc:Agent>
            <dc:title />
          </cc:Agent>
        </dc:publisher>
        <dc:identifier />
        <dc:relation />
        <dc:language />
        <dc:coverage />
        <dc:description />
        <dc:contributor>
          <cc:Agent>
            <dc:title />
          </cc:Agent>
        </dc:contributor>
      </cc:Work>
      <cc:License
         rdf:about="http://creativecommons.org/licenses/by-sa/4.0/">
        <cc:permits
           rdf:resource="http://creativecommons.org/ns#Reproduction" />
        <cc:permits
           rdf:resource="http://creativecommons.org/ns#Distribution" />
        <cc:requires
           rdf:resource="http://creativecommons.org/ns#Notice" />
        <cc:requires
           rdf:resource="http://creativecommons.org/ns#Attribution" />
        <cc:permits
           rdf:resource="http://creativecommons.org/ns#DerivativeWorks" />
        <cc:requires
           rdf:resource="http://creativecommons.org/ns#ShareAlike" />
      </cc:License>
    </rdf:RDF>
  </metadata>
  <g
     id="layer1"
     inkscape:label="App Icon"
     inkscape:groupmode="layer"
     style="display:inline"
     transform="translate(8,-156)">
    <g
       inkscape:groupmode="layer"
       id="layer4"
       inkscape:label="template (do not hide)"
       style="display:inline"
       sodipodi:insensitive="true">
      <rect
         inkscape:label="0"
         y="172"
         x="9.2651362e-08"
         height="128"
         width="128"
         id="hicolor"
         style="display:inline;overflow:visible;visibility:visible;fill:#f0f0f0;fill-opacity:0;fill-rule:nonzero;stroke:none;stroke-width:0.5;marker:none;enable-background:accumulate" />
      <rect
         style="display:inline;overflow:visible;visibility:visible;fill:#f0f0f0;fill-opacity:0;fill-rule:nonzero;stroke:none;stroke-width:0.5;marker:none;enable-background:accumulate"
         id="symbolic"
         width="16"
         height="16"
         x="160"
         y="172"
         inkscape:label="0" />
    </g>
    <g
       inkscape:groupmode="layer"
       id="layer2"
       inkscape:label="baseplate"
       style="display:none">
      <g
         style="display:inline;fill:#000000;enable-background:new"
         transform="matrix(7.9911709,0,0,8.0036407,-167.7909,-4846.0776)"
         id="g12027"
         inkscape:export-xdpi="12"
         inkscape:export-ydpi="12" />
      <rect
         style="display:inline;overflow:visible;visibility:visible;fill:#f0f0f0;fill-opacity:1;fill-rule:nonzero;stroke:none;stroke-width:0.5;marker:none;enable-background:accumulate"
         id="128"
         width="128"
         height="128"
         x="9.2651362e-08"
         y="172"
         inkscape:label="0" />
      <g
         id="g883"
         style="fill:none;fill-opacity:0.25098039;stroke:#a579b3;stroke-opacity:1"
         transform="translate(-24,24)" />
      <g
         id="g900"
         style="fill:none;fill-opacity:0.25098039;stroke:#a579b3;stroke-opacity:1"
         transform="translate(-24,24)" />
      <rect
         inkscape:label=""
         y="172"
         x="160"
         height="16"
         width="16"
         id="16"
         style="display:inline;overflow:visible;visibility:visible;fill:#f0f0f0;fill-opacity:1;fill-rule:nonzero;stroke:none;stroke-width:0.5;marker:none;enable-background:accumulate" />
      <text
         xml:space="preserve"
         style="font-style:normal;font-variant:normal;font-weight:bold;font-stretch:normal;font-size:4px;line-height:125%;font-family:Cantarell;-inkscape-font-specification:'Cantarell, Bold';text-align:start;writing-mode:lr-tb;text-anchor:start;display:inline;fill:#000000;fill-opacity:1;stroke:none;stroke-width:0.33264872;enable-background:new"
         x="0"
         y="167"
         id="text863"
         inkscape:label="icon-name"><tspan
           style="font-size:4px;stroke-width:0.33264872"
           sodipodi:role="line"
           id="tspan861"
           x="0"
           y="167">Hicolor</tspan></text>
      <text
         inkscape:label="icon-name"
         id="text867"
         y="167"
         x="160"
         style="font-style:normal;font-variant:normal;font-weight:bold;font-stretch:normal;font-size:4px;line-height:125%;font-family:Cantarell;-inkscape-font-specification:'Cantarell, Bold';text-align:start;writing-mode:lr-tb;text-anchor:start;display:inline;fill:#000000;fill-opacity:1;stroke:none;stroke-width:0.33264872;enable-background:new"
         xml:space="preserve"><tspan
           y="167"
           x="160"
           id="tspan865"
           sodipodi:role="line"
           style="font-size:4px;stroke-width:0.33264872">Symbolic</tspan></text>
    </g>
    <g
       inkscape:groupmode="layer"
       id="layer9"
       inkscape:label="icons"
       style="display:inline">
      <g
         id="g1346"
         transform="translate(-7.2125906,-9.7745972)">
        <g
           transform="matrix(0.25,0,0,0.25,-952.78741,246.77459)"
           id="g914"
           style="display:inline;enable-background:new">
          <path
             inkscape:connector-curvature="0"
             style="opacity:1;fill:#828282;fill-opacity:1;stroke:none;stroke-width:0.99999994;stroke-linejoin:round;stroke-miterlimit:4;stroke-dasharray:4.00000012, 2.00000006;stroke-dashoffset:0;stroke-opacity:1"
             d="m 112,288 v 32 c 0,79.77601 64.22399,144 144,144 79.77601,0 144,-64.22399 144,-144 v -32 z"
             transform="translate(0,-212)"
             id="rect966" />
          <rect
             style="opacity:1;fill:#aaaaaa;fill-opacity:1;stroke:none;stroke-width:0.99999988;stroke-linejoin:round;stroke-miterlimit:4;stroke-dasharray:4.00000002, 2.00000002;stroke-dashoffset:0;stroke-opacity:1"
             id="rect848"
             width="192.00003"
             height="367.5"
             x="159.99997"
             y="-163.5"
             rx="96.000015"
             ry="96.000015" />
          <g
             id="g1015"
             clip-path="url(#clipPath1017)"
             style="fill:#505050">
            <g
               style="fill:#505050;stroke-width:1.12962008"
               transform="matrix(0.78367362,0,0,1,50.612224,0)"
               id="g993">
              <rect
                 ry="20.416662"
                 rx="16"
                 y="98.750008"
                 x="-52"
                 height="122.49998"
                 width="32"
                 id="rect979"
                 style="opacity:1;fill:#505050;fill-opacity:1;stroke:none;stroke-width:1.12961984;stroke-linejoin:round;stroke-miterlimit:4;stroke-dasharray:4.51848017, 2.25924009;stroke-dashoffset:0;stroke-opacity:1"
                 transform="matrix(0,1,1,0,0,0)" />
              <rect
                 transform="matrix(0,1,1,0,0,0)"
                 style="opacity:1;fill:#505050;fill-opacity:1;stroke:none;stroke-width:1.12961984;stroke-linejoin:round;stroke-miterlimit:4;stroke-dasharray:4.51848017, 2.25924009;stroke-dashoffset:0;stroke-opacity:1"
                 id="rect981"
                 width="32"
                 height="122.49998"
                 x="4.25"
                 y="98.750008"
                 rx="16"
                 ry="20.416662" />
              <rect
                 ry="20.416662"
                 rx="16"
                 y="98.750008"
                 x="60"
                 height="122.49998"
                 width="32"
                 id="rect983"
                 style="opacity:1;fill:#505050;fill-opacity:1;stroke:none;stroke-width:1.12961984;stroke-linejoin:round;stroke-miterlimit:4;stroke-dasharray:4.51848017, 2.25924009;stroke-dashoffset:0;stroke-opacity:1"
                 transform="matrix(0,1,1,0,0,0)" />
              <rect
                 transform="matrix(0,1,1,0,0,0)"
                 style="opacity:1;fill:#505050;fill-opacity:1;stroke:none;stroke-width:1.12961984;stroke-linejoin:round;stroke-miterlimit:4;stroke-dasharray:4.51848017, 2.25924009;stroke-dashoffset:0;stroke-opacity:1"
                 id="rect985"
                 width="32"
                 height="122.49998"
                 x="-108"
                 y="98.750008"
                 rx="16"
                 ry="20.416662" />
            </g>
            <g
               id="g1003"
               transform="matrix(-0.78367362,0,0,1,461.38778,0)"
               style="fill:#505050;stroke-width:1.12962008">
              <rect
                 transform="matrix(0,1,1,0,0,0)"
                 style="opacity:1;fill:#505050;fill-opacity:1;stroke:none;stroke-width:1.12961984;stroke-linejoin:round;stroke-miterlimit:4;stroke-dasharray:4.51848017, 2.25924009;stroke-dashoffset:0;stroke-opacity:1"
                 id="rect995"
                 width="32"
                 height="122.49998"
                 x="-52"
                 y="98.750008"
                 rx="16"
                 ry="20.416662" />
              <rect
                 ry="20.416662"
                 rx="16"
                 y="98.750008"
                 x="4.25"
                 height="122.49998"
                 width="32"
                 id="rect997"
                 style="opacity:1;fill:#505050;fill-opacity:1;stroke:none;stroke-width:1.12961984;stroke-linejoin:round;stroke-miterlimit:4;stroke-dasharray:4.51848017, 2.25924009;stroke-dashoffset:0;stroke-opacity:1"
                 transform="matrix(0,1,1,0,0,0)" />
              <rect
                 transform="matrix(0,1,1,0,0,0)"
                 style="opacity:1;fill:#505050;fill-opacity:1;stroke:none;stroke-width:1.12961984;stroke-linejoin:round;stroke-miterlimit:4;stroke-dasharray:4.51848017, 2.25924009;stroke-dashoffset:0;stroke-opacity:1"
                 id="rect999"
                 width="32"
                 height="122.49998"
                 x="60"
                 y="98.750008"
                 rx="16"
                 ry="20.416662" />
              <rect
                 ry="20.416662"
                 rx="16"
                 y="98.750008"
                 x="-108"
                 height="122.49998"
                 width="32"
                 id="rect1001"
                 style="opacity:1;fill:#505050;fill-opacity:1;stroke:none;stroke-width:1.12961984;stroke-linejoin:round;stroke-miterlimit:4;stroke-dasharray:4.51848017, 2.25924009;stroke-dashoffset:0;stroke-opacity:1"
                 transform="matrix(0,1,1,0,0,0)" />
            </g>
          </g>
        </g>
        <rect
           ry="7.9999995"
           rx="8"
           y="217.77458"
           x="-686.78741"
           height="80"
           width="111.75"
           id="rect927"
           style="display:inline;opacity:1;fill:#d5d3cf;fill-opacity:1;stroke:none;stroke-width:0.24999999;stroke-linejoin:round;stroke-miterlimit:4;stroke-dasharray:0.99999995, 0.49999997;stroke-dashoffset:0;stroke-opacity:1;enable-background:new" />
        <rect
           ry="4"
           rx="4"
           y="225.77458"
           x="-678.91241"
           height="56"
           width="96"
           id="rect1066"
           style="display:inline;opacity:1;fill:#ed333b;fill-opacity:1;stroke:none;stroke-width:0.24999997;stroke-linejoin:round;stroke-miterlimit:4;stroke-dasharray:0.99999998, 0.49999998;stroke-dashoffset:0;stroke-opacity:1;enable-background:new" />
        <rect
           ry="7.9875002"
           rx="7.9875002"
           y="245.77458"
           x="-658.8999"
           height="15.975"
           width="55.974998"
           id="rect1064"
           style="display:inline;opacity:1;fill:#d5d3cf;fill-opacity:1;stroke:#d5d3cf;stroke-width:8;stroke-linejoin:round;stroke-miterlimit:4;stroke-dasharray:none;stroke-dashoffset:11.19999981;stroke-opacity:1;enable-background:new" />
        <circle
           r="7.9875002"
           cy="253.76208"
           cx="-650.91241"
           id="path1060"
           style="display:inline;opacity:1;fill:#424048;fill-opacity:1;stroke:none;stroke-width:0.24999999;stroke-linejoin:round;stroke-miterlimit:4;stroke-dasharray:0.99999998, 0.49999999;stroke-dashoffset:0;stroke-opacity:1;enable-background:new" />
        <circle
           style="display:inline;opacity:1;fill:#424048;fill-opacity:1;stroke:none;stroke-width:0.24999999;stroke-linejoin:round;stroke-miterlimit:4;stroke-dasharray:0.99999998, 0.49999999;stroke-dashoffset:0;stroke-opacity:1;enable-background:new"
           id="circle1062"
           cx="-610.91241"
           cy="253.76208"
           r="7.9875002" />
        <g
           transform="matrix(0.25,0,0,0.25,-694.91241,246.77459)"
           style="display:inline;fill:#949390;fill-opacity:1;stroke:#949390;stroke-opacity:1;enable-background:new"
           clip-path="url(#clipPath1090)"
           id="g1088">
          <path
             style="fill:#949390;fill-opacity:1;stroke:#949390;stroke-width:32;stroke-linecap:round;stroke-linejoin:round;stroke-opacity:1"
             d="M 128,236 H 384 L 352,140 H 160 Z"
             id="path1083"
             inkscape:connector-curvature="0"
             sodipodi:nodetypes="ccccc" />
        </g>
        <g
           transform="matrix(0.25,0,0,0.25,-694.91241,246.77459)"
           style="display:inline;fill:#424048;fill-opacity:1;enable-background:new"
           id="g1217">
          <circle
             style="opacity:1;fill:#424048;fill-opacity:1;stroke:none;stroke-width:32;stroke-linecap:round;stroke-linejoin:round;stroke-miterlimit:4;stroke-dasharray:4.00000018, 2.00000009;stroke-dashoffset:0;stroke-opacity:1"
             id="path1205"
             cx="56.000004"
             cy="-92.000008"
             r="8" />
          <circle
             r="8"
             cy="164"
             cx="56.000004"
             id="circle1207"
             style="opacity:1;fill:#424048;fill-opacity:1;stroke:none;stroke-width:32;stroke-linecap:round;stroke-linejoin:round;stroke-miterlimit:4;stroke-dasharray:4.00000018, 2.00000009;stroke-dashoffset:0;stroke-opacity:1" />
          <circle
             r="8"
             cy="-92.000008"
             cx="456"
             id="circle1209"
             style="opacity:1;fill:#424048;fill-opacity:1;stroke:none;stroke-width:32;stroke-linecap:round;stroke-linejoin:round;stroke-miterlimit:4;stroke-dasharray:4.00000018, 2.00000009;stroke-dashoffset:0;stroke-opacity:1" />
          <circle
             style="opacity:1;fill:#424048;fill-opacity:1;stroke:none;stroke-width:32;stroke-linecap:round;stroke-linejoin:round;stroke-miterlimit:4;stroke-dasharray:4.00000018, 2.00000009;stroke-dashoffset:0;stroke-opacity:1"
             id="circle1211"
             cx="456"
             cy="164"
             r="8" />
        </g>
        <rect
           y="247.77458"
           x="-636.91241"
           height="11.975"
           width="12"
           id="rect1271"
           style="display:inline;opacity:1;fill:#949390;fill-opacity:1;stroke:none;stroke-width:3.99999976;stroke-linecap:round;stroke-linejoin:round;stroke-miterlimit:4;stroke-dasharray:none;stroke-dashoffset:11.19999981;stroke-opacity:1;enable-background:new" />
        <rect
           y="231.77458"
           x="-678.91241"
           height="4"
           width="96"
           id="rect1275"
           style="display:inline;opacity:1;fill:#ffffff;fill-opacity:1;stroke:none;stroke-width:4;stroke-linecap:round;stroke-linejoin:round;stroke-miterlimit:4;stroke-dasharray:none;stroke-dashoffset:11.19999981;stroke-opacity:1;enable-background:new" />
        <rect
           style="display:inline;opacity:1;fill:#ffffff;fill-opacity:1;stroke:none;stroke-width:4;stroke-linecap:round;stroke-linejoin:round;stroke-miterlimit:4;stroke-dasharray:none;stroke-dashoffset:11.19999981;stroke-opacity:1;enable-background:new"
           id="rect1279"
           width="96"
           height="4"
           x="-678.91241"
           y="271.7746" />
        <path
           sodipodi:nodetypes="csssscssc"
           inkscape:connector-curvature="0"
           id="rect1331"
           d="m -686.78741,285.77459 v 4 c 0,4.432 3.568,8 8,8 h 95.74999 c 4.43201,0 8,-3.568 8,-8 v -4 c 0,4.432 -3.56799,8 -8,8 h -95.74999 c -4.432,0 -8,-3.568 -8,-8 z"
           style="display:inline;opacity:1;fill:#68676b;fill-opacity:1;stroke:none;stroke-width:0.24999999;stroke-linejoin:round;stroke-miterlimit:4;stroke-dasharray:0.99999995, 0.49999997;stroke-dashoffset:0;stroke-opacity:1;enable-background:new" />
        <g
           transform="matrix(0.25,0,0,0.25,-830.28741,246.77459)"
           id="g937"
           style="display:inline;enable-background:new">
          <rect
             ry="31.999998"
             rx="32"
             y="-115.99999"
             x="32.5"
             height="320"
             width="447"
             id="rect886"
             style="opacity:1;fill:#d5d3cf;fill-opacity:1;stroke:none;stroke-width:0.99999994;stroke-linejoin:round;stroke-miterlimit:4;stroke-dasharray:3.9999998, 1.9999999;stroke-dashoffset:0;stroke-opacity:1" />
          <rect
             ry="16"
             rx="16"
             y="-84"
             x="64"
             height="224"
             width="384"
             id="rect888"
             style="opacity:1;fill:#ed333b;fill-opacity:1;stroke:none;stroke-width:0.99999988;stroke-linejoin:round;stroke-miterlimit:4;stroke-dasharray:3.9999999, 1.99999994;stroke-dashoffset:0;stroke-opacity:1" />
          <rect
             ry="24"
             rx="24"
             y="11.9"
             x="152"
             height="48"
             width="208"
             id="rect890"
             style="opacity:1;fill:#d5d3cf;fill-opacity:1;stroke:#d5d3cf;stroke-width:16;stroke-linejoin:round;stroke-miterlimit:4;stroke-dasharray:none;stroke-dashoffset:11.19999981;stroke-opacity:1" />
          <circle
             r="24"
             cy="35.900002"
             cx="176"
             id="circle892"
             style="opacity:1;fill:#424048;fill-opacity:1;stroke:none;stroke-width:1;stroke-linejoin:round;stroke-miterlimit:4;stroke-dasharray:4, 2;stroke-dashoffset:0;stroke-opacity:1" />
          <circle
             style="opacity:1;fill:#424048;fill-opacity:1;stroke:none;stroke-width:1;stroke-linejoin:round;stroke-miterlimit:4;stroke-dasharray:4, 2;stroke-dashoffset:0;stroke-opacity:1"
             id="circle894"
             cx="336"
             cy="35.900002"
             r="24" />
          <g
             style="fill:#949390;fill-opacity:1;stroke:#949390;stroke-opacity:1"
             clip-path="url(#clipPath1090)"
             id="g898">
            <path
               style="fill:#949390;fill-opacity:1;stroke:#949390;stroke-width:32;stroke-linecap:round;stroke-linejoin:round;stroke-opacity:1"
               d="M 128,236 H 384 L 352,140 H 160 Z"
               id="path896"
               inkscape:connector-curvature="0"
               sodipodi:nodetypes="ccccc" />
          </g>
          <g
             style="fill:#424048;fill-opacity:1"
             id="g908">
            <circle
               style="opacity:1;fill:#424048;fill-opacity:1;stroke:none;stroke-width:32;stroke-linecap:round;stroke-linejoin:round;stroke-miterlimit:4;stroke-dasharray:4.00000018, 2.00000009;stroke-dashoffset:0;stroke-opacity:1"
               id="circle900"
               cx="56.000004"
               cy="-92.000008"
               r="8" />
            <circle
               r="8"
               cy="164"
               cx="56.000004"
               id="circle902"
               style="opacity:1;fill:#424048;fill-opacity:1;stroke:none;stroke-width:32;stroke-linecap:round;stroke-linejoin:round;stroke-miterlimit:4;stroke-dasharray:4.00000018, 2.00000009;stroke-dashoffset:0;stroke-opacity:1" />
            <circle
               r="8"
               cy="-92.000008"
               cx="456"
               id="circle904"
               style="opacity:1;fill:#424048;fill-opacity:1;stroke:none;stroke-width:32;stroke-linecap:round;stroke-linejoin:round;stroke-miterlimit:4;stroke-dasharray:4.00000018, 2.00000009;stroke-dashoffset:0;stroke-opacity:1" />
            <circle
               style="opacity:1;fill:#424048;fill-opacity:1;stroke:none;stroke-width:32;stroke-linecap:round;stroke-linejoin:round;stroke-miterlimit:4;stroke-dasharray:4.00000018, 2.00000009;stroke-dashoffset:0;stroke-opacity:1"
               id="circle906"
               cx="456"
               cy="164"
               r="8" />
          </g>
          <rect
             y="20"
             x="232"
             height="31.900002"
             width="48"
             id="rect910"
             style="opacity:1;fill:#949390;fill-opacity:1;stroke:none;stroke-width:15.99999905;stroke-linecap:round;stroke-linejoin:round;stroke-miterlimit:4;stroke-dasharray:none;stroke-dashoffset:11.19999981;stroke-opacity:1" />
          <rect
             y="-68"
             x="64"
             height="16"
             width="384"
             id="rect912"
             style="opacity:1;fill:#ffffff;fill-opacity:1;stroke:none;stroke-width:16;stroke-linecap:round;stroke-linejoin:round;stroke-miterlimit:4;stroke-dasharray:none;stroke-dashoffset:11.19999981;stroke-opacity:1" />
          <rect
             style="opacity:1;fill:#ffffff;fill-opacity:1;stroke:none;stroke-width:16;stroke-linecap:round;stroke-linejoin:round;stroke-miterlimit:4;stroke-dasharray:none;stroke-dashoffset:11.19999981;stroke-opacity:1"
             id="rect914"
             width="384"
             height="8"
             x="64"
             y="-40" />
          <rect
             style="opacity:1;fill:#ffffff;fill-opacity:1;stroke:none;stroke-width:16;stroke-linecap:round;stroke-linejoin:round;stroke-miterlimit:4;stroke-dasharray:none;stroke-dashoffset:11.19999981;stroke-opacity:1"
             id="rect916"
             width="384"
             height="8"
             x="64"
             y="108" />
          <path
             inkscape:connector-curvature="0"
             id="path918"
             transform="translate(0,-212)"
             d="m 32.5,368 v 16 c 0,17.728 14.272,32 32,32 h 383 c 17.728,0 32,-14.272 32,-32 v -16 c 0,17.728 -14.272,32 -32,32 h -383 c -17.728,0 -32,-14.272 -32,-32 z"
             style="opacity:1;fill:#68676b;fill-opacity:1;stroke:none;stroke-width:0.99999994;stroke-linejoin:round;stroke-miterlimit:4;stroke-dasharray:3.9999998, 1.9999999;stroke-dashoffset:0;stroke-opacity:1" />
        </g>
        <g
           transform="translate(-562.78741,21.774593)"
           id="g1254"
           style="display:inline;enable-background:new">
          <rect
             style="display:inline;opacity:1;fill:#241f31;fill-opacity:1;stroke:none;stroke-width:0.24999999;stroke-linejoin:round;stroke-miterlimit:4;stroke-dasharray:0.99999995, 0.49999997;stroke-dashoffset:0;stroke-opacity:1;enable-background:new"
             id="rect1199"
             width="112"
             height="24"
             x="8"
             y="252"
             rx="8"
             ry="8" />
          <rect
             ry="8"
             rx="8"
             y="196.00002"
             x="8"
             height="75.999992"
             width="112"
             id="rect1201"
             style="display:inline;opacity:1;fill:#424048;fill-opacity:1;stroke:none;stroke-width:0.24999999;stroke-linejoin:round;stroke-miterlimit:4;stroke-dasharray:0.99999995, 0.49999997;stroke-dashoffset:0;stroke-opacity:1;enable-background:new" />
          <path
             sodipodi:nodetypes="ccccccc"
             inkscape:connector-curvature="0"
             id="path1203"
             d="M 23.999995,204 H 104 l 8,8 v 44.00001 H 15.999995 V 212 Z"
             style="display:inline;opacity:1;fill:#ffffff;fill-opacity:1;stroke:none;stroke-width:0.24999997;stroke-linejoin:round;stroke-miterlimit:4;stroke-dasharray:0.99999998, 0.49999998;stroke-dashoffset:0;stroke-opacity:1;enable-background:new" />
          <rect
             y="222"
             x="16"
             height="24"
             width="96"
             id="rect1205"
             style="display:inline;opacity:1;fill:#000000;fill-opacity:1;stroke:none;stroke-width:1;stroke-linecap:butt;stroke-linejoin:round;stroke-miterlimit:4;stroke-dasharray:none;stroke-dashoffset:0;stroke-opacity:1;enable-background:new" />
          <circle
             r="8"
             cy="234"
             cx="39.999992"
             id="circle1208"
             style="display:inline;opacity:1;fill:#424048;fill-opacity:1;stroke:none;stroke-width:0.24999999;stroke-linejoin:round;stroke-miterlimit:4;stroke-dasharray:0.99999996, 0.49999998;stroke-dashoffset:0;stroke-opacity:1;enable-background:new" />
          <circle
             style="display:inline;opacity:1;fill:#424048;fill-opacity:1;stroke:none;stroke-width:0.24999999;stroke-linejoin:round;stroke-miterlimit:4;stroke-dasharray:0.99999996, 0.49999998;stroke-dashoffset:0;stroke-opacity:1;enable-background:new"
             id="circle1210"
             cx="87.999992"
             cy="234"
             r="8" />
          <path
             sodipodi:nodetypes="ccccc"
             inkscape:connector-curvature="0"
             id="path1212"
             d="m 35.999995,270 h 56 l -4,-10 h -48 z"
             style="display:inline;fill:#68676b;fill-opacity:1;stroke:#68676b;stroke-width:8;stroke-linecap:round;stroke-linejoin:round;stroke-opacity:1;enable-background:new"
             clip-path="none" />
          <circle
             r="2"
             cy="202"
             cx="14"
             id="circle1214"
             style="display:inline;opacity:1;fill:#68676b;fill-opacity:1;stroke:none;stroke-width:8;stroke-linecap:round;stroke-linejoin:round;stroke-miterlimit:4;stroke-dasharray:1.00000004, 0.50000002;stroke-dashoffset:0;stroke-opacity:1;enable-background:new" />
          <circle
             style="display:inline;opacity:1;fill:#68676b;fill-opacity:1;stroke:none;stroke-width:8;stroke-linecap:round;stroke-linejoin:round;stroke-miterlimit:4;stroke-dasharray:1.00000004, 0.50000002;stroke-dashoffset:0;stroke-opacity:1;enable-background:new"
             id="circle1216"
             cx="14"
             cy="266"
             r="2" />
          <circle
             style="display:inline;opacity:1;fill:#68676b;fill-opacity:1;stroke:none;stroke-width:8;stroke-linecap:round;stroke-linejoin:round;stroke-miterlimit:4;stroke-dasharray:1.00000004, 0.50000002;stroke-dashoffset:0;stroke-opacity:1;enable-background:new"
             id="circle1218"
             cx="113.99999"
             cy="202"
             r="2" />
          <circle
             r="2"
             cy="266"
             cx="113.99999"
             id="circle1220"
             style="display:inline;opacity:1;fill:#68676b;fill-opacity:1;stroke:none;stroke-width:8;stroke-linecap:round;stroke-linejoin:round;stroke-miterlimit:4;stroke-dasharray:1.00000004, 0.50000002;stroke-dashoffset:0;stroke-opacity:1;enable-background:new" />
          <rect
             y="228"
             x="51.999992"
             height="12"
             width="24"
             id="rect1222"
             style="display:inline;opacity:1;fill:#949390;fill-opacity:1;stroke:none;stroke-width:3.99999976;stroke-linecap:round;stroke-linejoin:round;stroke-miterlimit:4;stroke-dasharray:none;stroke-dashoffset:11.19999981;stroke-opacity:1;enable-background:new" />
          <path
             sodipodi:nodetypes="sssss"
             inkscape:connector-curvature="0"
             id="path1224"
             d="M 272,28 C 272,89.855892 221.85589,140 160,140 98.144108,140 48,89.855892 48,28 48,-33.855892 98.144108,-84 160,-84 c 61.85589,0 112,50.144108 112,112 z"
             clip-path="url(#clipPath904)"
             style="display:inline;opacity:0.5;fill:#424048;fill-opacity:1;stroke:none;stroke-width:0.99999982;stroke-linejoin:round;stroke-miterlimit:4;stroke-dasharray:3.99999983, 1.99999994;stroke-dashoffset:0;stroke-opacity:1;enable-background:new"
             transform="matrix(0.25,0,0,0.25,-4.5e-6,227.00001)" />
          <circle
             style="display:inline;opacity:1;fill:#ffffff;fill-opacity:1;stroke:none;stroke-width:0.24999999;stroke-linejoin:round;stroke-miterlimit:4;stroke-dasharray:0.99999996, 0.49999998;stroke-dashoffset:0;stroke-opacity:1;enable-background:new"
             id="circle1226"
             cx="39.999992"
             cy="234"
             r="6" />
          <circle
             r="6"
             cy="234"
             cx="87.999992"
             id="circle1228"
             style="display:inline;opacity:1;fill:#ffffff;fill-opacity:1;stroke:none;stroke-width:0.24999999;stroke-linejoin:round;stroke-miterlimit:4;stroke-dasharray:0.99999996, 0.49999998;stroke-dashoffset:0;stroke-opacity:1;enable-background:new" />
          <rect
             y="270"
             x="32"
             height="6.0000076"
             width="64"
             id="rect1230"
             style="display:inline;opacity:1;fill:#424048;fill-opacity:1;stroke:none;stroke-width:1;stroke-linecap:butt;stroke-linejoin:round;stroke-miterlimit:4;stroke-dasharray:none;stroke-dashoffset:0;stroke-opacity:1;enable-background:new" />
          <circle
             r="2"
             cy="264"
             cx="39.999992"
             id="circle1232"
             style="display:inline;opacity:1;fill:#424048;fill-opacity:1;stroke:none;stroke-width:8;stroke-linecap:round;stroke-linejoin:round;stroke-miterlimit:4;stroke-dasharray:1.00000004, 0.50000002;stroke-dashoffset:0;stroke-opacity:1;enable-background:new" />
          <circle
             style="display:inline;opacity:1;fill:#424048;fill-opacity:1;stroke:none;stroke-width:8;stroke-linecap:round;stroke-linejoin:round;stroke-miterlimit:4;stroke-dasharray:1.00000004, 0.50000002;stroke-dashoffset:0;stroke-opacity:1;enable-background:new"
             id="circle1234"
             cx="47.999992"
             cy="262"
             r="2" />
          <circle
             transform="scale(-1,1)"
             style="display:inline;opacity:1;fill:#424048;fill-opacity:1;stroke:none;stroke-width:8;stroke-linecap:round;stroke-linejoin:round;stroke-miterlimit:4;stroke-dasharray:1.00000004, 0.50000002;stroke-dashoffset:0;stroke-opacity:1;enable-background:new"
             id="circle1236"
             cx="-87.999992"
             cy="264"
             r="2" />
          <circle
             transform="scale(-1,1)"
             r="2"
             cy="262"
             cx="-79.999992"
             id="circle1238"
             style="display:inline;opacity:1;fill:#424048;fill-opacity:1;stroke:none;stroke-width:8;stroke-linecap:round;stroke-linejoin:round;stroke-miterlimit:4;stroke-dasharray:1.00000004, 0.50000002;stroke-dashoffset:0;stroke-opacity:1;enable-background:new" />
          <path
             sodipodi:nodetypes="cccc"
             inkscape:connector-curvature="0"
             id="path1240"
             d="m 23.999995,256 v -37 c 0,-7 6,-7 6,-7 h 14"
             style="display:inline;fill:none;fill-rule:evenodd;stroke:#f66151;stroke-width:8;stroke-linecap:butt;stroke-linejoin:miter;stroke-miterlimit:4;stroke-dasharray:none;stroke-opacity:1;enable-background:new" />
          <path
             style="display:inline;fill:none;fill-rule:evenodd;stroke:#f9f06b;stroke-width:6;stroke-linecap:butt;stroke-linejoin:miter;stroke-miterlimit:4;stroke-dasharray:none;stroke-opacity:1;enable-background:new"
             d="m 24.999995,256 v -36 c 0,-7 6,-7 6,-7 h 13"
             id="path1242"
             inkscape:connector-curvature="0"
             sodipodi:nodetypes="cccc" />
          <path
             sodipodi:nodetypes="cccc"
             inkscape:connector-curvature="0"
             id="path1244"
             d="m 25.999995,256 v -35 c 0,-7 6,-7 6,-7 h 12"
             style="display:inline;fill:none;fill-rule:evenodd;stroke:#33d17a;stroke-width:4;stroke-linecap:butt;stroke-linejoin:miter;stroke-miterlimit:4;stroke-dasharray:none;stroke-opacity:1;enable-background:new" />
          <path
             style="display:inline;fill:none;fill-rule:evenodd;stroke:#3979cb;stroke-width:2;stroke-linecap:butt;stroke-linejoin:miter;stroke-miterlimit:4;stroke-dasharray:none;stroke-opacity:1;enable-background:new"
             d="m 26.999995,256 v -34 c 0,-6.75 6,-7 6,-7 h 11"
             id="path1246"
             inkscape:connector-curvature="0"
             sodipodi:nodetypes="cccc" />
          <path
             sodipodi:nodetypes="cc"
             inkscape:connector-curvature="0"
             id="path1248"
             d="M 47.999995,208.5 H 104"
             style="display:inline;fill:none;fill-rule:evenodd;stroke:#d5d3cf;stroke-width:1;stroke-linecap:butt;stroke-linejoin:miter;stroke-miterlimit:4;stroke-dasharray:none;stroke-opacity:1;enable-background:new" />
          <path
             sodipodi:nodetypes="cc"
             style="display:inline;fill:none;fill-rule:evenodd;stroke:#d5d3cf;stroke-width:1;stroke-linecap:butt;stroke-linejoin:miter;stroke-miterlimit:4;stroke-dasharray:none;stroke-opacity:1;enable-background:new"
             d="M 47.999995,212.5 H 104"
             id="path1250"
             inkscape:connector-curvature="0" />
          <path
             sodipodi:nodetypes="cc"
             inkscape:connector-curvature="0"
             id="path1252"
             d="M 47.999995,216.5 H 104"
             style="display:inline;fill:none;fill-rule:evenodd;stroke:#d5d3cf;stroke-width:1;stroke-linecap:butt;stroke-linejoin:miter;stroke-miterlimit:4;stroke-dasharray:none;stroke-opacity:1;enable-background:new" />
        </g>
        <g
           id="g1050"
           style="display:inline;enable-background:new"
           transform="translate(7.2125908,9.7746033)">
          <rect
             ry="8"
             rx="8"
             y="264"
             x="8"
             height="24"
             width="112"
             id="rect1025"
             style="display:inline;opacity:1;fill:url(#linearGradient1640);fill-opacity:1;stroke:none;stroke-width:0.24999999;stroke-linejoin:round;stroke-miterlimit:4;stroke-dasharray:0.99999995, 0.49999997;stroke-dashoffset:0;stroke-opacity:1;enable-background:new" />
          <rect
             style="display:inline;opacity:1;fill:#ed333b;fill-opacity:1;stroke:none;stroke-width:0.26282874;stroke-linejoin:round;stroke-miterlimit:4;stroke-dasharray:1.05131493, 0.52565746;stroke-dashoffset:0;stroke-opacity:1;enable-background:new"
             id="rect927-7"
             width="112"
             height="83.999992"
             x="8"
             y="200"
             rx="8"
             ry="8.8421059" />
          <path
             clip-path="none"
             style="display:inline;fill:#5e5c64;fill-opacity:1;stroke:#5e5c64;stroke-width:8;stroke-linecap:round;stroke-linejoin:round;stroke-opacity:1;enable-background:new"
             d="m 36,281.99999 h 56 l -4,-10 H 40 Z"
             id="path1083-9"
             inkscape:connector-curvature="0"
             sodipodi:nodetypes="ccccc" />
          <rect
             style="display:inline;opacity:1;fill:#424048;fill-opacity:1;stroke:none;stroke-width:1;stroke-linecap:butt;stroke-linejoin:round;stroke-miterlimit:4;stroke-dasharray:none;stroke-dashoffset:0;stroke-opacity:1;enable-background:new"
             id="rect915"
             width="64"
             height="6.0000076"
             x="32"
             y="282" />
          <path
             style="display:inline;opacity:1;fill:#f6f5f4;fill-opacity:1;stroke:none;stroke-width:0.24999997;stroke-linejoin:round;stroke-miterlimit:4;stroke-dasharray:0.99999998, 0.49999998;stroke-dashoffset:0;stroke-opacity:1;enable-background:new"
             d="m 24,207.99999 h 80 l 8,8 V 268 H 16 v -52.00001 z"
             id="path1203-6"
             inkscape:connector-curvature="0"
             sodipodi:nodetypes="ccccccc" />
          <g
             transform="translate(0,7.999989)"
             style="display:inline;enable-background:new"
             id="g1565">
            <rect
               y="216.00002"
               x="16"
               height="31.999985"
               width="96"
               id="rect1050"
               style="display:inline;opacity:1;fill:#424048;fill-opacity:1;stroke:none;stroke-width:1.06904471;stroke-linecap:butt;stroke-linejoin:round;stroke-miterlimit:4;stroke-dasharray:none;stroke-dashoffset:0;stroke-opacity:1;enable-background:new" />
            <circle
               r="6"
               cy="232"
               cx="39.999992"
               id="path1060-5"
               style="display:inline;opacity:1;fill:#f6f5f4;fill-opacity:1;stroke:none;stroke-width:0.24999999;stroke-linejoin:round;stroke-miterlimit:4;stroke-dasharray:0.99999996, 0.49999998;stroke-dashoffset:0;stroke-opacity:1;enable-background:new" />
            <circle
               style="display:inline;opacity:1;fill:#f6f5f4;fill-opacity:1;stroke:none;stroke-width:0.24999999;stroke-linejoin:round;stroke-miterlimit:4;stroke-dasharray:0.99999996, 0.49999998;stroke-dashoffset:0;stroke-opacity:1;enable-background:new"
               id="circle1062-6"
               cx="87.999992"
               cy="232"
               r="6" />
            <rect
               y="226"
               x="51.999992"
               height="12"
               width="24"
               id="rect1271-3"
               style="display:inline;opacity:1;fill:#949390;fill-opacity:1;stroke:none;stroke-width:3.99999976;stroke-linecap:round;stroke-linejoin:round;stroke-miterlimit:4;stroke-dasharray:none;stroke-dashoffset:11.19999981;stroke-opacity:1;enable-background:new" />
            <path
               sodipodi:nodetypes="sssss"
               inkscape:connector-curvature="0"
               id="ellipse900"
               d="M 272,28 C 272,89.855892 221.85589,140 160,140 98.144108,140 48,89.855892 48,28 48,-33.855892 98.144108,-84 160,-84 c 61.85589,0 112,50.144108 112,112 z"
               clip-path="url(#clipPath904)"
               style="display:inline;opacity:0.5;fill:#424048;fill-opacity:1;stroke:none;stroke-width:0.99999982;stroke-linejoin:round;stroke-miterlimit:4;stroke-dasharray:3.99999983, 1.99999994;stroke-dashoffset:0;stroke-opacity:1;enable-background:new"
               transform="matrix(0.25,0,0,0.25,-4.5e-6,225.00001)" />
          </g>
        </g>
        <rect
           ry="8"
           rx="8"
           y="273.7746"
           x="-424.78741"
           height="24"
           width="112"
           id="rect1568"
           style="display:inline;opacity:1;fill:#c65f00;fill-opacity:1;stroke:none;stroke-width:0.24999999;stroke-linejoin:round;stroke-miterlimit:4;stroke-dasharray:0.99999995, 0.49999997;stroke-dashoffset:0;stroke-opacity:1;enable-background:new" />
        <rect
           style="display:inline;opacity:1;fill:#ff9533;fill-opacity:1;stroke:none;stroke-width:0.24999999;stroke-linejoin:round;stroke-miterlimit:4;stroke-dasharray:0.99999995, 0.49999997;stroke-dashoffset:0;stroke-opacity:1;enable-background:new"
           id="rect1570"
           width="112"
           height="75.999992"
           x="-424.78741"
           y="217.7746"
           rx="8"
           ry="8" />
        <path
           clip-path="none"
           style="display:inline;fill:#949390;fill-opacity:1;stroke:#949390;stroke-width:8;stroke-linecap:round;stroke-linejoin:round;stroke-opacity:1;enable-background:new"
           d="m -396.78742,291.77459 h 56 l -4,-10 h -48 z"
           id="path1572"
           inkscape:connector-curvature="0"
           sodipodi:nodetypes="ccccc" />
        <g
           transform="translate(-432.78741,21.774593)"
           id="g1582"
           style="display:inline;enable-background:new">
          <circle
             r="2"
             cy="202"
             cx="14"
             id="circle1574"
             style="display:inline;opacity:1;fill:#424048;fill-opacity:1;stroke:none;stroke-width:8;stroke-linecap:round;stroke-linejoin:round;stroke-miterlimit:4;stroke-dasharray:1.00000004, 0.50000002;stroke-dashoffset:0;stroke-opacity:1;enable-background:new" />
          <circle
             style="display:inline;opacity:1;fill:#424048;fill-opacity:1;stroke:none;stroke-width:8;stroke-linecap:round;stroke-linejoin:round;stroke-miterlimit:4;stroke-dasharray:1.00000004, 0.50000002;stroke-dashoffset:0;stroke-opacity:1;enable-background:new"
             id="circle1576"
             cx="14"
             cy="266"
             r="2" />
          <circle
             style="display:inline;opacity:1;fill:#424048;fill-opacity:1;stroke:none;stroke-width:8;stroke-linecap:round;stroke-linejoin:round;stroke-miterlimit:4;stroke-dasharray:1.00000004, 0.50000002;stroke-dashoffset:0;stroke-opacity:1;enable-background:new"
             id="circle1578"
             cx="113.99999"
             cy="202"
             r="2" />
          <circle
             r="2"
             cy="266"
             cx="113.99999"
             id="circle1580"
             style="display:inline;opacity:1;fill:#424048;fill-opacity:1;stroke:none;stroke-width:8;stroke-linecap:round;stroke-linejoin:round;stroke-miterlimit:4;stroke-dasharray:1.00000004, 0.50000002;stroke-dashoffset:0;stroke-opacity:1;enable-background:new" />
        </g>
        <rect
           style="display:inline;opacity:1;fill:#6b696c;fill-opacity:1;stroke:none;stroke-width:1;stroke-linecap:butt;stroke-linejoin:round;stroke-miterlimit:4;stroke-dasharray:none;stroke-dashoffset:0;stroke-opacity:1;enable-background:new"
           id="rect1584"
           width="64"
           height="6.0000076"
           x="-400.78741"
           y="291.7746" />
        <path
           style="display:inline;opacity:1;fill:#f6f5f4;fill-opacity:1;stroke:none;stroke-width:0.24999997;stroke-linejoin:round;stroke-miterlimit:4;stroke-dasharray:0.99999998, 0.49999998;stroke-dashoffset:0;stroke-opacity:1;enable-background:new"
           d="m -408.78741,225.77459 h 80 l 8,8 v 44.00001 h -96 v -44.00001 z"
           id="path1586"
           inkscape:connector-curvature="0"
           sodipodi:nodetypes="ccccccc" />
        <g
           transform="translate(-432.78741,21.774593)"
           id="g1598"
           style="display:inline;enable-background:new">
          <rect
             y="218"
             x="16"
             height="28"
             width="96"
             id="rect1588"
             style="display:inline;opacity:1;fill:#424048;fill-opacity:1;stroke:none;stroke-width:1;stroke-linecap:butt;stroke-linejoin:round;stroke-miterlimit:4;stroke-dasharray:none;stroke-dashoffset:0;stroke-opacity:1;enable-background:new" />
          <circle
             r="6"
             cy="232"
             cx="39.999992"
             id="circle1590"
             style="display:inline;opacity:1;fill:#f6f5f4;fill-opacity:1;stroke:none;stroke-width:0.24999999;stroke-linejoin:round;stroke-miterlimit:4;stroke-dasharray:0.99999996, 0.49999998;stroke-dashoffset:0;stroke-opacity:1;enable-background:new" />
          <circle
             style="display:inline;opacity:1;fill:#f6f5f4;fill-opacity:1;stroke:none;stroke-width:0.24999999;stroke-linejoin:round;stroke-miterlimit:4;stroke-dasharray:0.99999996, 0.49999998;stroke-dashoffset:0;stroke-opacity:1;enable-background:new"
             id="circle1592"
             cx="87.999992"
             cy="232"
             r="6" />
          <rect
             y="226"
             x="51.999992"
             height="12"
             width="24"
             id="rect1594"
             style="display:inline;opacity:1;fill:#949390;fill-opacity:1;stroke:none;stroke-width:3.99999976;stroke-linecap:round;stroke-linejoin:round;stroke-miterlimit:4;stroke-dasharray:none;stroke-dashoffset:11.19999981;stroke-opacity:1;enable-background:new" />
          <path
             sodipodi:nodetypes="sssss"
             inkscape:connector-curvature="0"
             id="path1596"
             d="M 272,28 C 272,89.855892 221.85589,140 160,140 98.144108,140 48,89.855892 48,28 48,-33.855892 98.144108,-84 160,-84 c 61.85589,0 112,50.144108 112,112 z"
             clip-path="url(#clipPath904)"
             style="display:inline;opacity:0.5;fill:#424048;fill-opacity:1;stroke:none;stroke-width:0.99999982;stroke-linejoin:round;stroke-miterlimit:4;stroke-dasharray:3.99999983, 1.99999994;stroke-dashoffset:0;stroke-opacity:1;enable-background:new"
             transform="matrix(0.25,0,0,0.25,-4.5e-6,225.00001)" />
        </g>
        <g
           transform="translate(-486.53991,15.870403)"
           id="g1058"
           style="display:inline;enable-background:new">
          <rect
             ry="8"
             rx="8"
             y="257.90417"
             x="191.7525"
             height="24"
             width="112"
             id="rect1025-2"
             style="display:inline;opacity:1;fill:url(#linearGradient1640-7);fill-opacity:1;stroke:none;stroke-width:0.24999999;stroke-linejoin:round;stroke-miterlimit:4;stroke-dasharray:0.99999995, 0.49999997;stroke-dashoffset:0;stroke-opacity:1;enable-background:new" />
          <rect
             style="display:inline;opacity:1;fill:#ff9533;fill-opacity:1;stroke:none;stroke-width:0.24999999;stroke-linejoin:round;stroke-miterlimit:4;stroke-dasharray:0.99999995, 0.49999997;stroke-dashoffset:0;stroke-opacity:1;enable-background:new"
             id="rect927-7-7"
             width="112"
             height="75.999992"
             x="191.7525"
             y="201.90419"
             rx="8"
             ry="8" />
          <path
             clip-path="none"
             style="display:inline;fill:#949390;fill-opacity:1;stroke:#949390;stroke-width:8;stroke-linecap:round;stroke-linejoin:round;stroke-opacity:1;enable-background:new"
             d="m 219.75249,275.90417 h 56 l -4,-10 h -48 z"
             id="path1083-9-0"
             inkscape:connector-curvature="0"
             sodipodi:nodetypes="ccccc" />
          <rect
             style="display:inline;opacity:1;fill:#6b696c;fill-opacity:1;stroke:none;stroke-width:1;stroke-linecap:butt;stroke-linejoin:round;stroke-miterlimit:4;stroke-dasharray:none;stroke-dashoffset:0;stroke-opacity:1;enable-background:new"
             id="rect915-9"
             width="64"
             height="6.0000076"
             x="215.7525"
             y="275.90417" />
          <path
             style="display:inline;opacity:1;fill:#f6f5f4;fill-opacity:1;stroke:none;stroke-width:0.24999997;stroke-linejoin:round;stroke-miterlimit:4;stroke-dasharray:0.99999998, 0.49999998;stroke-dashoffset:0;stroke-opacity:1;enable-background:new"
             d="m 207.7525,209.90417 h 80 l 8,8 v 44.00002 h -96 v -44.00002 z"
             id="path1203-6-3"
             inkscape:connector-curvature="0"
             sodipodi:nodetypes="ccccccc" />
          <g
             transform="translate(183.7525,5.9041743)"
             style="display:inline;enable-background:new"
             id="g1565-6">
            <rect
               y="218"
               x="16"
               height="28"
               width="96"
               id="rect1050-0"
               style="display:inline;opacity:1;fill:#424048;fill-opacity:1;stroke:none;stroke-width:1;stroke-linecap:butt;stroke-linejoin:round;stroke-miterlimit:4;stroke-dasharray:none;stroke-dashoffset:0;stroke-opacity:1;enable-background:new" />
            <circle
               r="6"
               cy="232"
               cx="39.999992"
               id="path1060-5-6"
               style="display:inline;opacity:1;fill:#f6f5f4;fill-opacity:1;stroke:none;stroke-width:0.24999999;stroke-linejoin:round;stroke-miterlimit:4;stroke-dasharray:0.99999996, 0.49999998;stroke-dashoffset:0;stroke-opacity:1;enable-background:new" />
            <circle
               style="display:inline;opacity:1;fill:#f6f5f4;fill-opacity:1;stroke:none;stroke-width:0.24999999;stroke-linejoin:round;stroke-miterlimit:4;stroke-dasharray:0.99999996, 0.49999998;stroke-dashoffset:0;stroke-opacity:1;enable-background:new"
               id="circle1062-6-2"
               cx="87.999992"
               cy="232"
               r="6" />
            <rect
               y="226"
               x="51.999992"
               height="12"
               width="24"
               id="rect1271-3-6"
               style="display:inline;opacity:1;fill:#949390;fill-opacity:1;stroke:none;stroke-width:3.99999976;stroke-linecap:round;stroke-linejoin:round;stroke-miterlimit:4;stroke-dasharray:none;stroke-dashoffset:11.19999981;stroke-opacity:1;enable-background:new" />
            <path
               sodipodi:nodetypes="sssss"
               inkscape:connector-curvature="0"
               id="ellipse900-1"
               d="M 272,28 C 272,89.855892 221.85589,140 160,140 98.144108,140 48,89.855892 48,28 48,-33.855892 98.144108,-84 160,-84 c 61.85589,0 112,50.144108 112,112 z"
               clip-path="url(#clipPath904-3)"
               style="display:inline;opacity:0.5;fill:#424048;fill-opacity:1;stroke:none;stroke-width:0.99999982;stroke-linejoin:round;stroke-miterlimit:4;stroke-dasharray:3.99999983, 1.99999994;stroke-dashoffset:0;stroke-opacity:1;enable-background:new"
               transform="matrix(0.25,0,0,0.25,-4.5e-6,225.00001)" />
          </g>
        </g>
        <g
           id="g1037"
           style="display:inline;enable-background:new"
           transform="translate(7.2125908,9.7746033)">
          <rect
             style="display:inline;opacity:1;fill:url(#linearGradient1027-5);fill-opacity:1;stroke:none;stroke-width:0.24999999;stroke-linejoin:round;stroke-miterlimit:4;stroke-dasharray:0.99999995, 0.49999997;stroke-dashoffset:0;stroke-opacity:1;enable-background:new"
             id="rect1005"
             width="112"
             height="24"
             x="-172"
             y="264"
             rx="8"
             ry="8" />
          <rect
             ry="8"
             rx="8"
             y="208"
             x="-172"
             height="75.999992"
             width="112"
             id="rect1007"
             style="display:inline;opacity:1;fill:#ed333b;fill-opacity:1;stroke:none;stroke-width:0.24999999;stroke-linejoin:round;stroke-miterlimit:4;stroke-dasharray:0.99999995, 0.49999997;stroke-dashoffset:0;stroke-opacity:1;enable-background:new" />
          <path
             sodipodi:nodetypes="ccccc"
             inkscape:connector-curvature="0"
             id="path1009"
             d="m -144.00001,281.99999 h 56 l -4,-10 h -48 z"
             style="display:inline;fill:#5e5c64;fill-opacity:1;stroke:#5e5c64;stroke-width:8;stroke-linecap:round;stroke-linejoin:round;stroke-opacity:1;enable-background:new"
             clip-path="none" />
          <rect
             y="282"
             x="-148"
             height="6.0000076"
             width="64"
             id="rect1011"
             style="display:inline;opacity:1;fill:#424048;fill-opacity:1;stroke:none;stroke-width:1;stroke-linecap:butt;stroke-linejoin:round;stroke-miterlimit:4;stroke-dasharray:none;stroke-dashoffset:0;stroke-opacity:1;enable-background:new" />
          <path
             sodipodi:nodetypes="ccccccc"
             inkscape:connector-curvature="0"
             id="path1013"
             d="m -156,215.99999 h 80 l 8,8 V 268 h -96 v -44.00001 z"
             style="display:inline;opacity:1;fill:#f6f5f4;fill-opacity:1;stroke:none;stroke-width:0.24999997;stroke-linejoin:round;stroke-miterlimit:4;stroke-dasharray:0.99999998, 0.49999998;stroke-dashoffset:0;stroke-opacity:1;enable-background:new" />
          <g
             style="display:inline;enable-background:new"
             id="g1025"
             transform="translate(-180,11.999989)">
            <rect
               style="display:inline;opacity:1;fill:#424048;fill-opacity:1;stroke:none;stroke-width:1;stroke-linecap:butt;stroke-linejoin:round;stroke-miterlimit:4;stroke-dasharray:none;stroke-dashoffset:0;stroke-opacity:1;enable-background:new"
               id="rect1015"
               width="96"
               height="28"
               x="16"
               y="218" />
            <circle
               style="display:inline;opacity:1;fill:#f6f5f4;fill-opacity:1;stroke:none;stroke-width:0.24999999;stroke-linejoin:round;stroke-miterlimit:4;stroke-dasharray:0.99999996, 0.49999998;stroke-dashoffset:0;stroke-opacity:1;enable-background:new"
               id="circle1017"
               cx="39.999992"
               cy="232"
               r="6" />
            <circle
               r="6"
               cy="232"
               cx="87.999992"
               id="circle1019"
               style="display:inline;opacity:1;fill:#f6f5f4;fill-opacity:1;stroke:none;stroke-width:0.24999999;stroke-linejoin:round;stroke-miterlimit:4;stroke-dasharray:0.99999996, 0.49999998;stroke-dashoffset:0;stroke-opacity:1;enable-background:new" />
            <rect
               style="display:inline;opacity:1;fill:#949390;fill-opacity:1;stroke:none;stroke-width:3.99999976;stroke-linecap:round;stroke-linejoin:round;stroke-miterlimit:4;stroke-dasharray:none;stroke-dashoffset:11.19999981;stroke-opacity:1;enable-background:new"
               id="rect1021"
               width="24"
               height="12"
               x="51.999992"
               y="226" />
            <path
               transform="matrix(0.25,0,0,0.25,-4.5e-6,225.00001)"
               style="display:inline;opacity:0.5;fill:#424048;fill-opacity:1;stroke:none;stroke-width:0.99999982;stroke-linejoin:round;stroke-miterlimit:4;stroke-dasharray:3.99999983, 1.99999994;stroke-dashoffset:0;stroke-opacity:1;enable-background:new"
               clip-path="url(#clipPath904)"
               d="M 272,28 C 272,89.855892 221.85589,140 160,140 98.144108,140 48,89.855892 48,28 48,-33.855892 98.144108,-84 160,-84 c 61.85589,0 112,50.144108 112,112 z"
               id="path1023"
               inkscape:connector-curvature="0"
               sodipodi:nodetypes="sssss" />
          </g>
        </g>
      </g>
      <g
         style="display:inline;enable-background:new"
         id="g876"
         inkscape:label="org.gnome.Podcasts"
         transform="translate(148,-596)">
        <rect
           y="768"
           x="12"
           height="16"
           width="16"
           id="rect2025"
           style="display:inline;opacity:1;vector-effect:none;fill:#000000;fill-opacity:0;stroke:none;stroke-width:2;stroke-linecap:butt;stroke-linejoin:round;stroke-miterlimit:4;stroke-dasharray:none;stroke-dashoffset:0;stroke-opacity:0.43700789" />
        <path
           style="display:inline;opacity:1;vector-effect:none;fill:#241f31;fill-opacity:1;stroke:none;stroke-width:2.61861467;stroke-linecap:butt;stroke-linejoin:round;stroke-miterlimit:4;stroke-dasharray:none;stroke-dashoffset:0;stroke-opacity:0.43700789"
           d="m 13,131 c -0.554,0 -1,0.446 -1,1 v 9 c 0,0.554 0.446,1 1,1 h 14 c 0.554,0 1,-0.446 1,-1 v -9 c 0,-0.554 -0.446,-1 -1,-1 z m 0,3 h 14 v 4 H 13 Z m 4,5 h 6 l 1,2 h -8 z"
           transform="translate(0,640)"
           id="rect2029"
           inkscape:connector-curvature="0" />
        <circle
           r="1"
           cy="776"
           cx="16"
           id="circle2033"
           style="display:inline;opacity:1;vector-effect:none;fill:#241f31;fill-opacity:1;stroke:none;stroke-width:2;stroke-linecap:butt;stroke-linejoin:round;stroke-miterlimit:4;stroke-dasharray:none;stroke-dashoffset:0;stroke-opacity:0.43700789" />
        <circle
           style="display:inline;opacity:1;vector-effect:none;fill:#241f31;fill-opacity:1;stroke:none;stroke-width:2;stroke-linecap:butt;stroke-linejoin:round;stroke-miterlimit:4;stroke-dasharray:none;stroke-dashoffset:0;stroke-opacity:0.43700789"
           id="circle2035"
           cx="24"
           cy="776"
           r="1" />
        <rect
           y="775"
           x="18"
           height="2"
           width="4.0000339"
           id="rect2037"
           style="display:inline;opacity:1;vector-effect:none;fill:#241f31;fill-opacity:1;stroke:none;stroke-width:2;stroke-linecap:butt;stroke-linejoin:round;stroke-miterlimit:4;stroke-dasharray:none;stroke-dashoffset:0;stroke-opacity:0.43700789" />
      </g>
    </g>
    <g
       inkscape:groupmode="layer"
       id="layer3"
       inkscape:label="grid"
       style="display:none"
       sodipodi:insensitive="true">
      <circle
         cx="64.000031"
         cy="236"
         r="59.504131"
         id="circle2892"
         style="display:inline;opacity:0.1;vector-effect:none;fill:none;fill-opacity:1;stroke:#000000;stroke-width:0.99000001;stroke-linecap:butt;stroke-linejoin:miter;stroke-miterlimit:4;stroke-dasharray:0.99000001, 0.99000001;stroke-dashoffset:0;stroke-opacity:1;marker:none;marker-start:none;marker-mid:none;marker-end:none;paint-order:normal;enable-background:new" />
      <rect
         ry="7.9292889"
         rx="8.701004"
         y="180.49496"
         x="20.495007"
         height="111.01005"
         width="87.009987"
         id="rect2894"
         style="display:inline;opacity:0.1;vector-effect:none;fill:none;fill-opacity:1;stroke:#000000;stroke-width:0.99000001;stroke-linecap:butt;stroke-linejoin:miter;stroke-miterlimit:4;stroke-dasharray:0.99000001, 0.99000001;stroke-dashoffset:0;stroke-opacity:1;marker:none;marker-start:none;marker-mid:none;marker-end:none;paint-order:normal;enable-background:new" />
      <rect
         ry="7.9238095"
         rx="7.9238095"
         y="184.49524"
         x="12.495266"
         height="103.00952"
         width="103.00952"
         id="rect2896"
         style="display:inline;opacity:0.1;vector-effect:none;fill:none;fill-opacity:1;stroke:#000000;stroke-width:0.99000001;stroke-linecap:butt;stroke-linejoin:miter;stroke-miterlimit:4;stroke-dasharray:0.99000001, 0.99000001;stroke-dashoffset:0;stroke-opacity:1;marker:none;marker-start:none;marker-mid:none;marker-end:none;paint-order:normal;enable-background:new" />
      <rect
         ry="8.701005"
         rx="7.9292889"
         y="200.49496"
         x="8.4950066"
         height="87.010048"
         width="111.01004"
         id="rect2898"
         style="display:inline;opacity:0.1;vector-effect:none;fill:none;fill-opacity:1;stroke:#000000;stroke-width:0.99000001;stroke-linecap:butt;stroke-linejoin:miter;stroke-miterlimit:4;stroke-dasharray:0.99000001, 0.99000001;stroke-dashoffset:0;stroke-opacity:1;marker:none;marker-start:none;marker-mid:none;marker-end:none;paint-order:normal;enable-background:new" />
      <path
         inkscape:connector-curvature="0"
         id="path2900"
         d="M 2.6203015e-5,288.99999 H 128.00003"
         style="display:inline;fill:none;stroke:#62a0ea;stroke-width:2;stroke-linecap:butt;stroke-linejoin:miter;stroke-miterlimit:4;stroke-dasharray:none;stroke-opacity:1;enable-background:new" />
    </g>
  </g>
</svg>
