<?xml version="1.0" encoding="UTF-8" standalone="no"?>
<svg
   xmlns:dc="http://purl.org/dc/elements/1.1/"
   xmlns:cc="http://creativecommons.org/ns#"
   xmlns:rdf="http://www.w3.org/1999/02/22-rdf-syntax-ns#"
   xmlns:svg="http://www.w3.org/2000/svg"
   xmlns="http://www.w3.org/2000/svg"
   xmlns:xlink="http://www.w3.org/1999/xlink"
   xmlns:sodipodi="http://sodipodi.sourceforge.net/DTD/sodipodi-0.dtd"
   xmlns:inkscape="http://www.inkscape.org/namespaces/inkscape"
   viewBox="0 0 192 152"
   style="display:inline;enable-background:new"
   version="1.0"
   inkscape:output_extension="org.inkscape.output.svg.inkscape"
   sodipodi:docname="org.gnome.Fonts.svg"
   inkscape:version="1.0beta1 (fe3e306978, 2019-09-17)"
   sodipodi:version="0.32"
   id="svg11300"
   height="152"
   width="192"
   inkscape:export-filename="Template.png"
   inkscape:export-xdpi="96"
   inkscape:export-ydpi="96">
  <title
     id="title4162">Adwaita Icon Template</title>
  <defs
     id="defs3">
    <clipPath
       clipPathUnits="userSpaceOnUse"
       id="clipPath2023">
      <path
         sodipodi:nodetypes="cccccc"
         inkscape:connector-curvature="0"
         id="path2025"
         d="M 276.18114,-123.2044 398.56793,-0.49937496 395.60046,294.0023 86.199765,294.90241 87.999995,-124 Z"
         style="fill:#e74747;stroke:none;stroke-width:1px;stroke-linecap:butt;stroke-linejoin:miter;stroke-opacity:1" />
    </clipPath>
    <clipPath
       clipPathUnits="userSpaceOnUse"
       id="clipPath17445">
      <path
         inkscape:connector-curvature="0"
         id="path17447"
         d="m 672,-180.05567 c -17.728,0 -32,14.272 -32,32 v 384.11133 c 0,17.728 14.272,32 32,32 h 256 c 17.728,0 32,-14.272 32,-32 V -67.92481 L 848.1582,-180.05567 Z"
         clip-path="none"
         style="display:inline;opacity:1;fill:#26a269;fill-opacity:1;stroke:none;stroke-width:2;stroke-linejoin:round;stroke-miterlimit:4;stroke-dasharray:none;stroke-opacity:1;enable-background:new" />
    </clipPath>
    <clipPath
       clipPathUnits="userSpaceOnUse"
       id="clipPath18689">
      <rect
         clip-path="none"
         transform="rotate(45)"
         ry="32.000008"
         rx="32.000008"
         y="123.9986"
         x="486.03726"
         height="362.94299"
         width="362.94299"
         id="rect18691"
         style="display:inline;opacity:1;vector-effect:none;fill:#4a86cf;fill-opacity:1;stroke:none;stroke-width:26.0669;stroke-linecap:butt;stroke-linejoin:miter;stroke-miterlimit:4;stroke-dasharray:none;stroke-dashoffset:0;stroke-opacity:1;marker:none;marker-start:none;marker-mid:none;marker-end:none;paint-order:normal;enable-background:new" />
    </clipPath>
    <clipPath
       clipPathUnits="userSpaceOnUse"
       id="clipPath17445-6">
      <path
         inkscape:connector-curvature="0"
         id="path17447-9"
         d="m 672,-180.05567 c -17.728,0 -32,14.272 -32,32 v 384.11133 c 0,17.728 14.272,32 32,32 h 256 c 17.728,0 32,-14.272 32,-32 V -67.92481 L 848.1582,-180.05567 Z"
         clip-path="none"
         style="display:inline;opacity:1;fill:#26a269;fill-opacity:1;stroke:none;stroke-width:2;stroke-linejoin:round;stroke-miterlimit:4;stroke-dasharray:none;stroke-opacity:1;enable-background:new" />
    </clipPath>
    <clipPath
       clipPathUnits="userSpaceOnUse"
       id="clipPath1366">
      <path
         inkscape:connector-curvature="0"
         style="fill:#9b6fe2;stroke:none;stroke-width:1px;stroke-linecap:butt;stroke-linejoin:miter;stroke-opacity:1"
         d="m 64.000002,-116 c -17.728,0 -32,14.272 -32,32 v 256 c 0,17.728 14.272,32 32,32 H 384 l 96,-95.99805 V -84 c 0,-17.728 -14.272,-32 -32,-32 z"
         id="path1368" />
    </clipPath>
    <clipPath
       clipPathUnits="userSpaceOnUse"
       id="clipPath17445-6-2">
      <path
         inkscape:connector-curvature="0"
         id="path17447-9-7"
         d="m 672,-180.05567 c -17.728,0 -32,14.272 -32,32 v 384.11133 c 0,17.728 14.272,32 32,32 h 256 c 17.728,0 32,-14.272 32,-32 V -67.92481 L 848.1582,-180.05567 Z"
         clip-path="none"
         style="display:inline;opacity:1;fill:#26a269;fill-opacity:1;stroke:none;stroke-width:2;stroke-linejoin:round;stroke-miterlimit:4;stroke-dasharray:none;stroke-opacity:1;enable-background:new" />
    </clipPath>
    <clipPath
       clipPathUnits="userSpaceOnUse"
       id="clipPath17445-6-2-9">
      <path
         inkscape:connector-curvature="0"
         id="path17447-9-7-0"
         d="m 672,-180.05567 c -17.728,0 -32,14.272 -32,32 v 384.11133 c 0,17.728 14.272,32 32,32 h 256 c 17.728,0 32,-14.272 32,-32 V -67.92481 L 848.1582,-180.05567 Z"
         clip-path="none"
         style="display:inline;opacity:1;fill:#26a269;fill-opacity:1;stroke:none;stroke-width:2;stroke-linejoin:round;stroke-miterlimit:4;stroke-dasharray:none;stroke-opacity:1;enable-background:new" />
    </clipPath>
    <clipPath
       clipPathUnits="userSpaceOnUse"
       id="clipPath18689-3">
      <rect
         clip-path="none"
         transform="rotate(45)"
         ry="32.000008"
         rx="32.000008"
         y="123.9986"
         x="486.03726"
         height="362.94299"
         width="362.94299"
         id="rect18691-6"
         style="display:inline;opacity:1;vector-effect:none;fill:#4a86cf;fill-opacity:1;stroke:none;stroke-width:26.0669;stroke-linecap:butt;stroke-linejoin:miter;stroke-miterlimit:4;stroke-dasharray:none;stroke-dashoffset:0;stroke-opacity:1;marker:none;marker-start:none;marker-mid:none;marker-end:none;paint-order:normal;enable-background:new" />
    </clipPath>
    <clipPath
       clipPathUnits="userSpaceOnUse"
       id="clipPath2023-6">
      <path
         sodipodi:nodetypes="cccccc"
         inkscape:connector-curvature="0"
         id="path2025-0"
         d="M 276.18114,-123.2044 398.56793,-0.49937496 395.60046,294.0023 86.199765,294.90241 87.999995,-124 Z"
         style="fill:#e74747;stroke:none;stroke-width:1px;stroke-linecap:butt;stroke-linejoin:miter;stroke-opacity:1" />
    </clipPath>
    <clipPath
       clipPathUnits="userSpaceOnUse"
       id="clipPath2250">
      <path
         sodipodi:nodetypes="cccccc"
         inkscape:connector-curvature="0"
         id="path2248"
         d="M 276.18114,-123.2044 398.56793,-0.49937496 395.60046,294.0023 86.199765,294.90241 87.999995,-124 Z"
         style="fill:#e74747;stroke:none;stroke-width:1px;stroke-linecap:butt;stroke-linejoin:miter;stroke-opacity:1" />
    </clipPath>
    <linearGradient
       id="linearGradient1351-3"
       inkscape:collect="always">
      <stop
         id="stop1347"
         offset="0"
         style="stop-color:#949390;stop-opacity:1" />
      <stop
         id="stop1349-6"
         offset="1"
         style="stop-color:#d5d3cf;stop-opacity:1" />
    </linearGradient>
    <clipPath
       id="clipPath2019-7"
       clipPathUnits="userSpaceOnUse">
      <path
         sodipodi:nodetypes="cccccc"
         inkscape:connector-curvature="0"
         id="path2021-5"
         d="M 280,124 400,4 392,-276 H 87.999995 v 400 z"
         style="fill:#e74747;stroke:none;stroke-width:1px;stroke-linecap:butt;stroke-linejoin:miter;stroke-opacity:1" />
    </clipPath>
    <inkscape:path-effect
       is_visible="true"
       id="path-effect14728-5"
       effect="spiro" />
    <clipPath
       id="clipPath1599"
       clipPathUnits="userSpaceOnUse">
      <path
         inkscape:connector-curvature="0"
         id="path1601"
         d="M 492.30769,-59.384613 393.84615,-197.23077 H 147.6923 v 482.46154 h 344.61539 z"
         style="fill:#1c71d8;stroke:none;stroke-width:1px;stroke-linecap:butt;stroke-linejoin:miter;stroke-opacity:1" />
    </clipPath>
    <radialGradient
       r="64"
       fy="227.13257"
       fx="399.44189"
       cy="227.13257"
       cx="399.44189"
       gradientTransform="matrix(2.7262815,-2.7262815,0.05524271,0.05524271,-765.39564,1144.2653)"
       gradientUnits="userSpaceOnUse"
       id="radialGradient2449"
       xlink:href="#linearGradient1351-3"
       inkscape:collect="always" />
    <linearGradient
       gradientTransform="matrix(0.25,0,0,0.25,-180,225)"
       gradientUnits="userSpaceOnUse"
       y2="120"
       x2="416"
       y1="120"
       x1="384"
       id="linearGradient1053-6"
       xlink:href="#linearGradient1871"
       inkscape:collect="always" />
    <linearGradient
       inkscape:collect="always"
       id="linearGradient1871">
      <stop
         style="stop-color:#e9e6e3;stop-opacity:1"
         offset="0"
         id="stop1865" />
      <stop
         id="stop1867"
         offset="0.5"
         style="stop-color:#f6f5f4;stop-opacity:1" />
      <stop
         style="stop-color:#c2bfba;stop-opacity:1"
         offset="1"
         id="stop1869" />
    </linearGradient>
    <linearGradient
       gradientUnits="userSpaceOnUse"
       y2="444.5"
       x2="64.000008"
       y1="202.38483"
       x1="64.000008"
       id="linearGradient990"
       xlink:href="#linearGradient988"
       inkscape:collect="always" />
    <linearGradient
       id="linearGradient988"
       inkscape:collect="always">
      <stop
         id="stop984"
         offset="0"
         style="stop-color:#a347ba;stop-opacity:1;" />
      <stop
         id="stop986"
         offset="1"
         style="stop-color:#c061cb;stop-opacity:1" />
    </linearGradient>
    <linearGradient
       gradientTransform="matrix(0.25,0,0,0.25,12.000001,221)"
       gradientUnits="userSpaceOnUse"
       y2="120"
       x2="416"
       y1="120"
       x1="384"
       id="linearGradient1053"
       xlink:href="#linearGradient1879"
       inkscape:collect="always" />
    <linearGradient
       inkscape:collect="always"
       id="linearGradient1879">
      <stop
         style="stop-color:#e8e7e4;stop-opacity:1"
         offset="0"
         id="stop1873" />
      <stop
         id="stop1875"
         offset="0.51104856"
         style="stop-color:#ffffff;stop-opacity:1" />
      <stop
         style="stop-color:#c2bfba;stop-opacity:1"
         offset="1"
         id="stop1877" />
    </linearGradient>
  </defs>
  <sodipodi:namedview
     inkscape:document-rotation="0"
     inkscape:snap-smooth-nodes="true"
     inkscape:snap-midpoints="true"
     inkscape:snap-object-midpoints="true"
     inkscape:snap-center="true"
     showborder="false"
     inkscape:snap-bbox-midpoints="true"
     inkscape:snap-bbox-edge-midpoints="true"
     inkscape:snap-intersection-paths="true"
     inkscape:object-paths="true"
     inkscape:snap-global="true"
     inkscape:bbox-nodes="true"
     inkscape:object-nodes="true"
     inkscape:measure-end="0,0"
     inkscape:measure-start="0,0"
     inkscape:locked="false"
     inkscape:guide-bbox="true"
     showguides="false"
     inkscape:pagecheckerboard="false"
     inkscape:window-maximized="1"
     guidetolerance="13"
     gridtolerance="12"
     objecttolerance="7"
     inkscape:snap-bbox="false"
     inkscape:snap-nodes="true"
     height="300px"
     width="400px"
     inkscape:window-y="0"
     inkscape:window-x="3440"
     inkscape:window-height="1403"
     inkscape:window-width="2560"
     inkscape:showpageshadow="false"
     inkscape:document-units="px"
     inkscape:grid-bbox="true"
     showgrid="false"
     inkscape:current-layer="layer9"
     inkscape:cy="16.954764"
     inkscape:cx="160.04752"
     inkscape:zoom="1"
     inkscape:pageshadow="2"
     inkscape:pageopacity="0.0"
     borderopacity="0.25490196"
     bordercolor="#666666"
     pagecolor="#ffffff"
     id="base"
     fill="#f57900"
     stroke="#ef2929">
    <inkscape:grid
       originy="0"
       originx="0"
       empspacing="4"
       visible="true"
       enabled="true"
       spacingy="2"
       spacingx="2"
       id="grid5883"
       type="xygrid" />
    <sodipodi:guide
       inkscape:color="rgb(0,0,255)"
       inkscape:label=""
       inkscape:locked="false"
       id="guide1073"
       orientation="0,1"
       position="64,8" />
    <sodipodi:guide
       inkscape:color="rgb(0,0,255)"
       inkscape:label=""
       inkscape:locked="false"
       id="guide1075"
       orientation="1,0"
       position="12,39" />
    <sodipodi:guide
       inkscape:color="rgb(0,0,255)"
       inkscape:label=""
       inkscape:locked="false"
       id="guide1099"
       orientation="0,1"
       position="72,104" />
    <sodipodi:guide
       inkscape:color="rgb(0,0,255)"
       inkscape:label=""
       inkscape:locked="false"
       id="guide993"
       orientation="0,1"
       position="64,128" />
    <sodipodi:guide
       inkscape:color="rgb(0,0,255)"
       inkscape:label=""
       inkscape:locked="false"
       id="guide995"
       orientation="1,0"
       position="104,64" />
    <sodipodi:guide
       inkscape:color="rgb(0,0,255)"
       inkscape:label=""
       inkscape:locked="false"
       id="guide867"
       orientation="1,0"
       position="0,72" />
    <sodipodi:guide
       inkscape:color="rgb(0,0,255)"
       inkscape:label=""
       inkscape:locked="false"
       id="guide869"
       orientation="1,0"
       position="120,58" />
    <sodipodi:guide
       inkscape:color="rgb(0,0,255)"
       inkscape:label=""
       inkscape:locked="false"
       id="guide871"
       orientation="0,1"
       position="84.25,116" />
    <inkscape:grid
       dotted="true"
       empopacity="0.08627451"
       empcolor="#000000"
       opacity="0.49019608"
       color="#000000"
       empspacing="8"
       spacingy="1"
       spacingx="1"
       id="grid873"
       type="xygrid" />
    <sodipodi:guide
       inkscape:color="rgb(0,0,255)"
       inkscape:label=""
       inkscape:locked="false"
       id="guide877"
       orientation="1,0"
       position="24,37" />
    <sodipodi:guide
       inkscape:color="rgb(0,0,255)"
       inkscape:label=""
       inkscape:locked="false"
       id="guide879"
       orientation="1,0"
       position="116,58" />
    <sodipodi:guide
       inkscape:color="rgb(0,0,255)"
       inkscape:label=""
       inkscape:locked="false"
       id="guide881"
       orientation="0,1"
       position="64,120" />
    <sodipodi:guide
       inkscape:color="rgb(0,0,255)"
       inkscape:label=""
       inkscape:locked="false"
       id="guide883"
       orientation="0,1"
       position="59.75,12" />
    <sodipodi:guide
       inkscape:color="rgb(0,0,255)"
       inkscape:label=""
       inkscape:locked="false"
       id="guide885"
       orientation="1,0"
       position="8,39" />
    <sodipodi:guide
       inkscape:color="rgb(0,0,255)"
       inkscape:label=""
       inkscape:locked="false"
       id="guide887"
       orientation="1,0"
       position="128,56" />
    <sodipodi:guide
       inkscape:color="rgb(0,0,255)"
       inkscape:label=""
       inkscape:locked="false"
       id="guide897"
       orientation="0,1"
       position="64,0" />
    <sodipodi:guide
       inkscape:color="rgb(0,0,255)"
       inkscape:label=""
       inkscape:locked="false"
       id="guide899"
       orientation="0,1"
       position="56,24" />
    <sodipodi:guide
       inkscape:color="rgb(0,0,255)"
       inkscape:label=""
       inkscape:locked="false"
       id="guide950"
       orientation="-0.70710678,0.70710678"
       position="256,256" />
    <sodipodi:guide
       inkscape:color="rgb(0,0,255)"
       inkscape:label=""
       inkscape:locked="false"
       id="guide952"
       orientation="0.70710678,0.70710678"
       position="64,64" />
  </sodipodi:namedview>
  <metadata
     id="metadata4">
    <rdf:RDF>
      <cc:Work
         rdf:about="">
        <dc:format>image/svg+xml</dc:format>
        <dc:type
           rdf:resource="http://purl.org/dc/dcmitype/StillImage" />
        <dc:creator>
          <cc:Agent>
            <dc:title>GNOME Design Team</dc:title>
          </cc:Agent>
        </dc:creator>
        <dc:source />
        <cc:license
           rdf:resource="http://creativecommons.org/licenses/by-sa/4.0/" />
        <dc:title>Adwaita Icon Template</dc:title>
        <dc:subject>
          <rdf:Bag />
        </dc:subject>
        <dc:date />
        <dc:rights>
          <cc:Agent>
            <dc:title />
          </cc:Agent>
        </dc:rights>
        <dc:publisher>
          <cc:Agent>
            <dc:title />
          </cc:Agent>
        </dc:publisher>
        <dc:identifier />
        <dc:relation />
        <dc:language />
        <dc:coverage />
        <dc:description />
        <dc:contributor>
          <cc:Agent>
            <dc:title />
          </cc:Agent>
        </dc:contributor>
      </cc:Work>
      <cc:License
         rdf:about="http://creativecommons.org/licenses/by-sa/4.0/">
        <cc:permits
           rdf:resource="http://creativecommons.org/ns#Reproduction" />
        <cc:permits
           rdf:resource="http://creativecommons.org/ns#Distribution" />
        <cc:requires
           rdf:resource="http://creativecommons.org/ns#Notice" />
        <cc:requires
           rdf:resource="http://creativecommons.org/ns#Attribution" />
        <cc:permits
           rdf:resource="http://creativecommons.org/ns#DerivativeWorks" />
        <cc:requires
           rdf:resource="http://creativecommons.org/ns#ShareAlike" />
      </cc:License>
    </rdf:RDF>
  </metadata>
  <g
     transform="translate(0,-172)"
     style="display:inline"
     inkscape:groupmode="layer"
     inkscape:label="Icon"
     id="layer1">
    <g
       sodipodi:insensitive="true"
       style="display:none"
       inkscape:label="baseplate"
       id="layer2"
       inkscape:groupmode="layer">
      <g
         inkscape:export-ydpi="12"
         inkscape:export-xdpi="12"
         id="g12027"
         transform="matrix(7.9911709,0,0,8.0036407,-167.7909,-4846.0776)"
         style="display:inline;fill:#000000;enable-background:new" />
      <rect
         inkscape:label="512x512"
         y="172"
         x="9.2651362e-08"
         height="128"
         width="128"
         id="rect13805"
         style="display:inline;overflow:visible;visibility:visible;fill:#f0f0f0;fill-opacity:1;fill-rule:nonzero;stroke:none;stroke-width:0.5;marker:none;enable-background:accumulate" />
      <g
         transform="translate(-24,24)"
         style="fill:none;fill-opacity:0.25098;stroke:#a579b3;stroke-opacity:1"
         id="g883" />
      <g
         transform="translate(-24,24)"
         style="fill:none;fill-opacity:0.25098;stroke:#a579b3;stroke-opacity:1"
         id="g900" />
      <g
         transform="matrix(0.25,0,0,0.25,6.9488522e-8,225)"
         id="g1168">
        <rect
           style="opacity:0.1;fill:#2864b0;fill-opacity:1;stroke:none;stroke-width:1;stroke-linecap:butt;stroke-linejoin:miter;stroke-miterlimit:4;stroke-dasharray:none;stroke-dashoffset:0;stroke-opacity:1;marker:none;marker-start:none;marker-mid:none;marker-end:none;paint-order:normal"
           id="rect1110"
           width="319.99979"
           height="448"
           x="96"
           y="-180"
           rx="32"
           ry="32" />
        <rect
           style="display:inline;opacity:0.1;fill:#2864b0;fill-opacity:1;stroke:none;stroke-width:1;stroke-linecap:butt;stroke-linejoin:miter;stroke-miterlimit:4;stroke-dasharray:none;stroke-dashoffset:0;stroke-opacity:1;marker:none;marker-start:none;marker-mid:none;marker-end:none;paint-order:normal;enable-background:new"
           id="rect1110-8"
           width="416"
           height="416"
           x="48"
           y="-164"
           rx="32"
           ry="32" />
        <rect
           style="display:inline;opacity:0.1;fill:#2864b0;fill-opacity:1;stroke:none;stroke-width:1;stroke-linecap:butt;stroke-linejoin:miter;stroke-miterlimit:4;stroke-dasharray:none;stroke-dashoffset:0;stroke-opacity:1;marker:none;marker-start:none;marker-mid:none;marker-end:none;paint-order:normal;enable-background:new"
           id="rect1110-8-9"
           width="448"
           height="320"
           x="32"
           y="-116"
           rx="32"
           ry="32" />
        <circle
           style="opacity:0.1;fill:#2864b0;fill-opacity:1;stroke:none;stroke-width:1;stroke-linecap:butt;stroke-linejoin:miter;stroke-miterlimit:4;stroke-dasharray:none;stroke-dashoffset:0;stroke-opacity:1;marker:none;marker-start:none;marker-mid:none;marker-end:none;paint-order:normal"
           id="path1142"
           r="240"
           cy="44"
           cx="256" />
      </g>
      <rect
         inkscape:label="0"
         y="172"
         x="160"
         height="16"
         width="16"
         id="symbasdasdolic-6"
         style="display:inline;overflow:visible;visibility:visible;fill:#f0f0f0;fill-opacity:1;fill-rule:nonzero;stroke:none;stroke-width:0.5;marker:none;enable-background:accumulate" />
    </g>
    <g
       sodipodi:insensitive="true"
       inkscape:label="template"
       id="layer3"
       inkscape:groupmode="layer">
      <rect
         inkscape:label="0"
         y="172"
         x="0"
         height="128"
         width="128"
         id="hicolor"
         style="display:inline;overflow:visible;visibility:visible;fill:#f0f0f0;fill-opacity:0;fill-rule:nonzero;stroke:none;stroke-width:0.5;marker:none;enable-background:accumulate" />
      <rect
         style="display:inline;overflow:visible;visibility:visible;fill:#f0f0f0;fill-opacity:0;fill-rule:nonzero;stroke:none;stroke-width:0.5;marker:none;enable-background:accumulate"
         id="symbolic"
         width="16"
         height="16"
         x="160"
         y="172"
         inkscape:label="0" />
    </g>
    <g
       style="display:inline"
       inkscape:label="icons"
       id="layer9"
       inkscape:groupmode="layer">
      <g
         transform="translate(-365.99999)"
         id="g2447">
        <g
           clip-path="url(#clipPath1599)"
           id="g2419"
           style="display:inline;stroke-width:0.910166;enable-background:new"
           transform="matrix(0.325,0,0,-0.23214286,-40,246.21429)">
          <rect
             clip-path="none"
             ry="34.46154"
             rx="24.615383"
             y="-180"
             x="160"
             height="448"
             width="320"
             id="rect2417"
             style="display:inline;opacity:1;fill:#f6f5f4;fill-opacity:1;stroke:none;stroke-width:1.82033;stroke-linejoin:round;stroke-miterlimit:4;stroke-dasharray:none;stroke-opacity:1;enable-background:new" />
        </g>
        <rect
           style="display:inline;opacity:1;fill:url(#radialGradient2449);fill-opacity:1;stroke:none;stroke-width:2;stroke-linecap:butt;stroke-linejoin:miter;stroke-miterlimit:4;stroke-dasharray:none;stroke-dashoffset:0;stroke-opacity:1;marker:none;marker-start:none;marker-mid:none;marker-end:none;paint-order:normal;enable-background:new"
           id="rect2421"
           width="128"
           height="128"
           x="288"
           y="20"
           rx="32"
           ry="32"
           transform="matrix(0.25,0,0,0.25,19.999999,259)"
           clip-path="url(#clipPath2019-7)" />
        <g
           id="g2435"
           transform="translate(-248.48054,-28.33096)"
           style="display:inline;enable-background:new">
          <rect
             transform="rotate(-90)"
             style="opacity:1;vector-effect:none;fill:#2864b0;fill-opacity:1;stroke:none;stroke-width:6.51673;stroke-linecap:butt;stroke-linejoin:miter;stroke-miterlimit:4;stroke-dasharray:none;stroke-dashoffset:0;stroke-opacity:1;marker:none;marker-start:none;marker-mid:none;marker-end:none;paint-order:normal"
             id="rect2423"
             width="1.9999999"
             height="59.999996"
             x="-286.33096"
             y="282.48053" />
          <g
             id="g2427"
             style="font-style:normal;font-variant:normal;font-weight:bold;font-stretch:normal;font-size:322.102px;line-height:1.25;font-family:Montserrat;-inkscape-font-specification:'Montserrat, Bold';font-variant-ligatures:normal;font-variant-caps:normal;font-variant-numeric:normal;font-feature-settings:normal;text-align:start;letter-spacing:0px;word-spacing:0px;writing-mode:lr-tb;text-anchor:start;fill:#4a86cf;fill-opacity:1;stroke:none;stroke-width:1"
             aria-label="a"
             transform="matrix(0.24999999,0,0,0.24999999,109.90589,-88.77101)">
            <path
               id="path2425"
               style="fill:#4a8ccf;stroke-width:1"
               d="m 806.87264,1316.4695 c -27.70079,0 -55.72369,7.4083 -74.72772,20.9366 l 18.03773,35.1092 c 12.56198,-9.9852 31.56602,-16.1051 49.92584,-16.1051 27.05659,0 42.19199,14.4169 42.19199,35.9977 l -42.19199,-0.2354 c -52.82394,-0.2947 -74.40561,19.9474 -74.40561,50.5472 0,29.9555 24.15767,52.5026 64.74255,52.5026 25.44607,0 42.51073,-8.3746 51.85169,-24.1576 l 0.003,21.3432 h 48 l -0.003,-97.3365 c -0.002,-52.5026 -30.59971,-78.6019 -83.42448,-78.6019 z m -3.86523,144.9321 c -17.71562,0 -28.34499,-8.3747 -28.34499,-20.9367 0,-11.5956 7.40835,-20.2924 30.92181,-20.2924 l 36.71625,0.2354 v 17.7156 c -5.79784,15.783 -22.54375,23.2781 -39.29307,23.2781 z"
               inkscape:connector-curvature="0"
               sodipodi:nodetypes="sccscssscccsssssccs" />
          </g>
          <rect
             y="236.33096"
             x="288.48099"
             height="55.999996"
             width="1.9999999"
             id="rect2429"
             style="opacity:1;vector-effect:none;fill:#2864b0;fill-opacity:1;stroke:none;stroke-width:6.51673;stroke-linecap:butt;stroke-linejoin:miter;stroke-miterlimit:4;stroke-dasharray:none;stroke-dashoffset:0;stroke-opacity:1;marker:none;marker-start:none;marker-mid:none;marker-end:none;paint-order:normal" />
          <path
             sodipodi:nodetypes="cccc"
             inkscape:connector-curvature="0"
             id="path2431"
             d="m 285.48108,236.33092 3.99992,-3.99997 3.99998,4 z"
             style="opacity:1;vector-effect:none;fill:#2864b0;fill-opacity:1;stroke:none;stroke-width:6.51673;stroke-linecap:butt;stroke-linejoin:miter;stroke-miterlimit:4;stroke-dasharray:none;stroke-dashoffset:0;stroke-opacity:1;marker:none;marker-start:none;marker-mid:none;marker-end:none;paint-order:normal" />
          <path
             style="opacity:1;vector-effect:none;fill:#2864b0;fill-opacity:1;stroke:none;stroke-width:6.51673;stroke-linecap:butt;stroke-linejoin:miter;stroke-miterlimit:4;stroke-dasharray:none;stroke-dashoffset:0;stroke-opacity:1;marker:none;marker-start:none;marker-mid:none;marker-end:none;paint-order:normal"
             d="m 285.48108,292.33097 3.99992,3.99997 3.99998,-4 z"
             id="path2433"
             inkscape:connector-curvature="0"
             sodipodi:nodetypes="cccc" />
        </g>
      </g>
      <path
         sodipodi:nodetypes="cccsscc"
         inkscape:connector-curvature="0"
         id="rect954-3-8"
         d="m -156,200 v 92 h 72 c 4.432,0 8,-3.568 8,-8 v -76 c 0,-4.432 -3.568,-8 -8,-8 z"
         style="display:inline;opacity:1;fill:#613583;fill-opacity:1;stroke:none;stroke-width:6;stroke-linecap:butt;stroke-linejoin:miter;stroke-miterlimit:4;stroke-dasharray:none;stroke-dashoffset:0;stroke-opacity:1;marker:none;marker-start:none;marker-mid:none;marker-end:none;paint-order:normal;enable-background:new" />
      <path
         sodipodi:nodetypes="cccsscc"
         inkscape:connector-curvature="0"
         id="rect954-3-6-7"
         d="m -154,220 v 70 h 70 c 4.432,0 8,-3.568 8,-8 v -54 c 0,-4.432 -3.568,-8 -8,-8 z"
         style="display:inline;opacity:1;fill:url(#linearGradient1053-6);fill-opacity:1;stroke:none;stroke-width:6;stroke-linecap:butt;stroke-linejoin:miter;stroke-miterlimit:4;stroke-dasharray:none;stroke-dashoffset:0;stroke-opacity:1;marker:none;marker-start:none;marker-mid:none;marker-end:none;paint-order:normal;enable-background:new" />
      <path
         sodipodi:nodetypes="cccsscc"
         inkscape:connector-curvature="0"
         id="rect954-3-2-92"
         d="m -156,202 v 64 h 72 c 4.432,0 8,-3.568 8,-8 v -48 c 0,-4.432 -3.568,-8 -8,-8 z"
         style="display:inline;opacity:1;fill:#5e3f7f;fill-opacity:1;stroke:none;stroke-width:6;stroke-linecap:butt;stroke-linejoin:miter;stroke-miterlimit:4;stroke-dasharray:none;stroke-dashoffset:0;stroke-opacity:1;marker:none;marker-start:none;marker-mid:none;marker-end:none;paint-order:normal;enable-background:new" />
      <path
         sodipodi:nodetypes="cccsscc"
         inkscape:connector-curvature="0"
         id="rect954-3-2-9-02"
         d="m -156,180 v 84 h 72 c 4.432,0 8,-3.568 8,-8 v -68 c 0,-4.432 -3.568,-8 -8,-8 z"
         style="display:inline;opacity:1;fill:#a347ba;fill-opacity:1;stroke:none;stroke-width:6;stroke-linecap:round;stroke-linejoin:miter;stroke-miterlimit:4;stroke-dasharray:none;stroke-dashoffset:0;stroke-opacity:1;marker:none;marker-start:none;marker-mid:none;marker-end:none;paint-order:normal;enable-background:new" />
      <path
         sodipodi:nodetypes="ccccc"
         inkscape:connector-curvature="0"
         id="rect901-7"
         d="m -156,190.0625 h 80 v 63.875 h -80 z"
         style="display:inline;opacity:1;fill:#c061cb;fill-opacity:1;stroke:none;stroke-width:0.5;stroke-linejoin:round;stroke-miterlimit:4;stroke-dasharray:none;stroke-opacity:1;enable-background:new" />
      <path
         style="opacity:0.3;fill:none;fill-opacity:1;stroke:#c097c5;stroke-width:2;stroke-linecap:butt;stroke-linejoin:miter;stroke-miterlimit:4;stroke-dasharray:none;stroke-dashoffset:0;stroke-opacity:1;marker:none;marker-start:none;marker-mid:none;marker-end:none;paint-order:normal"
         d="m -153,180 v 84 z"
         id="rect1366"
         inkscape:connector-curvature="0"
         sodipodi:nodetypes="ccc" />
      <path
         inkscape:connector-curvature="0"
         d="m -141,285 h 22 m -6,-4 h 36 m -46,-4 h 24 m -30,-4 h 36"
         style="display:inline;opacity:0.1;fill:#000000;stroke:#000000;stroke-width:2;stroke-linecap:round;stroke-linejoin:miter;stroke-miterlimit:4;stroke-dasharray:none;stroke-opacity:1;enable-background:new"
         id="path913-3"
         sodipodi:nodetypes="cccccccc" />
      <path
         sodipodi:nodetypes="ccccccccccccccccccc"
         inkscape:connector-curvature="0"
         id="rect2381"
         d="m -137,194 -5,6 h 4 v 38 h -4 v 2 h 4 v 5 h -4 l 5,6 5,-6 h -4 v -5 h 42 v -2 h -42 v -38 h 4 z"
         style="opacity:1;vector-effect:none;fill:#813d9c;fill-opacity:1;stroke:none;stroke-width:3.25837;stroke-linecap:butt;stroke-linejoin:miter;stroke-miterlimit:4;stroke-dasharray:none;stroke-dashoffset:0;stroke-opacity:1;marker:none;marker-start:none;marker-mid:none;marker-end:none;paint-order:normal" />
      <g
         transform="matrix(0.1875,0,0,0.1875,-268.93071,-41.824631)"
         aria-label="a"
         style="font-style:normal;font-variant:normal;font-weight:bold;font-stretch:normal;font-size:322.102px;line-height:1.25;font-family:Montserrat;-inkscape-font-specification:'Montserrat, Bold';font-variant-ligatures:normal;font-variant-caps:normal;font-variant-numeric:normal;font-feature-settings:normal;text-align:start;letter-spacing:0px;word-spacing:0px;writing-mode:lr-tb;text-anchor:start;fill:#ffffff;fill-opacity:1;stroke:none;stroke-width:1"
         id="g2385">
        <path
           sodipodi:nodetypes="sccscssscccssscsccscc"
           inkscape:connector-curvature="0"
           d="m 812.20261,1309.7929 c -27.70079,0 -55.72369,7.4083 -74.72772,20.9366 l 18.03773,35.1092 c 12.56198,-9.9852 31.56602,-16.1051 49.92584,-16.1051 27.05659,0 42.19199,14.4169 42.19199,35.9977 l -50.00981,-0.2354 c -52.82417,-0.2486 -74.40225,26.624 -74.40225,57.2238 0,29.9555 22.04572,51.6578 62.6306,51.6578 25.44607,0 52.4405,-7.5298 61.78146,-23.3128 l 0.003,21.3432 53.33034,-0.01 -0.006,-104.013 c -0.003,-52.5026 -35.93005,-78.5921 -88.75482,-78.5921 z m -11.67969,151.6087 c -17.71562,0 -28.34499,-8.3747 -28.34499,-20.9367 0,-11.5956 7.40547,-23.1197 30.91845,-22.9689 l 44.53407,0.2354 0.003,16.1495 c 0.003,16.8142 -30.36157,27.5207 -47.11089,27.5207 z"
           style="fill:#ffffff;stroke-width:1"
           id="path2383" />
      </g>
      <path
         sodipodi:nodetypes="cccsscc"
         inkscape:connector-curvature="0"
         id="rect970"
         d="m 12,204 v 84 h 96 c 4.432,0 8,-3.568 8,-8 v -68 c 0,-4.432 -3.568,-8 -8,-8 z"
         style="display:inline;opacity:1;fill:#813d9c;fill-opacity:1;stroke:none;stroke-width:0.376845;stroke-linejoin:round;stroke-miterlimit:4;stroke-dasharray:none;stroke-opacity:1;enable-background:new" />
      <path
         style="display:inline;opacity:1;fill:url(#linearGradient1053);fill-opacity:1;stroke:none;stroke-width:6;stroke-linecap:butt;stroke-linejoin:miter;stroke-miterlimit:4;stroke-dasharray:none;stroke-dashoffset:0;stroke-opacity:1;marker:none;marker-start:none;marker-mid:none;marker-end:none;paint-order:normal;enable-background:new"
         d="m 14.000001,216 v 70 H 108 c 4.432,0 8,-3.568 8,-8 v -54 c 0,-4.432 -3.568,-8 -8,-8 z"
         id="rect954-3-6"
         inkscape:connector-curvature="0"
         sodipodi:nodetypes="cccsscc" />
      <path
         sodipodi:nodetypes="cccsscc"
         inkscape:connector-curvature="0"
         id="rect970-5-3"
         d="m 12,186 v 94 h 96 c 4.432,0 8,-3.568 8,-8 v -78 c 0,-4.432 -3.568,-8 -8,-8 z"
         style="display:inline;opacity:1;fill:#813d9c;fill-opacity:1;stroke:none;stroke-width:0.376845;stroke-linejoin:round;stroke-miterlimit:4;stroke-dasharray:none;stroke-opacity:1;enable-background:new" />
      <path
         sodipodi:nodetypes="cccsscc"
         inkscape:connector-curvature="0"
         id="rect970-5"
         d="m 12,184 v 94 h 96 c 4.432,0 8,-3.568 8,-8 v -78 c 0,-4.432 -3.568,-8 -8,-8 z"
         style="display:inline;opacity:1;fill:url(#linearGradient990);fill-opacity:1;stroke:none;stroke-width:0.376845;stroke-linejoin:round;stroke-miterlimit:4;stroke-dasharray:none;stroke-opacity:1;enable-background:new" />
      <g
         id="g1055"
         style="font-style:normal;font-variant:normal;font-weight:bold;font-stretch:normal;font-size:322.102px;line-height:1.25;font-family:Montserrat;-inkscape-font-specification:'Montserrat, Bold';font-variant-ligatures:normal;font-variant-caps:normal;font-variant-numeric:normal;font-feature-settings:normal;text-align:start;letter-spacing:0px;word-spacing:0px;writing-mode:lr-tb;text-anchor:start;fill:#813d9c;fill-opacity:1;stroke:none;stroke-width:1"
         aria-label="a"
         transform="matrix(0.140625,0,0,0.140625,-29.23291,10.300445)" />
      <g
         transform="matrix(0.140625,0,0,0.140625,-29.23291,12.300445)"
         aria-label="a"
         style="font-style:normal;font-variant:normal;font-weight:bold;font-stretch:normal;font-size:322.102px;line-height:1.25;font-family:Montserrat;-inkscape-font-specification:'Montserrat, Bold';font-variant-ligatures:normal;font-variant-caps:normal;font-variant-numeric:normal;font-feature-settings:normal;text-align:start;letter-spacing:0px;word-spacing:0px;writing-mode:lr-tb;text-anchor:start;fill:#813d9c;fill-opacity:1;stroke:none;stroke-width:1"
         id="g1059">
        <path
           sodipodi:nodetypes="sccscssscccssscsccscc"
           inkscape:connector-curvature="0"
           d="m 812.20261,1309.7929 c -27.70079,0 -55.72369,7.4083 -74.72772,20.9366 l 18.03773,35.1092 c 12.56198,-9.9852 31.56602,-16.1051 49.92584,-16.1051 27.05659,0 42.19199,14.4169 42.19199,35.9977 l -50.00981,-0.2354 c -52.82417,-0.2486 -74.40225,26.624 -74.40225,57.2238 0,29.9555 22.04572,51.6578 62.6306,51.6578 25.44607,0 52.4405,-7.5298 61.78146,-23.3128 l 0.003,21.3432 53.33034,-0.01 -0.006,-104.013 c -0.003,-52.5026 -35.93005,-78.5921 -88.75482,-78.5921 z m -11.67969,151.6087 c -17.71562,0 -28.34499,-8.3747 -28.34499,-20.9367 0,-11.5956 7.40547,-23.1197 30.91845,-22.9689 l 44.53407,0.2354 0.003,16.1495 c 0.003,16.8142 -30.36157,27.5207 -47.11089,27.5207 z"
           style="fill:#813d9c;stroke-width:1"
           id="path1057" />
      </g>
      <g
         aria-label="a"
         style="font-style:normal;font-weight:normal;font-size:40px;line-height:1000%;font-family:sans-serif;letter-spacing:0px;word-spacing:0px;fill:#813d9c;fill-opacity:1;stroke:none;stroke-width:1px;stroke-linecap:butt;stroke-linejoin:miter;stroke-opacity:1"
         id="g1063"
         transform="translate(2.6941115,-3.92387)">
        <path
           d="m 55.305889,221.92387 c -0.944974,0.77446 -1.612023,1.05106 -2.445832,1.05106 -1.278503,0 -1.667605,-0.77447 -1.667605,-3.20851 v -10.78724 c 0,-2.8766 -0.277936,-4.48085 -1.111745,-5.80851 -1.22291,-1.99149 -4.573306,-3.04255 -7.852936,-3.04255 -5.225182,0 -9.33863,2.71064 -9.33863,6.19575 0,1.27234 1.056163,2.37871 2.39025,2.37871 1.334086,0 2.501413,-1.10637 2.501413,-2.3234 0,-0.22127 -0.05563,-0.49787 -0.111176,-0.8851 -0.111177,-0.49787 -0.16676,-0.94042 -0.16676,-1.32766 0,-1.49362 1.778783,-2.71064 4.002271,-2.71064 2.723757,0 4.672684,1.60425 4.672684,4.59149 v 4.39862 c -7.655771,2.24877 -9.953459,2.84819 -12.343697,4.95032 -1.22292,1.10637 -2.001135,2.98723 -2.001135,4.81276 0,3.48511 2.445832,5.91915 5.836637,5.91915 2.445831,0 5.172972,-1.1617 8.563777,-4.0383 0.277937,2.93191 1.790584,4.0383 4.069655,4.0383 1.889959,0 3.057287,-0.66383 5.002829,-2.76596 z m -9.128066,-3.1532 c 0,1.65958 -0.277936,2.26809 -1.445263,2.93191 -1.389682,0.77448 -3.338597,1.21703 -4.505924,1.21703 -1.945553,0 -3.501982,-1.88085 -3.501982,-4.25958 v -0.22127 c 0.05563,-3.31915 2.949483,-4.39712 9.453169,-6.6652 z"
           style="font-style:normal;font-variant:normal;font-weight:normal;font-stretch:normal;font-family:'Nimbus Roman';-inkscape-font-specification:'Nimbus Roman, ';fill:#813d9c;stroke-width:1.38632px"
           id="path1061"
           inkscape:connector-curvature="0"
           sodipodi:nodetypes="cssscsssscsssccsscsccscssccs" />
      </g>
      <path
         style="font-style:normal;font-variant:normal;font-weight:normal;font-stretch:normal;font-size:medium;line-height:1000%;font-family:Satisfy;-inkscape-font-specification:Satisfy;letter-spacing:0px;word-spacing:0px;fill:#813d9c;fill-opacity:1;stroke:none;stroke-width:1.5259px;stroke-linecap:butt;stroke-linejoin:miter;stroke-opacity:1"
         d="m 86.312915,236.674 c -0.913953,-0.0795 -2.066328,0.23842 -3.457126,0.95369 -1.390799,0.71527 -2.801467,1.78817 -4.232002,3.21871 -1.430536,1.3908 -2.761727,3.07963 -3.99358,5.06648 -1.192112,1.98686 -2.066328,4.19227 -2.622647,6.61623 -0.437107,1.78817 -0.596055,3.33791 -0.476846,4.64924 0.119213,1.27158 0.397373,2.32462 0.834481,3.15909 0.437107,0.79475 0.973557,1.37094 1.609351,1.72857 0.635794,0.39738 1.231851,0.59606 1.78817,0.59606 1.192113,-0.0795 2.384226,-0.33776 3.576339,-0.77488 1.033163,-0.39736 2.125935,-1.01329 3.278311,-1.84777 1.152376,-0.87422 2.205409,-2.10606 3.159099,-3.69555 -0.03974,1.0729 0.01987,1.96699 0.178817,2.68225 0.198685,0.71527 0.397372,1.29143 0.596055,1.72857 0.238423,0.51658 0.536452,0.91394 0.894085,1.19211 0.357634,0.23845 0.774874,0.3974 1.251719,0.47685 0.476845,0.11922 0.973556,0.15898 1.490143,0.11921 0.556313,-0.0398 1.092769,-0.13908 1.609345,-0.29804 0.516587,-0.15894 0.97357,-0.35763 1.370936,-0.59605 0.596061,-0.39736 1.331189,-1.0729 2.205406,-2.02659 0.913953,-0.99342 1.827907,-2.06632 2.741871,-3.21871 0.953691,-1.19211 1.867644,-2.36436 2.741858,-3.51673 0.87421,-1.19211 1.58947,-2.18554 2.14579,-2.98028 0.47687,-0.63579 0.75503,-1.19211 0.83449,-1.66897 0.11917,-0.47683 0.0993,-0.83448 -0.0596,-1.0729 -0.15895,-0.23839 -0.39737,-0.31787 -0.71528,-0.23842 -0.31789,0.0398 -0.63578,0.23844 -0.95369,0.59607 -0.23843,0.31789 -0.63578,0.81461 -1.1921,1.49013 -0.51659,0.67554 -1.112642,1.45041 -1.788176,2.32463 -0.675533,0.87421 -1.410661,1.78817 -2.205405,2.74186 -0.755007,0.91394 -1.490146,1.7683 -2.205405,2.56303 -0.715271,0.75501 -1.390805,1.39081 -2.026602,1.90738 -0.635786,0.47685 -1.152373,0.71527 -1.54974,0.71527 -0.47685,0 -0.854348,-0.0993 -1.132505,-0.29802 -0.238431,-0.23842 -0.417245,-0.53645 -0.536454,-0.89409 -0.119215,-0.35763 -0.198689,-0.73514 -0.238423,-1.1325 0,-0.43712 0.01987,-0.83448 0.05961,-1.19212 0.119204,-0.59605 0.218553,-1.09276 0.298027,-1.49014 0.07952,-0.39736 0.139089,-0.73514 0.178814,-1.01329 0.07952,-0.31791 0.13909,-0.61593 0.178826,-0.89409 0.07941,-0.31789 0.158936,-0.65566 0.23842,-1.01329 0.397366,-1.82791 0.71527,-3.31805 0.95369,-4.47043 0.23842,-1.15237 0.417235,-2.06633 0.536445,-2.74186 0.119221,-0.67552 0.178826,-1.13251 0.178826,-1.37093 0,-0.27819 -0.01982,-0.457 -0.05958,-0.53645 -0.07952,-0.0398 -0.238419,-0.0596 -0.476839,-0.0596 -0.198683,0 -0.496708,0.0198 -0.894086,0.0596 -0.357629,0.0398 -0.814612,0.11921 -1.37093,0.23842 0.834486,-1.27159 1.152379,-2.28488 0.953696,-3.03989 -0.158958,-0.79474 -0.516588,-1.3908 -1.072909,-1.78817 -0.675529,-0.4371 -1.549746,-0.75501 -2.622648,-0.95369 z m -1.403712,3.72833 c 0.151497,0.008 0.281139,0.0567 0.390417,0.14604 0.119214,0.15896 0.198687,0.37751 0.238422,0.65566 0.03975,0.23842 0.01987,0.57618 -0.05961,1.0133 -0.03974,0.39736 -0.218555,0.91395 -0.536451,1.54975 0.317896,-0.0794 0.635794,-0.13905 0.95369,-0.17882 0.317896,-0.0398 0.576189,-0.0993 0.774874,-0.17882 0.238422,-0.0794 0.456975,-0.13904 0.655661,-0.17882 0.158946,-0.0397 0.178818,0.27817 0.05961,0.95369 -0.07947,0.6358 -0.218554,1.45041 -0.41724,2.44384 -0.198686,0.99344 -0.437108,2.0266 -0.715267,3.09949 -0.278161,1.0729 -0.516583,2.00672 -0.715268,2.80147 -0.03974,0.19868 -0.218554,0.51657 -0.53645,0.95369 -0.27816,0.43711 -0.655663,0.91395 -1.132508,1.43053 -0.437109,0.51658 -0.95369,1.0133 -1.549747,1.49014 -0.556319,0.47685 -1.132507,0.87422 -1.728565,1.19211 -0.556318,0.27813 -1.112638,0.43707 -1.668957,0.47685 -0.55632,0 -1.053033,-0.21856 -1.490141,-0.65566 -0.238419,-0.23843 -0.397365,-0.73513 -0.476845,-1.49014 -0.07947,-0.79474 -0.05961,-1.70871 0.05961,-2.74186 0.15895,-1.03317 0.417241,-2.12594 0.774874,-3.27831 0.357635,-1.19211 0.83448,-2.30475 1.430536,-3.33791 1.430536,-2.50345 2.682256,-4.21214 3.755155,-5.1261 0.834481,-0.71526 1.479711,-1.06246 1.934205,-1.04012 z"
         id="path1065"
         inkscape:connector-curvature="0" />
      <g
         transform="translate(1.7969421,-1.92387)"
         id="g1069"
         style="fill:#813d9c">
        <path
           sodipodi:nodetypes="cccccccccsccsscccccccccccscccccccscs"
           inkscape:connector-curvature="0"
           style="color:#000000;font-style:normal;font-variant:normal;font-weight:normal;font-stretch:normal;font-size:medium;line-height:normal;font-family:sans-serif;font-variant-ligatures:normal;font-variant-position:normal;font-variant-caps:normal;font-variant-numeric:normal;font-variant-alternates:normal;font-feature-settings:normal;text-indent:0;text-align:start;text-decoration:none;text-decoration-line:none;text-decoration-style:solid;text-decoration-color:#000000;letter-spacing:normal;word-spacing:normal;text-transform:none;writing-mode:lr-tb;direction:ltr;text-orientation:mixed;dominant-baseline:auto;baseline-shift:baseline;text-anchor:start;white-space:normal;shape-padding:0;clip-rule:nonzero;display:inline;overflow:visible;visibility:visible;opacity:1;isolation:auto;mix-blend-mode:normal;color-interpolation:sRGB;color-interpolation-filters:linearRGB;solid-color:#000000;solid-opacity:1;vector-effect:none;fill:#813d9c;fill-opacity:1;fill-rule:evenodd;stroke:none;stroke-width:4;stroke-linecap:round;stroke-linejoin:miter;stroke-miterlimit:4;stroke-dasharray:none;stroke-dashoffset:0;stroke-opacity:1;color-rendering:auto;image-rendering:auto;shape-rendering:auto;text-rendering:auto;enable-background:accumulate"
           d="m 37,68 c -2.704645,-0.03825 -2.704645,4.03825 0,4 h 9.880859 c 0.01107,0.001 0.285634,0.0327 0.585938,0.197266 0.306304,0.16789 0.485897,0.188343 0.537109,0.939453 v -0.01953 L 48.25,78.310547 C 47.789324,78.134111 47.480469,78.058594 47.480469,78.058594 L 47.244141,78 H 38 c -4.333333,0 -5.896484,4.367188 -5.896484,4.367188 L 32,82.675781 V 85 c 0,3.03333 1.431289,5.127712 2.939453,6.070312 C 36.447617,92.012912 38,92 38,92 h 7.591797 l 3.392578,-2.203125 0.01953,0.320313 c 0.08969,2.735348 4.223189,2.492675 3.992188,-0.234376 l -1,-17.009765 v -0.0098 c -0.140818,-2.06533 -1.461734,-3.545828 -2.607422,-4.173828 -1.145688,-0.62799 -2.257813,-0.685547 -2.257813,-0.685547 L 47.064453,68 Z m 1,14 h 8.644531 c 0.106906,0.0312 0.525263,0.141312 1.03711,0.482422 0.558515,0.372213 0.877827,0.68942 0.894531,1.355469 L 48.714844,85.201172 44.408203,88 H 38 C 38,88 37.552383,87.9871 37.060547,87.679688 36.568711,87.372288 36,86.96667 36,85 V 83.435547 C 36.102847,83.130577 36.534758,82 38,82 Z"
           transform="translate(0,172)"
           id="path1067" />
      </g>
      <rect
         y="184"
         x="12"
         height="94"
         width="8"
         id="rect1073"
         style="opacity:1;fill:#3d3846;fill-opacity:1;stroke:none;stroke-width:4;stroke-linecap:round;stroke-linejoin:round;stroke-miterlimit:4;stroke-dasharray:none;stroke-dashoffset:0;stroke-opacity:1" />
      <g
         aria-label="a"
         style="font-style:normal;font-weight:normal;font-size:40px;line-height:1000%;font-family:sans-serif;letter-spacing:0px;word-spacing:0px;fill:#000000;fill-opacity:1;stroke:none;stroke-width:1px;stroke-linecap:butt;stroke-linejoin:miter;stroke-opacity:1"
         id="g1000"
         transform="translate(0.8971694,40)" />
      <g
         transform="matrix(0.140625,0,0,0.140625,-29.23291,12.300445)"
         aria-label="a"
         style="font-style:normal;font-variant:normal;font-weight:bold;font-stretch:normal;font-size:322.102px;line-height:1.25;font-family:Montserrat;-inkscape-font-specification:'Montserrat, Bold';font-variant-ligatures:normal;font-variant-caps:normal;font-variant-numeric:normal;font-feature-settings:normal;text-align:start;letter-spacing:0px;word-spacing:0px;writing-mode:lr-tb;text-anchor:start;fill:#813d9c;fill-opacity:1;stroke:none;stroke-width:1"
         id="g989" />
      <g
         id="g985"
         style="font-style:normal;font-variant:normal;font-weight:bold;font-stretch:normal;font-size:322.102px;line-height:1.25;font-family:Montserrat;-inkscape-font-specification:'Montserrat, Bold';font-variant-ligatures:normal;font-variant-caps:normal;font-variant-numeric:normal;font-feature-settings:normal;text-align:start;letter-spacing:0px;word-spacing:0px;writing-mode:lr-tb;text-anchor:start;fill:#ffffff;fill-opacity:1;stroke:none;stroke-width:1"
         aria-label="a"
         transform="matrix(0.140625,0,0,0.140625,-29.23291,14.300445)">
        <path
           id="path983"
           style="fill:#ffffff;stroke-width:1"
           d="m 812.20261,1309.7929 c -27.70079,0 -55.72369,7.4083 -74.72772,20.9366 l 18.03773,35.1092 c 12.56198,-9.9852 31.56602,-16.1051 49.92584,-16.1051 27.05659,0 42.19199,14.4169 42.19199,35.9977 l -50.00981,-0.2354 c -52.82417,-0.2486 -74.40225,26.624 -74.40225,57.2238 0,29.9555 22.04572,51.6578 62.6306,51.6578 25.44607,0 52.4405,-7.5298 61.78146,-23.3128 l 0.003,21.3432 53.33034,-0.01 -0.006,-104.013 c -0.003,-52.5026 -35.93005,-78.5921 -88.75482,-78.5921 z m -11.67969,151.6087 c -17.71562,0 -28.34499,-8.3747 -28.34499,-20.9367 0,-11.5956 7.40547,-23.1197 30.91845,-22.9689 l 44.53407,0.2354 0.003,16.1495 c 0.003,16.8142 -30.36157,27.5207 -47.11089,27.5207 z"
           inkscape:connector-curvature="0"
           sodipodi:nodetypes="sccscssscccssscsccscc" />
      </g>
      <g
         transform="translate(2.6941115,-1.92387)"
         id="text993"
         style="font-style:normal;font-weight:normal;font-size:40px;line-height:1000%;font-family:sans-serif;letter-spacing:0px;word-spacing:0px;fill:#000000;fill-opacity:1;stroke:none;stroke-width:1px;stroke-linecap:butt;stroke-linejoin:miter;stroke-opacity:1"
         aria-label="a">
        <path
           sodipodi:nodetypes="cssscsssscsssccsscsccscssccs"
           inkscape:connector-curvature="0"
           id="path995"
           style="font-style:normal;font-variant:normal;font-weight:normal;font-stretch:normal;font-family:'Nimbus Roman';-inkscape-font-specification:'Nimbus Roman, ';fill:#ffffff;stroke-width:1.38632px"
           d="m 55.305889,221.92387 c -0.944974,0.77446 -1.612023,1.05106 -2.445832,1.05106 -1.278503,0 -1.667605,-0.77447 -1.667605,-3.20851 v -10.78724 c 0,-2.8766 -0.277936,-4.48085 -1.111745,-5.80851 -1.22291,-1.99149 -4.573306,-3.04255 -7.852936,-3.04255 -5.225182,0 -9.33863,2.71064 -9.33863,6.19575 0,1.27234 1.056163,2.37871 2.39025,2.37871 1.334086,0 2.501413,-1.10637 2.501413,-2.3234 0,-0.22127 -0.05563,-0.49787 -0.111176,-0.8851 -0.111177,-0.49787 -0.16676,-0.94042 -0.16676,-1.32766 0,-1.49362 1.778783,-2.71064 4.002271,-2.71064 2.723757,0 4.672684,1.60425 4.672684,4.59149 v 4.39862 c -7.655771,2.24877 -9.953459,2.84819 -12.343697,4.95032 -1.22292,1.10637 -2.001135,2.98723 -2.001135,4.81276 0,3.48511 2.445832,5.91915 5.836637,5.91915 2.445831,0 5.172972,-1.1617 8.563777,-4.0383 0.277937,2.93191 1.790584,4.0383 4.069655,4.0383 1.889959,0 3.057287,-0.66383 5.002829,-2.76596 z m -9.128066,-3.1532 c 0,1.65958 -0.277936,2.26809 -1.445263,2.93191 -1.389682,0.77448 -3.338597,1.21703 -4.505924,1.21703 -1.945553,0 -3.501982,-1.88085 -3.501982,-4.25958 v -0.22127 c 0.05563,-3.31915 2.949483,-4.39712 9.453169,-6.6652 z" />
      </g>
      <path
         inkscape:connector-curvature="0"
         id="path1011"
         d="m 86.312915,238.674 c -0.913953,-0.0795 -2.066328,0.23842 -3.457126,0.95369 -1.390799,0.71527 -2.801467,1.78817 -4.232002,3.21871 -1.430536,1.3908 -2.761727,3.07963 -3.99358,5.06648 -1.192112,1.98686 -2.066328,4.19227 -2.622647,6.61623 -0.437107,1.78817 -0.596055,3.33791 -0.476846,4.64924 0.119213,1.27158 0.397373,2.32462 0.834481,3.15909 0.437107,0.79475 0.973557,1.37094 1.609351,1.72857 0.635794,0.39738 1.231851,0.59606 1.78817,0.59606 1.192113,-0.0795 2.384226,-0.33776 3.576339,-0.77488 1.033163,-0.39736 2.125935,-1.01329 3.278311,-1.84777 1.152376,-0.87422 2.205409,-2.10606 3.159099,-3.69555 -0.03974,1.0729 0.01987,1.96699 0.178817,2.68225 0.198685,0.71527 0.397372,1.29143 0.596055,1.72857 0.238423,0.51658 0.536452,0.91394 0.894085,1.19211 0.357634,0.23845 0.774874,0.3974 1.251719,0.47685 0.476845,0.11922 0.973556,0.15898 1.490143,0.11921 0.556313,-0.0398 1.092769,-0.13908 1.609345,-0.29804 0.516587,-0.15894 0.97357,-0.35763 1.370936,-0.59605 0.596061,-0.39736 1.331189,-1.0729 2.205406,-2.02659 0.913953,-0.99342 1.827907,-2.06632 2.741871,-3.21871 0.953691,-1.19211 1.867644,-2.36436 2.741858,-3.51673 0.87421,-1.19211 1.58947,-2.18554 2.14579,-2.98028 0.47687,-0.63579 0.75503,-1.19211 0.83449,-1.66897 0.11917,-0.47683 0.0993,-0.83448 -0.0596,-1.0729 -0.15895,-0.23839 -0.39737,-0.31787 -0.71528,-0.23842 -0.31789,0.0398 -0.63578,0.23844 -0.95369,0.59607 -0.23843,0.31789 -0.63578,0.81461 -1.1921,1.49013 -0.51659,0.67554 -1.112642,1.45041 -1.788176,2.32463 -0.675533,0.87421 -1.410661,1.78817 -2.205405,2.74186 -0.755007,0.91394 -1.490146,1.7683 -2.205405,2.56303 -0.715271,0.75501 -1.390805,1.39081 -2.026602,1.90738 -0.635786,0.47685 -1.152373,0.71527 -1.54974,0.71527 -0.47685,0 -0.854348,-0.0993 -1.132505,-0.29802 -0.238431,-0.23842 -0.417245,-0.53645 -0.536454,-0.89409 -0.119215,-0.35763 -0.198689,-0.73514 -0.238423,-1.1325 0,-0.43712 0.01987,-0.83448 0.05961,-1.19212 0.119204,-0.59605 0.218553,-1.09276 0.298027,-1.49014 0.07952,-0.39736 0.139089,-0.73514 0.178814,-1.01329 0.07952,-0.31791 0.13909,-0.61593 0.178826,-0.89409 0.07941,-0.31789 0.158936,-0.65566 0.23842,-1.01329 0.397366,-1.82791 0.71527,-3.31805 0.95369,-4.47043 0.23842,-1.15237 0.417235,-2.06633 0.536445,-2.74186 0.119221,-0.67552 0.178826,-1.13251 0.178826,-1.37093 0,-0.27819 -0.01982,-0.457 -0.05958,-0.53645 -0.07952,-0.0398 -0.238419,-0.0596 -0.476839,-0.0596 -0.198683,0 -0.496708,0.0198 -0.894086,0.0596 -0.357629,0.0398 -0.814612,0.11921 -1.37093,0.23842 0.834486,-1.27159 1.152379,-2.28488 0.953696,-3.03989 -0.158958,-0.79474 -0.516588,-1.3908 -1.072909,-1.78817 -0.675529,-0.4371 -1.549746,-0.75501 -2.622648,-0.95369 z m -1.403712,3.72833 c 0.151497,0.008 0.281139,0.0567 0.390417,0.14604 0.119214,0.15896 0.198687,0.37751 0.238422,0.65566 0.03975,0.23842 0.01987,0.57618 -0.05961,1.0133 -0.03974,0.39736 -0.218555,0.91395 -0.536451,1.54975 0.317896,-0.0794 0.635794,-0.13905 0.95369,-0.17882 0.317896,-0.0398 0.576189,-0.0993 0.774874,-0.17882 0.238422,-0.0794 0.456975,-0.13904 0.655661,-0.17882 0.158946,-0.0397 0.178818,0.27817 0.05961,0.95369 -0.07947,0.6358 -0.218554,1.45041 -0.41724,2.44384 -0.198686,0.99344 -0.437108,2.0266 -0.715267,3.09949 -0.278161,1.0729 -0.516583,2.00672 -0.715268,2.80147 -0.03974,0.19868 -0.218554,0.51657 -0.53645,0.95369 -0.27816,0.43711 -0.655663,0.91395 -1.132508,1.43053 -0.437109,0.51658 -0.95369,1.0133 -1.549747,1.49014 -0.556319,0.47685 -1.132507,0.87422 -1.728565,1.19211 -0.556318,0.27813 -1.112638,0.43707 -1.668957,0.47685 -0.55632,0 -1.053033,-0.21856 -1.490141,-0.65566 -0.238419,-0.23843 -0.397365,-0.73513 -0.476845,-1.49014 -0.07947,-0.79474 -0.05961,-1.70871 0.05961,-2.74186 0.15895,-1.03317 0.417241,-2.12594 0.774874,-3.27831 0.357635,-1.19211 0.83448,-2.30475 1.430536,-3.33791 1.430536,-2.50345 2.682256,-4.21214 3.755155,-5.1261 0.834481,-0.71526 1.479711,-1.06246 1.934205,-1.04012 z"
         style="font-style:normal;font-variant:normal;font-weight:normal;font-stretch:normal;font-size:medium;line-height:1000%;font-family:Satisfy;-inkscape-font-specification:Satisfy;letter-spacing:0px;word-spacing:0px;fill:#ffffff;fill-opacity:1;stroke:none;stroke-width:1.5259px;stroke-linecap:butt;stroke-linejoin:miter;stroke-opacity:1" />
      <g
         transform="translate(1.7969421,0.07613)"
         id="g1022">
        <path
           id="path1016"
           transform="translate(0,172)"
           d="m 37,68 c -2.704645,-0.03825 -2.704645,4.03825 0,4 h 9.880859 c 0.01107,0.001 0.285634,0.0327 0.585938,0.197266 0.306304,0.16789 0.485897,0.188343 0.537109,0.939453 v -0.01953 L 48.25,78.310547 C 47.789324,78.134111 47.480469,78.058594 47.480469,78.058594 L 47.244141,78 H 38 c -4.333333,0 -5.896484,4.367188 -5.896484,4.367188 L 32,82.675781 V 85 c 0,3.03333 1.431289,5.127712 2.939453,6.070312 C 36.447617,92.012912 38,92 38,92 h 7.591797 l 3.392578,-2.203125 0.01953,0.320313 c 0.08969,2.735348 4.223189,2.492675 3.992188,-0.234376 l -1,-17.009765 v -0.0098 c -0.140818,-2.06533 -1.461734,-3.545828 -2.607422,-4.173828 -1.145688,-0.62799 -2.257813,-0.685547 -2.257813,-0.685547 L 47.064453,68 Z m 1,14 h 8.644531 c 0.106906,0.0312 0.525263,0.141312 1.03711,0.482422 0.558515,0.372213 0.877827,0.68942 0.894531,1.355469 L 48.714844,85.201172 44.408203,88 H 38 C 38,88 37.552383,87.9871 37.060547,87.679688 36.568711,87.372288 36,86.96667 36,85 V 83.435547 C 36.102847,83.130577 36.534758,82 38,82 Z"
           style="color:#000000;font-style:normal;font-variant:normal;font-weight:normal;font-stretch:normal;font-size:medium;line-height:normal;font-family:sans-serif;font-variant-ligatures:normal;font-variant-position:normal;font-variant-caps:normal;font-variant-numeric:normal;font-variant-alternates:normal;font-feature-settings:normal;text-indent:0;text-align:start;text-decoration:none;text-decoration-line:none;text-decoration-style:solid;text-decoration-color:#000000;letter-spacing:normal;word-spacing:normal;text-transform:none;writing-mode:lr-tb;direction:ltr;text-orientation:mixed;dominant-baseline:auto;baseline-shift:baseline;text-anchor:start;white-space:normal;shape-padding:0;clip-rule:nonzero;display:inline;overflow:visible;visibility:visible;opacity:1;isolation:auto;mix-blend-mode:normal;color-interpolation:sRGB;color-interpolation-filters:linearRGB;solid-color:#000000;solid-opacity:1;vector-effect:none;fill:#ffffff;fill-opacity:1;fill-rule:evenodd;stroke:none;stroke-width:4;stroke-linecap:round;stroke-linejoin:miter;stroke-miterlimit:4;stroke-dasharray:none;stroke-dashoffset:0;stroke-opacity:1;color-rendering:auto;image-rendering:auto;shape-rendering:auto;text-rendering:auto;enable-background:accumulate"
           inkscape:connector-curvature="0"
           sodipodi:nodetypes="cccccccccsccsscccccccccccscccccccscs" />
      </g>
      <path
         sodipodi:nodetypes="ccccccccc"
         inkscape:connector-curvature="0"
         id="rect1201"
         transform="translate(0,172)"
         d="m 12,106 v 10 h 8 v -2 h -6 v -6 h 6 v -2 z"
         style="opacity:1;fill:#241f31;fill-opacity:1;stroke:none;stroke-width:4;stroke-linecap:round;stroke-linejoin:round;stroke-miterlimit:4;stroke-dasharray:none;stroke-dashoffset:0;stroke-opacity:1" />
      <path
         inkscape:connector-curvature="0"
         id="path1217"
         d="M 15,278 V 184"
         style="opacity:0.15;fill:none;fill-rule:evenodd;stroke:#ffffff;stroke-width:2;stroke-linecap:butt;stroke-linejoin:miter;stroke-miterlimit:4;stroke-dasharray:none;stroke-opacity:1" />
      <g
         transform="translate(160.01269,172.00586)"
         id="g2097"
         style="enable-background:new">
        <g
           transform="translate(-172,-668)"
           id="layer3-3">
          <path
             inkscape:connector-curvature="0"
             id="path28099-5"
             d="m 178.99609,670.99414 v 2 h 2.92188 c -0.0552,0 0.082,0.16127 0.082,0.084 V 674 h -1.94141 c -1.71588,0 -3.03005,1.12549 -3.05468,2.48438 -0.0123,0.67944 0.30583,1.36299 0.86132,1.82226 0.5555,0.45927 1.31546,0.69922 2.19336,0.69922 H 184 v -5.92774 c 0,-1.17118 -0.88519,-2.08398 -2.08203,-2.08398 z M 180.05859,676 H 182 v 1.00586 h -1.94141 c -0.5194,0 -0.79183,-0.13595 -0.91797,-0.24024 -0.12613,-0.10428 -0.13802,-0.17217 -0.13671,-0.24414 0.003,-0.14392 0.0849,-0.52148 1.05468,-0.52148 z"
             style="color:#000000;font-style:normal;font-variant:normal;font-weight:normal;font-stretch:normal;font-size:medium;line-height:normal;font-family:sans-serif;font-variant-ligatures:normal;font-variant-position:normal;font-variant-caps:normal;font-variant-numeric:normal;font-variant-alternates:normal;font-feature-settings:normal;text-indent:0;text-align:start;text-decoration:none;text-decoration-line:none;text-decoration-style:solid;text-decoration-color:#000000;letter-spacing:normal;word-spacing:normal;text-transform:none;writing-mode:lr-tb;direction:ltr;text-orientation:mixed;dominant-baseline:auto;baseline-shift:baseline;text-anchor:start;white-space:normal;shape-padding:0;clip-rule:nonzero;display:inline;overflow:visible;visibility:visible;opacity:1;isolation:auto;mix-blend-mode:normal;color-interpolation:sRGB;color-interpolation-filters:linearRGB;solid-color:#000000;solid-opacity:1;vector-effect:none;fill:#2e3436;fill-opacity:1;fill-rule:nonzero;stroke:none;stroke-width:2;stroke-linecap:butt;stroke-linejoin:miter;stroke-miterlimit:4;stroke-dasharray:none;stroke-dashoffset:0;stroke-opacity:1;marker:none;color-rendering:auto;image-rendering:auto;shape-rendering:auto;text-rendering:auto;enable-background:accumulate" />
          <path
             inkscape:connector-curvature="0"
             id="path8003"
             d="m 175,670.9707 v 11.00391 h 1 V 670.9707 Z"
             style="color:#000000;font-style:normal;font-variant:normal;font-weight:normal;font-stretch:normal;font-size:medium;line-height:normal;font-family:sans-serif;font-variant-ligatures:normal;font-variant-position:normal;font-variant-caps:normal;font-variant-numeric:normal;font-variant-alternates:normal;font-feature-settings:normal;text-indent:0;text-align:start;text-decoration:none;text-decoration-line:none;text-decoration-style:solid;text-decoration-color:#000000;letter-spacing:normal;word-spacing:normal;text-transform:none;writing-mode:lr-tb;direction:ltr;text-orientation:mixed;dominant-baseline:auto;baseline-shift:baseline;text-anchor:start;white-space:normal;shape-padding:0;clip-rule:nonzero;display:inline;overflow:visible;visibility:visible;opacity:1;isolation:auto;mix-blend-mode:normal;color-interpolation:sRGB;color-interpolation-filters:linearRGB;solid-color:#000000;solid-opacity:1;vector-effect:none;fill:#2e3436;fill-opacity:1;fill-rule:nonzero;stroke:none;stroke-width:1;stroke-linecap:butt;stroke-linejoin:miter;stroke-miterlimit:4;stroke-dasharray:none;stroke-dashoffset:0;stroke-opacity:1;marker:none;paint-order:normal;color-rendering:auto;image-rendering:auto;shape-rendering:auto;text-rendering:auto;enable-background:new" />
          <path
             inkscape:connector-curvature="0"
             id="path8005"
             d="m 174.00781,680 v 1 H 185 v -1 z"
             style="color:#000000;font-style:normal;font-variant:normal;font-weight:normal;font-stretch:normal;font-size:medium;line-height:normal;font-family:sans-serif;font-variant-ligatures:normal;font-variant-position:normal;font-variant-caps:normal;font-variant-numeric:normal;font-variant-alternates:normal;font-feature-settings:normal;text-indent:0;text-align:start;text-decoration:none;text-decoration-line:none;text-decoration-style:solid;text-decoration-color:#000000;letter-spacing:normal;word-spacing:normal;text-transform:none;writing-mode:lr-tb;direction:ltr;text-orientation:mixed;dominant-baseline:auto;baseline-shift:baseline;text-anchor:start;white-space:normal;shape-padding:0;clip-rule:nonzero;display:inline;overflow:visible;visibility:visible;opacity:1;isolation:auto;mix-blend-mode:normal;color-interpolation:sRGB;color-interpolation-filters:linearRGB;solid-color:#000000;solid-opacity:1;vector-effect:none;fill:#2e3436;fill-opacity:1;fill-rule:nonzero;stroke:none;stroke-width:1;stroke-linecap:butt;stroke-linejoin:miter;stroke-miterlimit:4;stroke-dasharray:none;stroke-dashoffset:0;stroke-opacity:1;marker:none;paint-order:normal;color-rendering:auto;image-rendering:auto;shape-rendering:auto;text-rendering:auto;enable-background:new" />
          <path
             inkscape:connector-curvature="0"
             d="m 185.02358,682.97439 -0.0308,-4.9488 2.5144,2.48512 z"
             id="rect8025"
             style="color:#000000;overflow:visible;opacity:1;vector-effect:none;fill:#241f31;fill-opacity:1;stroke:none;stroke-width:1;stroke-linecap:butt;stroke-linejoin:miter;stroke-miterlimit:4;stroke-dasharray:none;stroke-dashoffset:0;stroke-opacity:1;marker:none;marker-start:none;marker-mid:none;marker-end:none;paint-order:normal" />
          <path
             inkscape:connector-curvature="0"
             d="m 177.9744,670.9764 -4.9488,0.0308 2.48511,-2.5144 z"
             id="path8028"
             style="color:#000000;overflow:visible;opacity:1;vector-effect:none;fill:#241f31;fill-opacity:1;stroke:none;stroke-width:1;stroke-linecap:butt;stroke-linejoin:miter;stroke-miterlimit:4;stroke-dasharray:none;stroke-dashoffset:0;stroke-opacity:1;marker:none;marker-start:none;marker-mid:none;marker-end:none;paint-order:normal" />
        </g>
      </g>
    </g>
  </g>
</svg>
