<?xml version="1.0" encoding="UTF-8" standalone="no"?>
<svg
   xmlns:dc="http://purl.org/dc/elements/1.1/"
   xmlns:cc="http://creativecommons.org/ns#"
   xmlns:rdf="http://www.w3.org/1999/02/22-rdf-syntax-ns#"
   xmlns:svg="http://www.w3.org/2000/svg"
   xmlns="http://www.w3.org/2000/svg"
   xmlns:xlink="http://www.w3.org/1999/xlink"
   xmlns:sodipodi="http://sodipodi.sourceforge.net/DTD/sodipodi-0.dtd"
   xmlns:inkscape="http://www.inkscape.org/namespaces/inkscape"
   inkscape:export-ydpi="96"
   inkscape:export-xdpi="96"
   inkscape:export-filename="Template.png"
   width="192"
   height="152"
   id="svg11300"
   sodipodi:version="0.32"
   inkscape:version="1.0.1 (3bc2e813f5, 2020-09-07)"
   sodipodi:docname="com.github.geigi.cozy.Source.svg"
   inkscape:output_extension="org.inkscape.output.svg.inkscape"
   version="1.0"
   style="display:inline;enable-background:new"
   viewBox="0 0 192 152">
  <title
     id="title4162">Adwaita Icon Template</title>
  <defs
     id="defs3">
    <linearGradient
       inkscape:collect="always"
       id="linearGradient1298">
      <stop
         style="stop-color:#c64600;stop-opacity:1;"
         offset="0"
         id="stop1294" />
      <stop
         style="stop-color:#c64600;stop-opacity:0;"
         offset="1"
         id="stop1296" />
    </linearGradient>
    <linearGradient
       inkscape:collect="always"
       id="linearGradient1273">
      <stop
         style="stop-color:#c64600;stop-opacity:1;"
         offset="0"
         id="stop1269" />
      <stop
         style="stop-color:#c64600;stop-opacity:0.98823529;"
         offset="0.05749872"
         id="stop1287" />
      <stop
         style="stop-color:#ff7f3a;stop-opacity:0.98039216"
         offset="0.10299505"
         id="stop1285" />
      <stop
         style="stop-color:#c64600;stop-opacity:0.97254902;"
         offset="0.14871755"
         id="stop1283" />
      <stop
         style="stop-color:#872f00;stop-opacity:0.9137255"
         offset="0.41176471"
         id="stop1281" />
      <stop
         style="stop-color:#c64600;stop-opacity:0.85490196;"
         offset="0.86482507"
         id="stop1279" />
      <stop
         style="stop-color:#ff7429;stop-opacity:0.8509804"
         offset="0.88235295"
         id="stop1277" />
      <stop
         style="stop-color:#682a09;stop-opacity:0.84705889"
         offset="0.92096668"
         id="stop1289" />
      <stop
         style="stop-color:#c64600;stop-opacity:0.83968431"
         offset="1"
         id="stop1271" />
    </linearGradient>
    <linearGradient
       inkscape:collect="always"
       id="linearGradient1167">
      <stop
         style="stop-color:#3d3846;stop-opacity:1;"
         offset="0"
         id="stop1163" />
      <stop
         style="stop-color:#9a9996;stop-opacity:1"
         offset="0.69726902"
         id="stop1171" />
      <stop
         style="stop-color:#77767b;stop-opacity:1"
         offset="1"
         id="stop1165" />
    </linearGradient>
    <linearGradient
       inkscape:collect="always"
       id="linearGradient1155">
      <stop
         style="stop-color:#c0bfbc;stop-opacity:1;"
         offset="0"
         id="stop1151" />
      <stop
         style="stop-color:#e1e0df;stop-opacity:1"
         offset="0.24498358"
         id="stop1161" />
      <stop
         style="stop-color:#82807a;stop-opacity:1"
         offset="0.8587203"
         id="stop1159" />
      <stop
         style="stop-color:#c0bfbc;stop-opacity:1"
         offset="1"
         id="stop1153" />
    </linearGradient>
    <inkscape:path-effect
       effect="fillet_chamfer"
       id="path-effect3796"
       is_visible="true"
       lpeversion="1"
       satellites_param="F,0,0,1,0,0,0,1 @ F,0,0,1,0,9,0,1 @ F,0,0,1,0,10,0,1 @ F,0,1,1,0,0,0,1"
       unit="px"
       method="auto"
       mode="F"
       radius="0"
       chamfer_steps="1"
       flexible="false"
       use_knot_distance="true"
       apply_no_radius="true"
       apply_with_radius="true"
       only_selected="false"
       hide_knots="false" />
    <inkscape:path-effect
       effect="fillet_chamfer"
       id="path-effect3794"
       is_visible="true"
       lpeversion="1"
       satellites_param="F,0,0,1,0,0,0,1 @ F,0,0,1,0,7,0,1 @ F,0,1,1,0,0,0,1"
       unit="px"
       method="auto"
       mode="F"
       radius="0"
       chamfer_steps="1"
       flexible="false"
       use_knot_distance="true"
       apply_no_radius="true"
       apply_with_radius="true"
       only_selected="false"
       hide_knots="false" />
    <inkscape:path-effect
       effect="pts2ellipse"
       id="path-effect3792"
       is_visible="true"
       lpeversion="1"
       method="auto"
       gen_arc="false"
       arc_other="false"
       slice_arc="false"
       gen_isometric_frame="false"
       draw_axes="false"
       gen_perspective_frame="false"
       draw_perspective_axes="false"
       rot_axes="0"
       draw_ori_path="false" />
    <linearGradient
       inkscape:collect="always"
       id="linearGradient3760">
      <stop
         style="stop-color:#ffa348;stop-opacity:1"
         offset="0"
         id="stop3754" />
      <stop
         id="stop3756"
         offset="0.64924306"
         style="stop-color:#e66100;stop-opacity:1" />
      <stop
         style="stop-color:#ffa348;stop-opacity:1"
         offset="1"
         id="stop3758" />
    </linearGradient>
    <linearGradient
       y2="236"
       x2="96"
       y1="236"
       x1="32"
       gradientTransform="translate(604.81684,170.58641)"
       gradientUnits="userSpaceOnUse"
       id="linearGradient1099"
       xlink:href="#linearGradient1036" />
    <linearGradient
       id="linearGradient1036">
      <stop
         id="stop1032"
         offset="0"
         style="stop-color:#d5d3cf;stop-opacity:1;" />
      <stop
         id="stop1034"
         offset="1"
         style="stop-color:#f6f5f4;stop-opacity:1" />
    </linearGradient>
    <radialGradient
       r="32"
       fy="-76"
       fx="-244"
       cy="-76"
       cx="-244"
       gradientTransform="matrix(0.88333331,0,0,0.88333331,-460.35018,463.11973)"
       gradientUnits="userSpaceOnUse"
       id="radialGradient1103"
       xlink:href="#linearGradient1069" />
    <linearGradient
       id="linearGradient1069">
      <stop
         id="stop1065"
         offset="0"
         style="stop-color:#d5d3cf;stop-opacity:1" />
      <stop
         id="stop1067-1"
         offset="1"
         style="stop-color:#949390;stop-opacity:1" />
    </linearGradient>
    <linearGradient
       gradientUnits="userSpaceOnUse"
       y2="232"
       x2="64"
       y1="262.5"
       x1="64"
       id="linearGradient1027"
       xlink:href="#linearGradient1025"
       gradientTransform="translate(-470.5864,432.81685)" />
    <linearGradient
       id="linearGradient1025">
      <stop
         id="stop1021"
         offset="0"
         style="stop-color:#9a9996;stop-opacity:1" />
      <stop
         id="stop1023"
         offset="1"
         style="stop-color:#77767b;stop-opacity:1" />
    </linearGradient>
    <inkscape:path-effect
       effect="spiro"
       id="path-effect35304-9"
       is_visible="true" />
    <clipPath
       clipPathUnits="userSpaceOnUse"
       id="clipPath1609-7">
      <path
         sodipodi:nodetypes="cccccc"
         inkscape:connector-curvature="0"
         id="path1611-5"
         d="m 252,116 28,-28 v -8 h -36 v 36 z"
         style="fill:#e74747;stroke:none;stroke-width:0.25px;stroke-linecap:butt;stroke-linejoin:miter;stroke-opacity:1" />
    </clipPath>
    <linearGradient
       id="linearGradient1697">
      <stop
         id="stop1685"
         offset="0"
         style="stop-color:#deddda;stop-opacity:1" />
      <stop
         style="stop-color:#eeeeec;stop-opacity:1"
         offset="0.04545455"
         id="stop1687" />
      <stop
         id="stop1689"
         offset="0.09090909"
         style="stop-color:#deddda;stop-opacity:1" />
      <stop
         style="stop-color:#deddda;stop-opacity:1"
         offset="0.90909094"
         id="stop1691" />
      <stop
         id="stop1693"
         offset="0.95454544"
         style="stop-color:#eeeeec;stop-opacity:1" />
      <stop
         id="stop1695"
         offset="1"
         style="stop-color:#c0bfbc;stop-opacity:1" />
    </linearGradient>
    <clipPath
       clipPathUnits="userSpaceOnUse"
       id="clipPath1289">
      <path
         style="display:inline;opacity:1;vector-effect:none;fill:none;fill-opacity:1;stroke:#000000;stroke-width:4;stroke-linecap:round;stroke-linejoin:round;stroke-miterlimit:4;stroke-dasharray:none;stroke-dashoffset:0;stroke-opacity:1;marker:none;marker-start:none;marker-mid:none;marker-end:none;paint-order:normal;enable-background:new"
         d="m 64,-148 h 64 l 64,-64 64,64 h 192 c 17.728,0 32,14.272 32,32 v 288 c 0,17.728 -14.272,32 -32,32 H 256 l -64,-64 -64,64 H 64 C 46.272,204 32,189.728 32,172 v -288 c 0,-17.728 14.408898,-34.19889 32,-32 z"
         id="path1291"
         inkscape:connector-curvature="0"
         sodipodi:nodetypes="scccsssscccssss" />
    </clipPath>
    <linearGradient
       id="paint3_linear-2-6-5"
       x2="1"
       gradientUnits="userSpaceOnUse"
       gradientTransform="matrix(0,6,-12,0,-64,209.99687)">
      <stop
         stop-color="#C01C27"
         id="stop91-0-7-4" />
      <stop
         offset="1"
         stop-color="#E01B24"
         id="stop93-2-5-7" />
    </linearGradient>
    <clipPath
       clipPathUnits="userSpaceOnUse"
       id="clipPath1609">
      <path
         sodipodi:nodetypes="cccccc"
         inkscape:connector-curvature="0"
         id="path1611"
         d="m 252,116 28,-28 v -8 h -36 v 36 z"
         style="fill:#e74747;stroke:none;stroke-width:0.25px;stroke-linecap:butt;stroke-linejoin:miter;stroke-opacity:1" />
    </clipPath>
    <linearGradient
       inkscape:collect="always"
       xlink:href="#linearGradient1757"
       id="linearGradient2634"
       gradientUnits="userSpaceOnUse"
       x1="64"
       y1="247"
       x2="116"
       y2="247" />
    <linearGradient
       id="linearGradient1757"
       inkscape:collect="always">
      <stop
         id="stop1749"
         offset="0"
         style="stop-color:#c0bfbc;stop-opacity:1" />
      <stop
         style="stop-color:#c0bfbc;stop-opacity:1"
         offset="0.84615386"
         id="stop1751" />
      <stop
         id="stop1753"
         offset="0.92307693"
         style="stop-color:#deddda;stop-opacity:1" />
      <stop
         id="stop1755"
         offset="1"
         style="stop-color:#c0bfbc;stop-opacity:1" />
    </linearGradient>
    <linearGradient
       inkscape:collect="always"
       xlink:href="#linearGradient983"
       id="linearGradient2636"
       gradientUnits="userSpaceOnUse"
       gradientTransform="matrix(0.25,0,0,0.25,4,221)"
       x1="144"
       y1="-84.000031"
       x2="144"
       y2="366.06601" />
    <linearGradient
       inkscape:collect="always"
       id="linearGradient983">
      <stop
         style="stop-color:#edece9;stop-opacity:1"
         offset="0"
         id="stop978" />
      <stop
         style="stop-color:#ffffff;stop-opacity:1"
         offset="1"
         id="stop980" />
    </linearGradient>
    <linearGradient
       inkscape:collect="always"
       xlink:href="#linearGradient1259"
       id="linearGradient2638"
       gradientUnits="userSpaceOnUse"
       gradientTransform="matrix(-0.25,0,0,0.25,168,197)"
       x1="384"
       y1="120"
       x2="448"
       y2="120" />
    <linearGradient
       id="linearGradient1259"
       inkscape:collect="always">
      <stop
         id="stop1253"
         offset="0"
         style="stop-color:#f6f5f4;stop-opacity:1" />
      <stop
         style="stop-color:#ffffff;stop-opacity:1"
         offset="0.5"
         id="stop1255" />
      <stop
         id="stop1257"
         offset="1"
         style="stop-color:#dddbd8;stop-opacity:1" />
    </linearGradient>
    <linearGradient
       inkscape:collect="always"
       id="linearGradient5664">
      <stop
         style="stop-color:#a09f9c;stop-opacity:1;"
         offset="0"
         id="stop5660" />
      <stop
         id="stop5668"
         offset="0.07799384"
         style="stop-color:#a09f9c;stop-opacity:0.99607843;" />
      <stop
         style="stop-color:#d0d0ce;stop-opacity:0.99215686"
         offset="0.10368115"
         id="stop5672" />
      <stop
         style="stop-color:#a09f9c;stop-opacity:0.99215686;"
         offset="0.11958282"
         id="stop5670" />
      <stop
         id="stop5682"
         offset="0.28471547"
         style="stop-color:#787773;stop-opacity:0.98431373" />
      <stop
         id="stop5680"
         offset="0.49999952"
         style="stop-color:#908f8b;stop-opacity:0.97647059" />
      <stop
         style="stop-color:#b5b4b1;stop-opacity:0.96470588"
         offset="0.76176536"
         id="stop5684" />
      <stop
         id="stop5674"
         offset="0.87430018"
         style="stop-color:#a09f9c;stop-opacity:0.96470588;" />
      <stop
         style="stop-color:#cbcac9;stop-opacity:0.96470588"
         offset="0.90488034"
         id="stop5676" />
      <stop
         id="stop5678"
         offset="0.94891572"
         style="stop-color:#a09f9c;stop-opacity:0.96470588;" />
      <stop
         style="stop-color:#a09f9c;stop-opacity:0.96581197"
         offset="1"
         id="stop5662" />
    </linearGradient>
    <linearGradient
       inkscape:collect="always"
       xlink:href="#linearGradient5664"
       id="linearGradient2493"
       x1="137.61646"
       y1="-138.58612"
       x2="426.65503"
       y2="-138.58612"
       gradientUnits="userSpaceOnUse"
       gradientTransform="matrix(1.0733986,0,0,1.0733986,-20.487624,5.126696)" />
    <linearGradient
       inkscape:collect="always"
       id="linearGradient1349">
      <stop
         style="stop-color:#9d9da1;stop-opacity:1"
         offset="0"
         id="stop1345" />
      <stop
         style="stop-color:#77767b;stop-opacity:0.94957983"
         offset="1"
         id="stop1347" />
    </linearGradient>
    <linearGradient
       inkscape:collect="always"
       id="linearGradient5980">
      <stop
         id="stop5978"
         offset="0"
         style="stop-color:#3d3846;stop-opacity:0;" />
      <stop
         id="stop5976"
         offset="1"
         style="stop-color:#3d3846;stop-opacity:0.25210086" />
    </linearGradient>
    <radialGradient
       inkscape:collect="always"
       xlink:href="#linearGradient3760"
       id="radialGradient5900"
       gradientUnits="userSpaceOnUse"
       gradientTransform="matrix(2.5183116,0,0,2.3850526,-203.08369,-85.482394)"
       cx="134.30902"
       cy="55.279427"
       fx="134.30902"
       fy="55.279427"
       r="58.46003" />
    <linearGradient
       inkscape:collect="always"
       id="linearGradient4117">
      <stop
         style="stop-color:#eae9e7;stop-opacity:1"
         offset="0"
         id="stop4111" />
      <stop
         id="stop4113"
         offset="0.64924306"
         style="stop-color:#b5b3ad;stop-opacity:1" />
      <stop
         style="stop-color:#fcfcfc;stop-opacity:1"
         offset="1"
         id="stop4115" />
    </linearGradient>
    <linearGradient
       inkscape:collect="always"
       id="linearGradient5477">
      <stop
         style="stop-color:#cacac9;stop-opacity:1"
         offset="0"
         id="stop5469" />
      <stop
         id="stop5471"
         offset="0.31057373"
         style="stop-color:#b0aeab;stop-opacity:0.94117647" />
      <stop
         style="stop-color:#6c6b66;stop-opacity:0.94901961"
         offset="0.68832356"
         id="stop5473" />
      <stop
         style="stop-color:#d6d6d4;stop-opacity:0.96638656"
         offset="1"
         id="stop5475" />
    </linearGradient>
    <linearGradient
       inkscape:collect="always"
       id="linearGradient6142">
      <stop
         style="stop-color:#ffffff;stop-opacity:1;"
         offset="0"
         id="stop6138" />
      <stop
         style="stop-color:#ffffff;stop-opacity:0;"
         offset="1"
         id="stop6140" />
    </linearGradient>
    <radialGradient
       inkscape:collect="always"
       xlink:href="#linearGradient6142"
       id="radialGradient6690"
       gradientUnits="userSpaceOnUse"
       gradientTransform="matrix(37.758633,0,0,19.739207,-7375.6658,-1304.0032)"
       cx="197.74678"
       cy="69.253197"
       fx="197.74678"
       fy="69.253197"
       r="2.5002501" />
    <radialGradient
       inkscape:collect="always"
       xlink:href="#linearGradient1349"
       id="radialGradient2559"
       gradientUnits="userSpaceOnUse"
       gradientTransform="matrix(0.98254044,0,0,0.98254044,-1.7118745,16.291632)"
       cx="81.936386"
       cy="33.185158"
       fx="81.936386"
       fy="33.185158"
       r="57.27565" />
    <radialGradient
       inkscape:collect="always"
       xlink:href="#linearGradient5980"
       id="radialGradient2567"
       gradientUnits="userSpaceOnUse"
       gradientTransform="matrix(3.9332251,-7.2858454e-7,6.4450347e-7,3.4793176,-222.92515,-173.5546)"
       cx="76"
       cy="65.976921"
       fx="76"
       fy="65.976921"
       r="13.220703" />
    <radialGradient
       inkscape:collect="always"
       xlink:href="#linearGradient4117"
       id="radialGradient2575"
       gradientUnits="userSpaceOnUse"
       gradientTransform="matrix(2.8150539,0.01105706,-0.01047197,2.6660925,-242.35997,-102.50318)"
       cx="134.30902"
       cy="55.279427"
       fx="134.30902"
       fy="55.279427"
       r="58.46003" />
    <radialGradient
       inkscape:collect="always"
       xlink:href="#linearGradient5477"
       id="radialGradient2585"
       gradientUnits="userSpaceOnUse"
       gradientTransform="matrix(4.9005487,0.15042804,-0.2360238,7.6890319,-638.53531,-2206.8466)"
       cx="183.52466"
       cy="320.79443"
       fx="183.52466"
       fy="320.79443"
       r="20.486324" />
    <radialGradient
       inkscape:collect="always"
       xlink:href="#linearGradient6142"
       id="radialGradient2597"
       gradientUnits="userSpaceOnUse"
       gradientTransform="matrix(37.758633,0,0,19.739207,-7268.8978,-1304.0032)"
       cx="197.71869"
       cy="68.10688"
       fx="197.71869"
       fy="68.10688"
       r="2.5002501" />
    <radialGradient
       inkscape:collect="always"
       xlink:href="#linearGradient6142"
       id="radialGradient2609"
       gradientUnits="userSpaceOnUse"
       gradientTransform="matrix(37.758633,0,0,19.739207,-7375.6658,-1304.0032)"
       cx="197.74678"
       cy="69.253197"
       fx="197.74678"
       fy="69.253197"
       r="2.5002501" />
    <radialGradient
       inkscape:collect="always"
       xlink:href="#linearGradient1349"
       id="radialGradient2617"
       gradientUnits="userSpaceOnUse"
       gradientTransform="matrix(0.98254044,0,0,0.98254044,-1.7118745,16.291632)"
       cx="81.936386"
       cy="33.185158"
       fx="81.936386"
       fy="33.185158"
       r="57.27565" />
    <radialGradient
       inkscape:collect="always"
       xlink:href="#linearGradient5980"
       id="radialGradient2625"
       gradientUnits="userSpaceOnUse"
       gradientTransform="matrix(3.9332251,-7.2858454e-7,6.4450347e-7,3.4793176,-222.92515,-173.5546)"
       cx="76"
       cy="65.976921"
       fx="76"
       fy="65.976921"
       r="13.220703" />
    <radialGradient
       inkscape:collect="always"
       xlink:href="#linearGradient4117"
       id="radialGradient2633"
       gradientUnits="userSpaceOnUse"
       gradientTransform="matrix(2.8150539,0.01105706,-0.01047197,2.6660925,-242.35997,-102.50318)"
       cx="134.30902"
       cy="55.279427"
       fx="134.30902"
       fy="55.279427"
       r="58.46003" />
    <radialGradient
       inkscape:collect="always"
       xlink:href="#linearGradient5477"
       id="radialGradient2643"
       gradientUnits="userSpaceOnUse"
       gradientTransform="matrix(4.9005487,0.15042804,-0.2360238,7.6890319,-638.53531,-2206.8466)"
       cx="183.52466"
       cy="320.79443"
       fx="183.52466"
       fy="320.79443"
       r="20.486324" />
    <radialGradient
       inkscape:collect="always"
       xlink:href="#linearGradient6142"
       id="radialGradient2655"
       gradientUnits="userSpaceOnUse"
       gradientTransform="matrix(37.758633,0,0,19.739207,-7268.8978,-1304.0032)"
       cx="197.71869"
       cy="68.10688"
       fx="197.71869"
       fy="68.10688"
       r="2.5002501" />
    <radialGradient
       inkscape:collect="always"
       xlink:href="#linearGradient6142"
       id="radialGradient2667"
       gradientUnits="userSpaceOnUse"
       gradientTransform="matrix(37.758633,0,0,19.739207,-7375.6658,-1304.0032)"
       cx="197.74678"
       cy="69.253197"
       fx="197.74678"
       fy="69.253197"
       r="2.5002501" />
    <linearGradient
       inkscape:collect="always"
       xlink:href="#linearGradient1259"
       id="linearGradient3782"
       gradientUnits="userSpaceOnUse"
       gradientTransform="matrix(0.25,0,0,0.25,-40,197)"
       x1="352"
       y1="120"
       x2="416"
       y2="120" />
    <linearGradient
       inkscape:collect="always"
       xlink:href="#linearGradient1757"
       id="linearGradient3786"
       gradientUnits="userSpaceOnUse"
       gradientTransform="matrix(-1,0,0,1,128,0)"
       x1="64"
       y1="247"
       x2="116"
       y2="247" />
    <linearGradient
       inkscape:collect="always"
       xlink:href="#linearGradient1155"
       id="linearGradient1157"
       x1="-142"
       y1="269"
       x2="-128"
       y2="269"
       gradientUnits="userSpaceOnUse"
       gradientTransform="matrix(0.85714285,0,0,0.85714285,167.71428,39.428572)" />
    <linearGradient
       inkscape:collect="always"
       xlink:href="#linearGradient1167"
       id="linearGradient1169"
       x1="187.24197"
       y1="398.63806"
       x2="187.24197"
       y2="250.85977"
       gradientUnits="userSpaceOnUse" />
    <linearGradient
       inkscape:collect="always"
       xlink:href="#linearGradient1273"
       id="linearGradient1275"
       x1="24.982405"
       y1="227.23322"
       x2="91.738335"
       y2="227.23322"
       gradientUnits="userSpaceOnUse" />
    <radialGradient
       inkscape:collect="always"
       xlink:href="#linearGradient1298"
       id="radialGradient1300"
       cx="95.944336"
       cy="252.9541"
       fx="95.944336"
       fy="252.9541"
       r="3"
       gradientUnits="userSpaceOnUse"
       gradientTransform="matrix(1.6772461,0,0,1.6772461,-64.977927,-171.31218)" />
  </defs>
  <sodipodi:namedview
     stroke="#ef2929"
     fill="#f57900"
     id="base"
     pagecolor="#ffffff"
     bordercolor="#666666"
     borderopacity="0.25490196"
     inkscape:pageopacity="0.0"
     inkscape:pageshadow="2"
     inkscape:zoom="2.8284271"
     inkscape:cx="-16.018274"
     inkscape:cy="11.797527"
     inkscape:current-layer="layer9"
     showgrid="false"
     inkscape:grid-bbox="true"
     inkscape:document-units="px"
     inkscape:showpageshadow="false"
     inkscape:window-width="1920"
     inkscape:window-height="1016"
     inkscape:window-x="0"
     inkscape:window-y="27"
     width="400px"
     height="300px"
     inkscape:snap-nodes="true"
     inkscape:snap-bbox="true"
     objecttolerance="7"
     gridtolerance="12"
     guidetolerance="13"
     inkscape:window-maximized="1"
     inkscape:pagecheckerboard="false"
     showguides="false"
     inkscape:guide-bbox="true"
     inkscape:locked="false"
     inkscape:measure-start="0,0"
     inkscape:measure-end="0,0"
     inkscape:object-nodes="true"
     inkscape:bbox-nodes="true"
     inkscape:snap-global="true"
     inkscape:object-paths="true"
     inkscape:snap-intersection-paths="true"
     inkscape:snap-bbox-edge-midpoints="true"
     inkscape:snap-bbox-midpoints="true"
     showborder="true"
     inkscape:snap-center="true"
     inkscape:snap-object-midpoints="true"
     inkscape:snap-midpoints="true"
     inkscape:snap-smooth-nodes="true"
     inkscape:snap-text-baseline="true"
     borderlayer="true"
     inkscape:document-rotation="0">
    <inkscape:grid
       type="xygrid"
       id="grid5883"
       spacingx="2"
       spacingy="2"
       enabled="true"
       visible="true"
       empspacing="4"
       originx="8"
       originy="8" />
    <sodipodi:guide
       position="72,16"
       orientation="0,1"
       id="guide1073"
       inkscape:locked="false"
       inkscape:label=""
       inkscape:color="rgb(0,0,255)" />
    <sodipodi:guide
       position="20,72"
       orientation="1,0"
       id="guide1075"
       inkscape:locked="false"
       inkscape:label=""
       inkscape:color="rgb(0,0,255)" />
    <sodipodi:guide
       position="72,112"
       orientation="0,1"
       id="guide1099"
       inkscape:locked="false"
       inkscape:label=""
       inkscape:color="rgb(0,0,255)" />
    <sodipodi:guide
       position="72,136"
       orientation="0,1"
       id="guide993"
       inkscape:locked="false"
       inkscape:label=""
       inkscape:color="rgb(0,0,255)" />
    <sodipodi:guide
       position="112,72"
       orientation="1,0"
       id="guide995"
       inkscape:locked="false"
       inkscape:label=""
       inkscape:color="rgb(0,0,255)" />
    <sodipodi:guide
       position="8.0000001,72"
       orientation="1,0"
       id="guide867"
       inkscape:locked="false"
       inkscape:label=""
       inkscape:color="rgb(0,0,255)" />
    <sodipodi:guide
       position="128,72"
       orientation="1,0"
       id="guide869"
       inkscape:locked="false"
       inkscape:label=""
       inkscape:color="rgb(0,0,255)" />
    <sodipodi:guide
       position="72,124"
       orientation="0,1"
       id="guide871"
       inkscape:locked="false"
       inkscape:label=""
       inkscape:color="rgb(0,0,255)" />
    <inkscape:grid
       type="xygrid"
       id="grid873"
       spacingx="1"
       spacingy="1"
       empspacing="8"
       color="#000000"
       opacity="0.49019608"
       empcolor="#000000"
       empopacity="0.08627451"
       dotted="true"
       originx="8"
       originy="8" />
    <sodipodi:guide
       position="32,72"
       orientation="1,0"
       id="guide877"
       inkscape:locked="false"
       inkscape:label=""
       inkscape:color="rgb(0,0,255)" />
    <sodipodi:guide
       position="124,72"
       orientation="1,0"
       id="guide879"
       inkscape:locked="false"
       inkscape:label=""
       inkscape:color="rgb(0,0,255)" />
    <sodipodi:guide
       position="72,128"
       orientation="0,1"
       id="guide881"
       inkscape:locked="false"
       inkscape:label=""
       inkscape:color="rgb(0,0,255)" />
    <sodipodi:guide
       position="72,20"
       orientation="0,1"
       id="guide883"
       inkscape:locked="false"
       inkscape:label=""
       inkscape:color="rgb(0,0,255)" />
    <sodipodi:guide
       position="16,72"
       orientation="1,0"
       id="guide885"
       inkscape:locked="false"
       inkscape:label=""
       inkscape:color="rgb(0,0,255)" />
    <sodipodi:guide
       position="136,72"
       orientation="1,0"
       id="guide887"
       inkscape:locked="false"
       inkscape:label=""
       inkscape:color="rgb(0,0,255)" />
    <sodipodi:guide
       position="72,8"
       orientation="0,1"
       id="guide897"
       inkscape:locked="false"
       inkscape:label=""
       inkscape:color="rgb(0,0,255)" />
    <sodipodi:guide
       position="72,32"
       orientation="0,1"
       id="guide899"
       inkscape:locked="false"
       inkscape:label=""
       inkscape:color="rgb(0,0,255)" />
    <sodipodi:guide
       position="264,264"
       orientation="-0.70710678,0.70710678"
       id="guide950"
       inkscape:locked="false"
       inkscape:label=""
       inkscape:color="rgb(0,0,255)" />
    <sodipodi:guide
       position="72,72"
       orientation="0.70710678,0.70710678"
       id="guide952"
       inkscape:locked="false"
       inkscape:label=""
       inkscape:color="rgb(0,0,255)" />
  </sodipodi:namedview>
  <metadata
     id="metadata4">
    <rdf:RDF>
      <cc:Work
         rdf:about="">
        <dc:format>image/svg+xml</dc:format>
        <dc:type
           rdf:resource="http://purl.org/dc/dcmitype/StillImage" />
        <dc:creator>
          <cc:Agent>
            <dc:title>GNOME Design Team</dc:title>
          </cc:Agent>
        </dc:creator>
        <dc:source />
        <cc:license
           rdf:resource="http://creativecommons.org/licenses/by-sa/4.0/" />
        <dc:title>Adwaita Icon Template</dc:title>
        <dc:subject>
          <rdf:Bag />
        </dc:subject>
        <dc:date />
        <dc:rights>
          <cc:Agent>
            <dc:title />
          </cc:Agent>
        </dc:rights>
        <dc:publisher>
          <cc:Agent>
            <dc:title />
          </cc:Agent>
        </dc:publisher>
        <dc:identifier />
        <dc:relation />
        <dc:language />
        <dc:coverage />
        <dc:description />
        <dc:contributor>
          <cc:Agent>
            <dc:title />
          </cc:Agent>
        </dc:contributor>
      </cc:Work>
      <cc:License
         rdf:about="http://creativecommons.org/licenses/by-sa/4.0/">
        <cc:permits
           rdf:resource="http://creativecommons.org/ns#Reproduction" />
        <cc:permits
           rdf:resource="http://creativecommons.org/ns#Distribution" />
        <cc:requires
           rdf:resource="http://creativecommons.org/ns#Notice" />
        <cc:requires
           rdf:resource="http://creativecommons.org/ns#Attribution" />
        <cc:permits
           rdf:resource="http://creativecommons.org/ns#DerivativeWorks" />
        <cc:requires
           rdf:resource="http://creativecommons.org/ns#ShareAlike" />
      </cc:License>
    </rdf:RDF>
  </metadata>
  <g
     id="layer1"
     inkscape:label="App Icon"
     inkscape:groupmode="layer"
     style="display:inline"
     transform="translate(8,-156)">
    <g
       inkscape:groupmode="layer"
       id="layer4"
       inkscape:label="template"
       style="display:inline"
       sodipodi:insensitive="true">
      <rect
         inkscape:label="0"
         y="172"
         x="9.2651362e-08"
         height="128"
         width="128"
         id="hicolor"
         style="display:inline;overflow:visible;visibility:visible;fill:#f0f0f0;fill-opacity:0;fill-rule:nonzero;stroke:none;stroke-width:0.5;marker:none;enable-background:accumulate" />
      <rect
         style="display:inline;overflow:visible;visibility:visible;fill:#f0f0f0;fill-opacity:0;fill-rule:nonzero;stroke:none;stroke-width:0.5;marker:none;enable-background:accumulate"
         id="symbolic"
         width="16"
         height="16"
         x="160"
         y="172"
         inkscape:label="0" />
    </g>
    <g
       inkscape:groupmode="layer"
       id="layer2"
       inkscape:label="baseplate"
       style="display:inline"
       sodipodi:insensitive="true">
      <g
         style="display:inline;fill:#000000;enable-background:new"
         transform="matrix(7.9911709,0,0,8.0036407,-167.7909,-4846.0776)"
         id="g12027"
         inkscape:export-xdpi="12"
         inkscape:export-ydpi="12" />
      <rect
         style="display:inline;overflow:visible;visibility:visible;fill:#f0f0f0;fill-opacity:1;fill-rule:nonzero;stroke:none;stroke-width:0.5;marker:none;enable-background:accumulate"
         id="128"
         width="128"
         height="128"
         x="9.2651362e-08"
         y="172"
         inkscape:label="0" />
      <g
         id="g883"
         style="fill:none;fill-opacity:0.25098;stroke:#a579b3;stroke-opacity:1"
         transform="translate(-24,24)" />
      <g
         id="g900"
         style="fill:none;fill-opacity:0.25098;stroke:#a579b3;stroke-opacity:1"
         transform="translate(-24,24)" />
      <rect
         inkscape:label=""
         y="172"
         x="160"
         height="16"
         width="16"
         id="16"
         style="display:inline;overflow:visible;visibility:visible;fill:#f0f0f0;fill-opacity:1;fill-rule:nonzero;stroke:none;stroke-width:0.5;marker:none;enable-background:accumulate" />
      <text
         xml:space="preserve"
         style="font-style:normal;font-variant:normal;font-weight:bold;font-stretch:normal;font-size:4px;line-height:125%;font-family:Cantarell;-inkscape-font-specification:'Cantarell, Bold';text-align:start;writing-mode:lr-tb;text-anchor:start;display:inline;fill:#000000;fill-opacity:1;stroke:none;stroke-width:0.332649;enable-background:new"
         x="0"
         y="167"
         id="text863"
         inkscape:label="icon-name"><tspan
           style="font-size:4px;stroke-width:0.332649"
           sodipodi:role="line"
           id="tspan861"
           x="0"
           y="167">Hicolor</tspan></text>
      <text
         inkscape:label="icon-name"
         id="text867"
         y="167"
         x="160"
         style="font-style:normal;font-variant:normal;font-weight:bold;font-stretch:normal;font-size:4px;line-height:125%;font-family:Cantarell;-inkscape-font-specification:'Cantarell, Bold';text-align:start;writing-mode:lr-tb;text-anchor:start;display:inline;fill:#000000;fill-opacity:1;stroke:none;stroke-width:0.332649;enable-background:new"
         xml:space="preserve"><tspan
           y="167"
           x="160"
           id="tspan865"
           sodipodi:role="line"
           style="font-size:4px;stroke-width:0.332649">Symbolic</tspan></text>
    </g>
    <g
       inkscape:groupmode="layer"
       id="layer9"
       inkscape:label="icons"
       style="display:inline">
      <path
         style="display:inline;fill:#c64600;fill-opacity:1;stroke:none;stroke-width:6;stroke-linecap:butt;stroke-linejoin:miter;stroke-miterlimit:4;stroke-dasharray:none;stroke-dashoffset:0;stroke-opacity:1;marker:none;marker-start:none;marker-mid:none;marker-end:none;paint-order:normal;enable-background:new"
         d="m 16,212 c -4.432,0 -8,3.568 -8,8 v 60 c 0,4.432 3.568,8 8,8 h 96 c 4.432,0 8,-3.568 8,-8 v -60 c 0,-4.432 -3.568,-8 -8,-8 z"
         id="path2584"
         inkscape:connector-curvature="0"
         sodipodi:nodetypes="cssccsscc" />
      <path
         style="display:inline;fill:url(#linearGradient2634);fill-opacity:1;stroke:none;stroke-width:6;stroke-linecap:butt;stroke-linejoin:miter;stroke-miterlimit:4;stroke-dasharray:none;stroke-dashoffset:0;stroke-opacity:1;marker:none;marker-start:none;marker-mid:none;marker-end:none;paint-order:normal;enable-background:new"
         d="m 60,208 v 78 h 52 c 4.432,0 8,-3.568 8,-8 v -61.64645 c 0,-4.432 -3.568,-8 -8,-8 z"
         id="path2586"
         inkscape:connector-curvature="0"
         sodipodi:nodetypes="cccsscc" />
      <path
         style="display:inline;fill:url(#linearGradient2636);fill-opacity:1;stroke:none;stroke-width:6;stroke-linecap:butt;stroke-linejoin:miter;stroke-miterlimit:4;stroke-dasharray:none;stroke-dashoffset:0;stroke-opacity:1;marker:none;marker-start:none;marker-mid:none;marker-end:none;paint-order:normal;enable-background:new"
         d="m 60,200 v 86 H 16 c -4.432,0 -8,-3.568 -8,-8 v -70 c 0,-4.432 3.568,-8 8,-8 z"
         id="path2588"
         inkscape:connector-curvature="0"
         sodipodi:nodetypes="cccsscc" />
      <path
         style="display:inline;fill:url(#linearGradient3786);fill-opacity:1;stroke:none;stroke-width:6;stroke-linecap:butt;stroke-linejoin:miter;stroke-miterlimit:4;stroke-dasharray:none;stroke-dashoffset:0;stroke-opacity:1;marker:none;marker-start:none;marker-mid:none;marker-end:none;paint-order:normal;enable-background:new"
         d="m 68,208 v 78 H 16 c -4.432,0 -8,-3.568 -8,-8 v -61.64645 c 0,-4.432 3.568,-8 8,-8 z"
         id="path3784"
         inkscape:connector-curvature="0"
         sodipodi:nodetypes="cccsscc" />
      <path
         sodipodi:nodetypes="sscssssss"
         inkscape:connector-curvature="0"
         style="display:inline;fill:url(#linearGradient2638);fill-opacity:1;stroke:none;stroke-width:6;stroke-linecap:butt;stroke-linejoin:miter;stroke-miterlimit:4;stroke-dasharray:none;stroke-dashoffset:0;stroke-opacity:1;marker:none;marker-start:none;marker-mid:none;marker-end:none;paint-order:normal;enable-background:new"
         d="m 72,192 c -4.432,0 -8,3.56799 -8,8 v 86 c 0,-4.432 3.568,-8 8,-8 h 40 c 4.432,0 8,-3.568 8,-8 v -70 c 0,-4.432 -3.568,-8 -8,-8 z"
         id="path2590" />
      <path
         sodipodi:nodetypes="sscssssss"
         inkscape:connector-curvature="0"
         style="display:inline;fill:url(#linearGradient3782);fill-opacity:1;stroke:none;stroke-width:6;stroke-linecap:butt;stroke-linejoin:miter;stroke-miterlimit:4;stroke-dasharray:none;stroke-dashoffset:0;stroke-opacity:1;marker:none;marker-start:none;marker-mid:none;marker-end:none;paint-order:normal;enable-background:new"
         d="m 56,192 c 4.432,0 8,3.56799 8,8 v 86 c 0,-4.432 -3.568,-8 -8,-8 H 16 c -4.432,0 -8,-3.568 -8,-8 v -70 c 0,-4.432 3.568,-8 8,-8 z"
         id="path3780" />
      <g
         id="g3778"
         transform="matrix(1.0186361,0,0,1.0186361,4.55202,-29.467959)">
        <path
           style="color:#000000;font-style:normal;font-variant:normal;font-weight:normal;font-stretch:normal;font-size:medium;line-height:normal;font-family:sans-serif;font-variant-ligatures:normal;font-variant-position:normal;font-variant-caps:normal;font-variant-numeric:normal;font-variant-alternates:normal;font-feature-settings:normal;text-indent:0;text-align:start;text-decoration:none;text-decoration-line:none;text-decoration-style:solid;text-decoration-color:#000000;letter-spacing:normal;word-spacing:normal;text-transform:none;writing-mode:lr-tb;direction:ltr;text-orientation:mixed;dominant-baseline:auto;baseline-shift:baseline;text-anchor:start;white-space:normal;shape-padding:0;clip-rule:nonzero;display:inline;overflow:visible;visibility:visible;opacity:1;isolation:auto;mix-blend-mode:normal;color-interpolation:sRGB;color-interpolation-filters:linearRGB;solid-color:#000000;solid-opacity:1;vector-effect:none;fill:url(#linearGradient1275);fill-opacity:1;fill-rule:nonzero;stroke:none;stroke-width:4.27735;stroke-linecap:butt;stroke-linejoin:bevel;stroke-miterlimit:4;stroke-dasharray:none;stroke-dashoffset:0;stroke-opacity:1;marker:none;paint-order:normal;color-rendering:auto;image-rendering:auto;shape-rendering:auto;text-rendering:auto;enable-background:accumulate"
           d="m 58.357497,203.95851 c -12.19134,0 -23.67749,4.34299 -30.80714,13.7454 -1.52051,2.0092 -2.356,6.90701 0.75358,8.70232 l 2.55782,1.41558 c 0.9075,0.52369 2.0677,0.21282 2.59177,-0.69446 5.14046,-8.90355 14.34992,-15.3314 24.90397,-15.3314 10.55405,0 19.76398,6.42789 24.90442,15.3314 0.52407,0.90728 1.68428,1.21816 2.59177,0.69446 l 2.41097,-1.22739 c 3.65442,-2.10989 1.96478,-7.03237 1.0149,-8.67762 -7.11444,-9.53625 -18.65001,-13.95829 -30.92206,-13.95829 z"
           id="path5655"
           inkscape:connector-curvature="0"
           sodipodi:nodetypes="sccccsccccs" />
        <path
           style="display:inline;opacity:1;vector-effect:none;fill:none;fill-opacity:1;stroke:#77767b;stroke-width:2.13867;stroke-linecap:butt;stroke-linejoin:bevel;stroke-miterlimit:4;stroke-dasharray:none;stroke-dashoffset:0;stroke-opacity:1;marker:none;marker-start:none;marker-mid:none;marker-end:none;paint-order:normal;enable-background:new"
           id="path1307"
           sodipodi:type="arc"
           sodipodi:cx="58.310497"
           sodipodi:cy="239.25703"
           sodipodi:rx="31.455278"
           sodipodi:ry="31.455278"
           sodipodi:start="3.1415927"
           sodipodi:end="0"
           sodipodi:arc-type="arc"
           sodipodi:open="true"
           d="m 26.855219,239.25703 a 31.455278,31.455278 0 0 1 31.455278,-31.45527 31.455278,31.455278 0 0 1 31.455279,31.45527" />
        <path
           style="display:inline;opacity:1;vector-effect:none;fill:none;fill-opacity:1;stroke:#70727b;stroke-width:2.13867;stroke-linecap:butt;stroke-linejoin:bevel;stroke-miterlimit:4;stroke-dasharray:none;stroke-dashoffset:0;stroke-opacity:1;marker:none;marker-start:none;marker-mid:none;marker-end:none;paint-order:normal;enable-background:new"
           d="m 89.774927,239.1058 v 16.0301"
           id="path1309"
           inkscape:connector-curvature="0" />
        <path
           inkscape:connector-curvature="0"
           id="path1311"
           d="m 26.844367,239.1058 v 16.0301"
           style="display:inline;opacity:1;vector-effect:none;fill:none;fill-opacity:1;stroke:#70727b;stroke-width:2.13867;stroke-linecap:butt;stroke-linejoin:bevel;stroke-miterlimit:4;stroke-dasharray:none;stroke-dashoffset:0;stroke-opacity:1;marker:none;marker-start:none;marker-mid:none;marker-end:none;paint-order:normal;enable-background:new" />
        <path
           style="color:#000000;font-style:normal;font-variant:normal;font-weight:normal;font-stretch:normal;font-size:medium;line-height:normal;font-family:sans-serif;font-variant-ligatures:normal;font-variant-position:normal;font-variant-caps:normal;font-variant-numeric:normal;font-variant-alternates:normal;font-feature-settings:normal;text-indent:0;text-align:start;text-decoration:none;text-decoration-line:none;text-decoration-style:solid;text-decoration-color:#000000;letter-spacing:normal;word-spacing:normal;text-transform:none;writing-mode:lr-tb;direction:ltr;text-orientation:mixed;dominant-baseline:auto;baseline-shift:baseline;text-anchor:start;white-space:normal;shape-padding:0;clip-rule:nonzero;display:inline;overflow:visible;visibility:visible;opacity:1;isolation:auto;mix-blend-mode:normal;color-interpolation:sRGB;color-interpolation-filters:linearRGB;solid-color:#000000;solid-opacity:1;vector-effect:none;fill:#c64600;fill-opacity:1;fill-rule:nonzero;stroke:none;stroke-width:4.27735;stroke-linecap:butt;stroke-linejoin:bevel;stroke-miterlimit:4;stroke-dasharray:none;stroke-dashoffset:0;stroke-opacity:1;marker:none;paint-order:normal;color-rendering:auto;image-rendering:auto;shape-rendering:auto;text-rendering:auto;enable-background:accumulate"
           d="m 81.445667,219.92613 c 1.78102,2.14473 3.29837,4.51668 4.4958,7.06945 0.57522,-0.5132 1.3432,-0.92855 2.11496,-1.09357 -1.00014,-2.11784 -2.20976,-4.11634 -3.59592,-5.97588 z"
           id="path5632"
           inkscape:connector-curvature="0" />
        <path
           id="path5653"
           d="m 35.373177,219.58711 c -1.84237,2.21859 -3.41198,4.67223 -4.65065,7.31293 -0.59503,-0.53087 -1.38947,-0.96053 -2.18781,-1.13124 1.03459,-2.19078 2.28587,-4.25811 3.71978,-6.18169 z"
           style="color:#000000;font-style:normal;font-variant:normal;font-weight:normal;font-stretch:normal;font-size:medium;line-height:normal;font-family:sans-serif;font-variant-ligatures:normal;font-variant-position:normal;font-variant-caps:normal;font-variant-numeric:normal;font-variant-alternates:normal;font-feature-settings:normal;text-indent:0;text-align:start;text-decoration:none;text-decoration-line:none;text-decoration-style:solid;text-decoration-color:#000000;letter-spacing:normal;word-spacing:normal;text-transform:none;writing-mode:lr-tb;direction:ltr;text-orientation:mixed;dominant-baseline:auto;baseline-shift:baseline;text-anchor:start;white-space:normal;shape-padding:0;clip-rule:nonzero;display:inline;overflow:visible;visibility:visible;opacity:1;isolation:auto;mix-blend-mode:normal;color-interpolation:sRGB;color-interpolation-filters:linearRGB;solid-color:#000000;solid-opacity:1;vector-effect:none;fill:#c64600;fill-opacity:1;fill-rule:nonzero;stroke:none;stroke-width:4.27735;stroke-linecap:butt;stroke-linejoin:bevel;stroke-miterlimit:4;stroke-dasharray:none;stroke-dashoffset:0;stroke-opacity:1;marker:none;paint-order:normal;color-rendering:auto;image-rendering:auto;shape-rendering:auto;text-rendering:auto;enable-background:accumulate"
           inkscape:connector-curvature="0" />
        <path
           style="color:#000000;font-style:normal;font-variant:normal;font-weight:normal;font-stretch:normal;font-size:medium;line-height:normal;font-family:sans-serif;font-variant-ligatures:normal;font-variant-position:normal;font-variant-caps:normal;font-variant-numeric:normal;font-variant-alternates:normal;font-feature-settings:normal;text-indent:0;text-align:start;text-decoration:none;text-decoration-line:none;text-decoration-style:solid;text-decoration-color:#000000;letter-spacing:normal;word-spacing:normal;text-transform:none;writing-mode:lr-tb;direction:ltr;text-orientation:mixed;dominant-baseline:auto;baseline-shift:baseline;text-anchor:start;white-space:normal;shape-padding:0;clip-rule:nonzero;display:inline;overflow:visible;visibility:visible;opacity:1;isolation:auto;mix-blend-mode:normal;color-interpolation:sRGB;color-interpolation-filters:linearRGB;solid-color:#000000;solid-opacity:1;vector-effect:none;fill:#ff7800;fill-opacity:1;fill-rule:nonzero;stroke:none;stroke-width:4.27735;stroke-linecap:butt;stroke-linejoin:bevel;stroke-miterlimit:4;stroke-dasharray:none;stroke-dashoffset:0;stroke-opacity:1;marker:none;paint-order:normal;color-rendering:auto;image-rendering:auto;shape-rendering:auto;text-rendering:auto;enable-background:accumulate"
           d="m 58.357497,201.79734 c -12.04226,0 -23.28466,5.70697 -30.40663,15.20367 0,0 -3.41322,5.52679 0.82729,7.97507 l 1.35312,0.78124 c 0.93161,0.53761 2.12264,0.21847 2.66063,-0.71291 5.27703,-9.14008 15.01154,-14.76033 25.56559,-14.76033 10.55405,0 20.28904,5.62029 25.56604,14.76033 0.53799,0.93139 1.72902,1.25052 2.66063,0.71291 l 1.39246,-0.80395 c 4.05553,-2.19466 0.77928,-7.96389 0.77928,-7.96389 -7.12249,-9.48981 -18.36101,-15.19214 -30.39841,-15.19214 z"
           id="path1318"
           inkscape:connector-curvature="0"
           sodipodi:nodetypes="sccccsccccs" />
        <path
           inkscape:connector-curvature="0"
           style="color:#000000;font-style:normal;font-variant:normal;font-weight:normal;font-stretch:normal;font-size:medium;line-height:normal;font-family:sans-serif;font-variant-ligatures:normal;font-variant-position:normal;font-variant-caps:normal;font-variant-numeric:normal;font-variant-alternates:normal;font-feature-settings:normal;text-indent:0;text-align:start;text-decoration:none;text-decoration-line:none;text-decoration-style:solid;text-decoration-color:#000000;letter-spacing:normal;word-spacing:normal;text-transform:none;writing-mode:lr-tb;direction:ltr;text-orientation:mixed;dominant-baseline:auto;baseline-shift:baseline;text-anchor:start;white-space:normal;shape-padding:0;clip-rule:nonzero;display:inline;overflow:visible;visibility:visible;opacity:1;isolation:auto;mix-blend-mode:normal;color-interpolation:sRGB;color-interpolation-filters:linearRGB;solid-color:#000000;solid-opacity:1;vector-effect:none;fill:#e66100;fill-opacity:1;fill-rule:nonzero;stroke:none;stroke-width:4.27735;stroke-linecap:butt;stroke-linejoin:bevel;stroke-miterlimit:4;stroke-dasharray:none;stroke-dashoffset:0;stroke-opacity:1;marker:none;paint-order:normal;color-rendering:auto;image-rendering:auto;shape-rendering:auto;text-rendering:auto;enable-background:accumulate"
           d="m 58.357497,206.88499 c -14.33638,5e-5 -23.32714,7.39084 -29.3857,17.88457 -0.0456,0.0803 -0.0847,0.16412 -0.11702,0.25064 l 1.2765,0.73712 c 0.93161,0.53761 2.12264,0.21848 2.66063,-0.71291 5.27703,-9.14008 15.01154,-14.76033 25.56559,-14.76033 10.55405,0 20.28904,5.62029 25.56604,14.76033 0.53799,0.93139 1.72902,1.25052 2.66063,0.71291 l 1.2774,-0.73757 c -0.0326,-0.0864 -0.072,-0.17005 -0.11792,-0.25019 -6.05858,-10.49376 -15.04977,-17.88462 -29.38615,-17.88457 z"
           id="path1328"
           sodipodi:nodetypes="zccccsccccz" />
        <g
           id="g1303"
           style="display:inline;opacity:1;enable-background:new"
           transform="matrix(0.21386769,0,0,0.21386769,-2.0292034,246.73547)">
          <circle
             r="57.27565"
             cy="70.897392"
             cx="118.79394"
             id="path1278"
             style="opacity:1;vector-effect:none;fill:#3d3846;fill-opacity:1;stroke:none;stroke-width:1;stroke-linecap:butt;stroke-linejoin:bevel;stroke-miterlimit:4;stroke-dasharray:none;stroke-dashoffset:0;stroke-opacity:1;marker:none;marker-start:none;marker-mid:none;marker-end:none;paint-order:normal" />
          <path
             inkscape:connector-curvature="0"
             style="display:inline;opacity:1;vector-effect:none;fill:#241f31;fill-opacity:1;stroke:none;stroke-width:20;stroke-linecap:butt;stroke-linejoin:bevel;stroke-miterlimit:4;stroke-dasharray:none;stroke-dashoffset:0;stroke-opacity:1;marker:none;marker-start:none;marker-mid:none;marker-end:none;paint-order:normal;enable-background:new"
             d="M 86.029297,24.00195 A 57.27565,57.27565 0 0 0 84.099609,25.38086 2,2 0 0 0 83.999999,26 a 2,2 0 0 0 2,2 2,2 0 0 0 2,-2 2,2 0 0 0 -1.970702,-1.99805 z M 82,28 a 2,2 0 0 0 -2,2 2,2 0 0 0 2,2 2,2 0 0 0 2,-2 2,2 0 0 0 -2,-2 z m -4,4 a 2,2 0 0 0 -2,2 2,2 0 0 0 2,2 2,2 0 0 0 2,-2 2,2 0 0 0 -2,-2 z m 8,0 a 2,2 0 0 0 -2,2 2,2 0 0 0 2,2 2,2 0 0 0 2,-2 2,2 0 0 0 -2,-2 z m -12,4 a 2,2 0 0 0 -0.607422,0.0977 57.27565,57.27565 0 0 0 -1.388672,1.82422 2,2 0 0 0 -0.0039,0.0781 2,2 0 0 0 2,2 2,2 0 0 0 2,-2 2,2 0 0 0 -2,-2 z m 8,0 a 2,2 0 0 0 -2,2 2,2 0 0 0 2,2 2,2 0 0 0 2,-2 2,2 0 0 0 -2,-2 z m -4,4 a 2,2 0 0 0 -2,2 2,2 0 0 0 2,2 2,2 0 0 0 2,-2 2,2 0 0 0 -2,-2 z m 8,0 a 2,2 0 0 0 -2,2 2,2 0 0 0 2,2 2,2 0 0 0 2,-2 2,2 0 0 0 -2,-2 z M 70.582031,40.0879 A 57.27565,57.27565 0 0 0 68.560547,43.38672 2,2 0 0 0 70,44 2,2 0 0 0 72,42 2,2 0 0 0 70.582031,40.08789 Z M 74,44 a 2,2 0 0 0 -2,2 2,2 0 0 0 2,2 2,2 0 0 0 2,-2 2,2 0 0 0 -2,-2 z m 8,0 a 2,2 0 0 0 -2,2 2,2 0 0 0 2,2 2,2 0 0 0 2,-2 2,2 0 0 0 -2,-2 z M 67.753906,45.04297 A 57.27565,57.27565 0 0 0 66.339844,47.9707 2,2 0 0 0 68,46 2,2 0 0 0 67.753906,45.04297 Z M 70,48 a 2,2 0 0 0 -2,2 2,2 0 0 0 2,2 2,2 0 0 0 2,-2 2,2 0 0 0 -2,-2 z m 8,0 a 2,2 0 0 0 -2,2 2,2 0 0 0 2,2 2,2 0 0 0 2,-2 2,2 0 0 0 -2,-2 z m 8,0 a 2,2 0 0 0 -2,2 2,2 0 0 0 2,2 2,2 0 0 0 2,-2 2,2 0 0 0 -2,-2 z M 66,52 A 2,2 0 0 0 64.578125,52.5957 57.27565,57.27565 0 0 0 64.013672,54.21289 2,2 0 0 0 66,56 2,2 0 0 0 68,54 2,2 0 0 0 66,52 Z m 8,0 a 2,2 0 0 0 -2,2 2,2 0 0 0 2,2 2,2 0 0 0 2,-2 2,2 0 0 0 -2,-2 z m 8,0 a 2,2 0 0 0 -2,2 2,2 0 0 0 2,2 2,2 0 0 0 2,-2 2,2 0 0 0 -2,-2 z m -12,4 a 2,2 0 0 0 -2,2 2,2 0 0 0 2,2 2,2 0 0 0 2,-2 2,2 0 0 0 -2,-2 z m 8,0 a 2,2 0 0 0 -2,2 2,2 0 0 0 2,2 2,2 0 0 0 2,-2 2,2 0 0 0 -2,-2 z m 8,0 a 2,2 0 0 0 -2,2 2,2 0 0 0 2,2 2,2 0 0 0 2,-2 2,2 0 0 0 -2,-2 z M 63.410156,56.58203 A 57.27565,57.27565 0 0 0 62.601562,59.9043 2,2 0 0 0 64,58 2,2 0 0 0 63.410156,56.58203 Z M 66,60 a 2,2 0 0 0 -2,2 2,2 0 0 0 2,2 2,2 0 0 0 2,-2 2,2 0 0 0 -2,-2 z m 8,0 a 2,2 0 0 0 -2,2 2,2 0 0 0 2,2 2,2 0 0 0 2,-2 2,2 0 0 0 -2,-2 z m 8,0 a 2,2 0 0 0 -2,2 2,2 0 0 0 2,2 2,2 0 0 0 2,-2 2,2 0 0 0 -2,-2 z M 61.982422,64 A 57.27565,57.27565 0 0 0 61.664062,67.9707 2,2 0 0 0 62,68 2,2 0 0 0 64,66 2,2 0 0 0 62,64 2,2 0 0 0 61.98242,64 Z M 70,64 a 2,2 0 0 0 -2,2 2,2 0 0 0 2,2 2,2 0 0 0 2,-2 2,2 0 0 0 -2,-2 z m 8,0 a 2,2 0 0 0 -2,2 2,2 0 0 0 2,2 2,2 0 0 0 2,-2 2,2 0 0 0 -2,-2 z m 8,0 a 2,2 0 0 0 -2,2 2,2 0 0 0 2,2 2,2 0 0 0 2,-2 2,2 0 0 0 -2,-2 z m -20,4 a 2,2 0 0 0 -2,2 2,2 0 0 0 2,2 2,2 0 0 0 2,-2 2,2 0 0 0 -2,-2 z m 8,0 a 2,2 0 0 0 -2,2 2,2 0 0 0 2,2 2,2 0 0 0 2,-2 2,2 0 0 0 -2,-2 z m 8,0 a 2,2 0 0 0 -2,2 2,2 0 0 0 2,2 2,2 0 0 0 2,-2 2,2 0 0 0 -2,-2 z m -20,4 a 2,2 0 0 0 -0.441406,0.0508 57.27565,57.27565 0 0 0 0.230468,3.9375 A 2,2 0 0 0 62,76 2,2 0 0 0 64,74 2,2 0 0 0 62,72 Z m 8,0 a 2,2 0 0 0 -2,2 2,2 0 0 0 2,2 2,2 0 0 0 2,-2 2,2 0 0 0 -2,-2 z m 8,0 a 2,2 0 0 0 -2,2 2,2 0 0 0 2,2 2,2 0 0 0 2,-2 2,2 0 0 0 -2,-2 z m 8,0 a 2,2 0 0 0 -2,2 2,2 0 0 0 2,2 2,2 0 0 0 2,-2 2,2 0 0 0 -2,-2 z m -20,4 a 2,2 0 0 0 -2,2 2,2 0 0 0 2,2 2,2 0 0 0 2,-2 2,2 0 0 0 -2,-2 z m 8,0 a 2,2 0 0 0 -2,2 2,2 0 0 0 2,2 2,2 0 0 0 2,-2 2,2 0 0 0 -2,-2 z m 8,0 a 2,2 0 0 0 -2,2 2,2 0 0 0 2,2 2,2 0 0 0 2,-2 2,2 0 0 0 -2,-2 z m -12,4 a 2,2 0 0 0 -2,2 2,2 0 0 0 2,2 2,2 0 0 0 2,-2 2,2 0 0 0 -2,-2 z m 8,0 a 2,2 0 0 0 -2,2 2,2 0 0 0 2,2 2,2 0 0 0 2,-2 2,2 0 0 0 -2,-2 z m 8,0 a 2,2 0 0 0 -2,2 2,2 0 0 0 2,2 2,2 0 0 0 2,-2 2,2 0 0 0 -2,-2 z M 62.277344,80.0215 A 57.27565,57.27565 0 0 0 63.041016,83.7051 2,2 0 0 0 64,82 2,2 0 0 0 62.277344,80.02148 Z M 66,84 a 2,2 0 0 0 -2,2 2,2 0 0 0 2,2 2,2 0 0 0 2,-2 2,2 0 0 0 -2,-2 z m 8,0 a 2,2 0 0 0 -2,2 2,2 0 0 0 2,2 2,2 0 0 0 2,-2 2,2 0 0 0 -2,-2 z m 8,0 a 2,2 0 0 0 -2,2 2,2 0 0 0 2,2 2,2 0 0 0 2,-2 2,2 0 0 0 -2,-2 z m -12,4 a 2,2 0 0 0 -2,2 2,2 0 0 0 2,2 2,2 0 0 0 2,-2 2,2 0 0 0 -2,-2 z m 8,0 a 2,2 0 0 0 -2,2 2,2 0 0 0 2,2 2,2 0 0 0 2,-2 2,2 0 0 0 -2,-2 z m 8,0 a 2,2 0 0 0 -2,2 2,2 0 0 0 2,2 2,2 0 0 0 2,-2 2,2 0 0 0 -2,-2 z m -20,4 a 2,2 0 0 0 -0.414062,0.0449 57.27565,57.27565 0 0 0 1.597656,3.56446 A 2,2 0 0 0 68,94 2,2 0 0 0 66,92 Z m 8,0 a 2,2 0 0 0 -2,2 2,2 0 0 0 2,2 2,2 0 0 0 2,-2 2,2 0 0 0 -2,-2 z m 8,0 a 2,2 0 0 0 -2,2 2,2 0 0 0 2,2 2,2 0 0 0 2,-2 2,2 0 0 0 -2,-2 z m -12,4 a 2,2 0 0 0 -1.921875,1.45117 57.27565,57.27565 0 0 0 1.425781,2.48438 2,2 0 0 0 0.496094,0.0644 2,2 0 0 0 2,-2 2,2 0 0 0 -2,-2 z m 8,0 a 2,2 0 0 0 -2,2 2,2 0 0 0 2,2 2,2 0 0 0 2,-2 2,2 0 0 0 -2,-2 z m 8,0 a 2,2 0 0 0 -2,2 2,2 0 0 0 2,2 2,2 0 0 0 2,-2 2,2 0 0 0 -2,-2 z m -12,4 a 2,2 0 0 0 -2,2 2,2 0 0 0 2,2 2,2 0 0 0 2,-2 2,2 0 0 0 -2,-2 z m 8,0 a 2,2 0 0 0 -2,2 2,2 0 0 0 2,2 2,2 0 0 0 2,-2 2,2 0 0 0 -2,-2 z m -4,4 a 2,2 0 0 0 -2,2 2,2 0 0 0 2,2 2,2 0 0 0 2,-2 2,2 0 0 0 -2,-2 z m 8,0 a 2,2 0 0 0 -2,2 2,2 0 0 0 2,2 2,2 0 0 0 2,-2 2,2 0 0 0 -2,-2 z m -4,4 a 2,2 0 0 0 -2,2 2,2 0 0 0 2,2 2,2 0 0 0 2,-2 2,2 0 0 0 -2,-2 z m 4,4 a 2,2 0 0 0 -2,2 2,2 0 0 0 2,2 2,2 0 0 0 2,-2 2,2 0 0 0 -2,-2 z"
             id="circle5826" />
          <path
             sodipodi:nodetypes="cccccccccccccc"
             inkscape:connector-curvature="0"
             id="path1273"
             d="m 143.89446,-22.559683 c -17.10366,-1.33e-4 -34.17727,5.0068 -48.571244,14.2452362 -5.381075,3.4542636 -8.634792,9.409159 -8.634944,15.8035242 V 133.14861 c 1.71e-4,6.3793 3.238704,12.32231 8.599317,15.78054 14.382211,9.27647 31.456921,14.32226 48.571251,14.3544 0.0192,3e-5 0.0383,3e-5 0.0575,0 20.63391,-0.0238 36.9415,-7.41681 52.86126,-20.54389 4.32541,-3.56745 6.83064,-8.88094 6.83073,-14.48771 V 12.452386 c -8e-5,-5.6099262 -2.50809,-10.9260643 -6.83764,-14.493459 -15.92315,-13.11831 -32.23031,-20.501651 -52.86127,-20.51861 h -0.0149 z"
             style="opacity:1;vector-effect:none;fill:url(#radialGradient5900);fill-opacity:1;stroke:none;stroke-width:1;stroke-linecap:butt;stroke-linejoin:bevel;stroke-miterlimit:4;stroke-dasharray:none;stroke-dashoffset:0;stroke-opacity:1;marker:none;marker-start:none;marker-mid:none;marker-end:none;paint-order:normal" />
          <path
             id="path1280"
             transform="translate(0,-260)"
             d="m 162.63477,239.70703 v 181.30469 c 12.37564,-3.11924 23.3504,-9.3725 34.14257,-18.27149 4.32541,-3.56745 6.82999,-8.88151 6.83008,-14.48828 V 272.45312 c -8e-5,-5.60992 -2.50639,-10.92674 -6.83594,-14.49414 -10.79164,-8.8907 -21.76586,-15.13749 -34.13671,-18.25195 z"
             style="opacity:1;vector-effect:none;fill:url(#linearGradient1169);fill-opacity:1;stroke:none;stroke-width:1;stroke-linecap:butt;stroke-linejoin:bevel;stroke-miterlimit:4;stroke-dasharray:none;stroke-dashoffset:0;stroke-opacity:1;marker:none;marker-start:none;marker-mid:none;marker-end:none;paint-order:normal"
             inkscape:connector-curvature="0" />
          <path
             inkscape:connector-curvature="0"
             id="path6614"
             d="m 90.232231,7.75 v 121.5"
             style="opacity:0.187;vector-effect:none;fill:none;fill-opacity:0.252101;stroke:url(#radialGradient6690);stroke-width:5;stroke-linecap:round;stroke-linejoin:bevel;stroke-miterlimit:4;stroke-dasharray:none;stroke-dashoffset:0;stroke-opacity:0.987395;marker:none;marker-start:none;marker-mid:none;marker-end:none;paint-order:normal" />
        </g>
        <use
           x="0"
           y="0"
           xlink:href="#g1303"
           id="use1305"
           transform="matrix(-1,0,0,1,116.80391,-1.9168086e-6)"
           width="100%"
           height="100%"
           style="display:inline;opacity:1;enable-background:new" />
      </g>
      <g
         style="opacity:0.1"
         id="g2618">
        <path
           style="display:inline;fill:#000000;fill-opacity:1;stroke:none;stroke-width:1px;stroke-linecap:butt;stroke-linejoin:miter;stroke-opacity:1;enable-background:new"
           d="M 120,272.6543 C 119.9178,276.74491 116.61929,280 112.50781,280 h -0.5 v 1 h 0.5 c 3.24611,0 6.0601,-1.81286 7.49219,-4.48242 z M 74,280 l 38,1 v -1 z"
           id="path2614"
           inkscape:connector-curvature="0"
           sodipodi:nodetypes="csccscccccc" />
        <path
           style="display:inline;fill:#000000;fill-opacity:1;stroke:none;stroke-width:1px;stroke-linecap:butt;stroke-linejoin:miter;stroke-opacity:1;enable-background:new"
           d="M 120,275.6543 C 119.9178,279.74491 116.61929,283 112.50781,283 h -0.5 v 1 h 0.5 c 3.22393,0 6.02184,-1.7881 7.46289,-4.42773 C 119.9841,279.38252 120,279.19325 120,279 Z M 74,283 l 38,1 v -1 z"
           id="path2616"
           inkscape:connector-curvature="0"
           sodipodi:nodetypes="csccscsccccc" />
      </g>
      <path
         style="font-variation-settings:normal;vector-effect:none;fill:none;fill-opacity:1;stroke:#9a9996;stroke-width:2;stroke-linecap:round;stroke-linejoin:miter;stroke-miterlimit:4;stroke-dasharray:none;stroke-dashoffset:0;stroke-opacity:1;stop-color:#000000"
         d="m 87,273 v -5"
         id="path3847"
         sodipodi:nodetypes="cc" />
      <circle
         style="fill:url(#radialGradient1300);fill-opacity:1;stroke:none;stroke-width:1.99999;stroke-linecap:round;stroke-miterlimit:4;stroke-dasharray:none;stroke-opacity:1;stop-color:#000000"
         id="path1292"
         cx="96"
         cy="254"
         r="3" />
      <path
         style="fill:none;stroke:#c0bfbc;stroke-width:2;stroke-linecap:round;stroke-linejoin:miter;stroke-miterlimit:4;stroke-dasharray:none;stroke-opacity:1"
         d="m 96,254 v 7 a 7,7 135 0 1 -7,7 h -2"
         id="path3788"
         inkscape:path-effect="#path-effect3794"
         inkscape:original-d="m 96,254 v 14 h -9"
         sodipodi:nodetypes="ccc" />
      <circle
         style="fill:url(#linearGradient1157);fill-opacity:1;stroke:none;stroke-width:3.96862;stroke-linecap:round;stroke-miterlimit:4;stroke-dasharray:none;stroke-opacity:1;stop-color:#000000"
         id="path3798"
         cx="52"
         cy="270"
         r="6" />
      <circle
         style="fill:#deddda;fill-opacity:1;stroke:none;stroke-width:3.96862;stroke-linecap:round;stroke-miterlimit:4;stroke-dasharray:none;stroke-opacity:1;stop-color:#000000"
         id="circle3800"
         cx="52"
         cy="268"
         r="6" />
      <rect
         style="fill:#77767b;fill-opacity:1;stroke:none;stroke-width:2.23607;stroke-linecap:round;stroke-miterlimit:4;stroke-dasharray:none;stroke-opacity:1;stop-color:#000000"
         id="rect3802"
         width="8"
         height="18.762985"
         x="48"
         y="253.23701"
         rx="4"
         ry="4" />
      <path
         id="rect3804"
         style="opacity:0.56294;fill:#5e5c64;fill-opacity:1;stroke:none;stroke-width:2.23607;stroke-linecap:round;stroke-miterlimit:4;stroke-dasharray:none;stroke-opacity:1;stop-color:#000000"
         d="m 52,253.23701 c -0.570544,0 -1.109804,0.12249 -1.6,0.33593 1.413731,0.61558 2.4,2.01861 2.4,3.66407 l -0.02689,14.68897 C 54.616643,271.56776 56,269.95137 56,268 l 0,-10.76299 c 0,-2.216 -1.784,-4 -4,-4 z"
         sodipodi:nodetypes="scccsss" />
      <path
         style="fill:none;stroke:#c0bfbc;stroke-width:2;stroke-linecap:round;stroke-linejoin:miter;stroke-miterlimit:4;stroke-dasharray:none;stroke-opacity:1"
         d="m 71,265 v -20 a 9,9 45 0 0 -9,-9 10,10 135 0 0 -10,10 v 8"
         id="path3790"
         inkscape:path-effect="#path-effect3796"
         inkscape:original-d="M 71,265 V 236 H 52 v 18"
         sodipodi:nodetypes="cccc" />
      <path
         style="font-variation-settings:normal;vector-effect:none;fill:none;fill-opacity:1;stroke:#9a9996;stroke-width:2;stroke-linecap:round;stroke-linejoin:miter;stroke-miterlimit:4;stroke-dasharray:none;stroke-dashoffset:0;stroke-opacity:1;stop-color:#000000"
         d="m 83,273 v -8"
         id="path3845" />
      <path
         style="font-variation-settings:normal;vector-effect:none;fill:none;fill-opacity:1;stroke:#c0bfbc;stroke-width:2;stroke-linecap:round;stroke-linejoin:miter;stroke-miterlimit:4;stroke-dasharray:none;stroke-dashoffset:0;stroke-opacity:1;stop-color:#000000"
         d="m 87,273 -4,-8"
         id="path3811"
         sodipodi:nodetypes="cc" />
      <path
         style="font-variation-settings:normal;vector-effect:none;fill:none;fill-opacity:1;stroke:#9a9996;stroke-width:2;stroke-linecap:round;stroke-linejoin:miter;stroke-miterlimit:4;stroke-dasharray:none;stroke-dashoffset:0;stroke-opacity:1;stop-color:#000000"
         d="m 79,273 v -8"
         id="path3843" />
      <path
         style="font-variation-settings:normal;vector-effect:none;fill:none;fill-opacity:1;stroke:#c0bfbc;stroke-width:2;stroke-linecap:round;stroke-linejoin:miter;stroke-miterlimit:4;stroke-dasharray:none;stroke-dashoffset:0;stroke-opacity:1;stop-color:#000000"
         d="m 83,273 -4,-8"
         id="path3829"
         sodipodi:nodetypes="cc" />
      <path
         style="font-variation-settings:normal;vector-effect:none;fill:none;fill-opacity:1;stroke:#9a9996;stroke-width:2;stroke-linecap:round;stroke-linejoin:miter;stroke-miterlimit:4;stroke-dasharray:none;stroke-dashoffset:0;stroke-opacity:1;stop-color:#000000"
         d="m 75,273 v -8"
         id="path3835" />
      <path
         style="font-variation-settings:normal;vector-effect:none;fill:none;fill-opacity:1;stroke:#c0bfbc;stroke-width:2;stroke-linecap:round;stroke-linejoin:miter;stroke-miterlimit:4;stroke-dasharray:none;stroke-dashoffset:0;stroke-opacity:1;stop-color:#000000"
         d="m 79,273 -4,-8"
         id="path3831"
         sodipodi:nodetypes="cc" />
      <path
         style="font-variation-settings:normal;vector-effect:none;fill:none;fill-opacity:1;stroke:#c0bfbc;stroke-width:2;stroke-linecap:round;stroke-linejoin:miter;stroke-miterlimit:4;stroke-dasharray:none;stroke-dashoffset:0;stroke-opacity:1;stop-color:#000000"
         d="m 75,273 -4,-8"
         id="path3833"
         sodipodi:nodetypes="cc" />
      <g
         style="display:inline;enable-background:new"
         transform="translate(78.9998,-295)"
         id="g8373"
         inkscape:label="audio headphones ear audio ">
        <title
           id="title3930">headphones</title>
      </g>
      <g
         style="display:inline;enable-background:new"
         transform="translate(57.42203,-275)"
         id="g9221"
         inkscape:label="audio headphones ear audio ">
        <title
           id="title9217">headphones</title>
        <path
           id="path9219"
           d="m 88.96855,448 c -3.305456,0 -6.024078,3.00835 -5.96875,5.71875 0.04825,2.36557 0.808593,4.69547 1,5.28125 h 0.002 l 0.490235,1.61523 c 0.29948,0.98758 1.303309,1.55858 2.251953,1.28125 0.948643,-0.27732 1.471355,-1.29563 1.171875,-2.2832 l -0.675782,-2.22461 c -0.29948,-0.98757 -1.303309,-1.56053 -2.251953,-1.2832 -0.113727,0.0332 -0.221466,0.0796 -0.322265,0.13281 -0.225645,-1.33818 -0.189454,-2.39453 -0.189454,-2.39453 0,-2.37255 2.006693,-4.31249 4.492188,-4.3125 z"
           style="fill:#2e3436;fill-opacity:1;stroke:none;stroke-width:0.999975"
           sodipodi:nodetypes="cccccsccccccc" />
      </g>
      <g
         style="display:inline;enable-background:new"
         transform="translate(107.49039,-275)"
         id="g9236"
         inkscape:label="audio headphones ear audio ">
        <title
           id="title9232">headphones</title>
        <path
           id="path9234"
           d="m 88.96855,448 c -3.305456,0 -6.024078,3.00835 -5.96875,5.71875 0.04825,2.36557 0.808593,4.69547 1,5.28125 h 0.002 l 0.490235,1.61523 c 0.29948,0.98758 1.303309,1.55858 2.251953,1.28125 0.948643,-0.27732 1.471355,-1.29563 1.171875,-2.2832 l -0.675782,-2.22461 c -0.29948,-0.98757 -1.303309,-1.56053 -2.251953,-1.2832 -0.113727,0.0332 -0.221466,0.0796 -0.322265,0.13281 -0.225645,-1.33818 -0.189454,-2.39453 -0.189454,-2.39453 0,-2.37255 2.006693,-4.31249 4.492188,-4.3125 2.485496,0 4.499827,1.82687 4.492188,4.28125 -0.01236,0.88335 -0.06822,1.58654 -0.232422,2.41406 -0.07056,-0.0315 -0.138571,-0.0656 -0.214844,-0.0879 -0.948644,-0.27732 -1.954426,0.29368 -2.253906,1.28125 l -0.675782,2.22656 c -0.29948,0.98758 0.223232,2.00588 1.171875,2.28321 0.948644,0.27732 1.954426,-0.29368 2.253907,-1.28125 L 94.007612,459 h 0.01953 c 0.224501,-0.64458 0.972658,-3.19046 0.972658,-5.28125 0,-2.8298 -2.725794,-5.71875 -6.03125,-5.71875 z"
           style="fill:#2e3436;fill-opacity:1;stroke:none;stroke-width:0.999975" />
      </g>
      <g
         id="g287"
         transform="translate(238)">
        <path
           style="color:#000000;font-style:normal;font-variant:normal;font-weight:normal;font-stretch:normal;font-size:medium;line-height:normal;font-family:sans-serif;font-variant-ligatures:normal;font-variant-position:normal;font-variant-caps:normal;font-variant-numeric:normal;font-variant-alternates:normal;font-variant-east-asian:normal;font-feature-settings:normal;font-variation-settings:normal;text-indent:0;text-align:start;text-decoration:none;text-decoration-line:none;text-decoration-style:solid;text-decoration-color:#000000;letter-spacing:normal;word-spacing:normal;text-transform:none;writing-mode:lr-tb;direction:ltr;text-orientation:mixed;dominant-baseline:auto;baseline-shift:baseline;text-anchor:start;white-space:normal;shape-padding:0;shape-margin:0;inline-size:0;clip-rule:nonzero;display:inline;overflow:visible;visibility:visible;opacity:1;isolation:auto;mix-blend-mode:normal;color-interpolation:sRGB;color-interpolation-filters:linearRGB;solid-color:#000000;solid-opacity:1;vector-effect:none;fill:#000000;fill-opacity:1;fill-rule:nonzero;stroke:none;stroke-width:2;stroke-linecap:butt;stroke-linejoin:miter;stroke-miterlimit:4;stroke-dasharray:none;stroke-dashoffset:0;stroke-opacity:1;color-rendering:auto;image-rendering:auto;shape-rendering:auto;text-rendering:auto;enable-background:accumulate;stop-color:#000000;stop-opacity:1"
           d="m -18.957031,173 c -1.401457,0 -2.3969,0.64876 -3.064568,1.35286 0,0 -0.794345,-1.35286 -2.978401,-1.35286 h -4 v 4 h 2 l -0.03333,-2 H -25 c 2.214623,0 3,2.38403 3,2.38403 0,0 1.341795,-2.38403 3.042969,-2.38403 H -17 v 9 h -1 c -2.319071,0 -4,1.3006 -4,2.80555 V 188 h 1 c -0.04101,-1.19539 1,-2 2,-2 h 4 v -13 z"
           id="path9242"
           sodipodi:nodetypes="sccccccccscccccccccs" />
        <rect
           style="font-variation-settings:normal;opacity:1;vector-effect:none;fill:#000000;fill-opacity:1;stroke:none;stroke-width:2;stroke-linecap:round;stroke-linejoin:miter;stroke-miterlimit:4;stroke-dasharray:none;stroke-dashoffset:0;stroke-opacity:1;stop-color:#000000;stop-opacity:1"
           id="rect9244"
           width="3"
           height="6"
           x="-29"
           y="178" />
        <path
           id="rect9246"
           style="font-variation-settings:normal;opacity:1;vector-effect:none;fill:#000000;fill-opacity:1;stroke:none;stroke-width:2;stroke-linecap:round;stroke-linejoin:miter;stroke-miterlimit:4;stroke-dasharray:none;stroke-dashoffset:0;stroke-opacity:1;stop-color:#000000;stop-opacity:1"
           d="m -27,178 3,-2 v 10 l -3,-2 z"
           sodipodi:nodetypes="ccccc" />
        <rect
           style="font-variation-settings:normal;opacity:1;vector-effect:none;fill:#000000;fill-opacity:1;stroke:none;stroke-width:1.78885;stroke-linecap:round;stroke-linejoin:miter;stroke-miterlimit:4;stroke-dasharray:none;stroke-dashoffset:0;stroke-opacity:1;stop-color:#000000;stop-opacity:1"
           id="rect9249"
           width="1"
           height="4"
           x="-23"
           y="179" />
        <rect
           style="font-variation-settings:normal;opacity:1;vector-effect:none;fill:#000000;fill-opacity:1;stroke:none;stroke-width:2.19089;stroke-linecap:round;stroke-linejoin:miter;stroke-miterlimit:4;stroke-dasharray:none;stroke-dashoffset:0;stroke-opacity:1;stop-color:#000000;stop-opacity:1"
           id="rect9251"
           width="1"
           height="6"
           x="-21"
           y="178" />
      </g>
      <g
         id="g1235"
         transform="translate(40,20)">
        <path
           style="color:#000000;font-style:normal;font-variant:normal;font-weight:normal;font-stretch:normal;font-size:medium;line-height:normal;font-family:sans-serif;font-variant-ligatures:normal;font-variant-position:normal;font-variant-caps:normal;font-variant-numeric:normal;font-variant-alternates:normal;font-variant-east-asian:normal;font-feature-settings:normal;font-variation-settings:normal;text-indent:0;text-align:start;text-decoration:none;text-decoration-line:none;text-decoration-style:solid;text-decoration-color:#000000;letter-spacing:normal;word-spacing:normal;text-transform:none;writing-mode:lr-tb;direction:ltr;text-orientation:mixed;dominant-baseline:auto;baseline-shift:baseline;text-anchor:start;white-space:normal;shape-padding:0;shape-margin:0;inline-size:0;clip-rule:nonzero;display:inline;overflow:visible;visibility:visible;isolation:auto;mix-blend-mode:normal;color-interpolation:sRGB;color-interpolation-filters:linearRGB;solid-color:#000000;solid-opacity:1;vector-effect:none;fill:#000000;fill-opacity:1;fill-rule:nonzero;stroke:none;stroke-width:2;stroke-linecap:butt;stroke-linejoin:miter;stroke-miterlimit:4;stroke-dasharray:none;stroke-dashoffset:0;stroke-opacity:1;color-rendering:auto;image-rendering:auto;shape-rendering:auto;text-rendering:auto;enable-background:accumulate;stop-color:#000000"
           d="m 171.04297,173 c -1.40146,0 -2.3969,0.64876 -3.06457,1.35286 0,0 -0.79434,-1.35286 -2.9784,-1.35286 h -4 v 4 h 2 l -0.0333,-2 H 165 c 2.21462,0 3,2.38403 3,2.38403 0,0 1.3418,-2.38403 3.04297,-2.38403 H 173 v 11 h 2 v -13 z"
           id="path289"
           sodipodi:nodetypes="sccccccccsccccs" />
        <path
           id="rect306"
           style="fill:#000000;stroke-width:2;stroke-linecap:round;stop-color:#000000"
           d="m 167.98571,181.51071 v 1.49642 1.49643 V 186 h 1.49643 c 0.82902,0 1.49642,-0.66741 1.49642,-1.49644 v -1.49643 c 0,-0.829 -0.6674,-1.49642 -1.49642,-1.49642 z" />
        <path
           style="color:#000000;font-style:normal;font-variant:normal;font-weight:normal;font-stretch:normal;font-size:medium;line-height:normal;font-family:sans-serif;font-variant-ligatures:normal;font-variant-position:normal;font-variant-caps:normal;font-variant-numeric:normal;font-variant-alternates:normal;font-variant-east-asian:normal;font-feature-settings:normal;font-variation-settings:normal;text-indent:0;text-align:start;text-decoration:none;text-decoration-line:none;text-decoration-style:solid;text-decoration-color:#000000;letter-spacing:normal;word-spacing:normal;text-transform:none;writing-mode:lr-tb;direction:ltr;text-orientation:mixed;dominant-baseline:auto;baseline-shift:baseline;text-anchor:start;white-space:normal;shape-padding:0;shape-margin:0;inline-size:0;clip-rule:nonzero;display:inline;overflow:visible;visibility:visible;isolation:auto;mix-blend-mode:normal;color-interpolation:sRGB;color-interpolation-filters:linearRGB;solid-color:#000000;solid-opacity:1;vector-effect:none;fill:#000000;fill-opacity:1;fill-rule:nonzero;stroke:none;stroke-width:1;stroke-linecap:round;stroke-linejoin:miter;stroke-miterlimit:4;stroke-dasharray:none;stroke-dashoffset:0;stroke-opacity:1;color-rendering:auto;image-rendering:auto;shape-rendering:auto;text-rendering:auto;enable-background:accumulate;stop-color:#000000"
           d="m 163.32399,182.00645 a 0.6726763,0.6726763 0 0 1 -0.67269,-0.67274 c 1e-5,-1.19229 0.63599,-2.29694 1.66857,-2.89306 1.03258,-0.59614 2.30981,-0.59614 3.34239,0 1.03258,0.59612 1.66856,1.70077 1.66856,2.89306 a 0.6726763,0.6726763 0 0 1 -0.67268,0.67274 0.6726763,0.6726763 0 0 1 -0.67268,-0.67274 c 0,-0.71383 -0.37768,-1.3695 -0.99588,-1.72643 -0.61821,-0.35692 -1.37883,-0.35692 -1.99703,0 -0.61819,0.35693 -0.99588,1.0126 -0.99588,1.72643 a 0.6726763,0.6726763 0 0 1 -0.67268,0.67274 z"
           id="path1145" />
        <path
           id="path1140"
           style="fill:#000000;stroke-width:2;stroke-linecap:round;stop-color:#000000"
           d="m 163.99285,181.51071 v 1.49644 1.49642 V 186 h -1.49642 C 161.66741,186 161,185.33259 161,184.50357 v -1.49642 c 0,-0.82902 0.66741,-1.49644 1.49643,-1.49644 z" />
      </g>
      <rect
         style="fill:#9a9996;fill-opacity:1;stroke:none;stroke-width:0.999996;stroke-linecap:round;stroke-miterlimit:4;stroke-dasharray:none;stroke-opacity:1;stop-color:#000000"
         id="rect1149"
         width="2"
         height="12"
         x="50"
         y="258"
         rx="1"
         ry="1" />
      <path
         id="path1239"
         style="fill:#000000;stroke-width:2;stroke-linecap:round;stop-color:#000000"
         d="M 176 18.34375 C 175.13641 18.34375 174.27281 18.567492 173.5 19.013672 C 172.05469 19.848119 171.13784 21.349569 171.02344 23 L 171 23 L 171 23.34375 L 171 24 C 169.892 24 169 24.89203 169 26 L 169 28 C 169 29.10801 169.892 30 171 30 L 173 30 L 173 28 L 173 26 L 173 24 L 173 23.34375 C 173 22.27035 173.57041 21.280841 174.5 20.744141 C 175.42959 20.207441 176.57041 20.207441 177.5 20.744141 C 178.42959 21.280841 179 22.27035 179 23.34375 L 179 25 L 179 26 L 179 28 L 179 30 L 181 30 C 182.108 30 183 29.10801 183 28 L 183 26 C 183 24.89203 182.108 24 181 24 L 181 23.34375 L 181 23 L 180.97656 23 C 180.86216 21.349569 179.94531 19.848119 178.5 19.013672 C 177.72719 18.567492 176.86359 18.34375 176 18.34375 z "
         transform="translate(-8,156)" />
    </g>
    <g
       inkscape:groupmode="layer"
       id="layer3"
       inkscape:label="grid"
       style="display:inline"
       sodipodi:insensitive="true">
      <circle
         cx="64.000031"
         cy="236"
         r="59.504131"
         id="circle2892"
         style="display:inline;opacity:0.1;vector-effect:none;fill:none;fill-opacity:1;stroke:#000000;stroke-width:0.99000001;stroke-linecap:butt;stroke-linejoin:miter;stroke-miterlimit:4;stroke-dasharray:0.99000001, 0.99000001;stroke-dashoffset:0;stroke-opacity:1;marker:none;marker-start:none;marker-mid:none;marker-end:none;paint-order:normal;enable-background:new" />
      <rect
         ry="7.9292889"
         rx="8.701004"
         y="180.49496"
         x="20.495007"
         height="111.01005"
         width="87.009987"
         id="rect2894"
         style="display:inline;opacity:0.1;vector-effect:none;fill:none;fill-opacity:1;stroke:#000000;stroke-width:0.99000001;stroke-linecap:butt;stroke-linejoin:miter;stroke-miterlimit:4;stroke-dasharray:0.99000001, 0.99000001;stroke-dashoffset:0;stroke-opacity:1;marker:none;marker-start:none;marker-mid:none;marker-end:none;paint-order:normal;enable-background:new" />
      <rect
         ry="7.9238095"
         rx="7.9238095"
         y="184.49524"
         x="12.495266"
         height="103.00952"
         width="103.00952"
         id="rect2896"
         style="display:inline;opacity:0.1;vector-effect:none;fill:none;fill-opacity:1;stroke:#000000;stroke-width:0.99000001;stroke-linecap:butt;stroke-linejoin:miter;stroke-miterlimit:4;stroke-dasharray:0.99000001, 0.99000001;stroke-dashoffset:0;stroke-opacity:1;marker:none;marker-start:none;marker-mid:none;marker-end:none;paint-order:normal;enable-background:new" />
      <rect
         ry="8.701005"
         rx="7.9292889"
         y="200.49496"
         x="8.4950066"
         height="87.010048"
         width="111.01004"
         id="rect2898"
         style="display:inline;opacity:0.1;vector-effect:none;fill:none;fill-opacity:1;stroke:#000000;stroke-width:0.99000001;stroke-linecap:butt;stroke-linejoin:miter;stroke-miterlimit:4;stroke-dasharray:0.99000001, 0.99000001;stroke-dashoffset:0;stroke-opacity:1;marker:none;marker-start:none;marker-mid:none;marker-end:none;paint-order:normal;enable-background:new" />
      <path
         inkscape:connector-curvature="0"
         id="path2900"
         d="M 2.6203015e-5,288.99999 H 128.00003"
         style="display:inline;fill:none;stroke:#62a0ea;stroke-width:2;stroke-linecap:butt;stroke-linejoin:miter;stroke-miterlimit:4;stroke-dasharray:none;stroke-opacity:1;enable-background:new" />
    </g>
  </g>
</svg>
