<?xml version="1.0" encoding="UTF-8" standalone="no"?>
<svg
   viewBox="0 0 192 152"
   style="display:inline;enable-background:new"
   version="1.0"
   inkscape:output_extension="org.inkscape.output.svg.inkscape"
   sodipodi:docname="com.github.liferooter.textpieces.Source.svg"
   inkscape:version="1.1-alpha (65d249ff00, 2021-01-17)"
   sodipodi:version="0.32"
   id="svg11300"
   height="152"
   width="192"
   inkscape:export-filename="Template.png"
   inkscape:export-xdpi="96"
   inkscape:export-ydpi="96"
   xmlns:inkscape="http://www.inkscape.org/namespaces/inkscape"
   xmlns:sodipodi="http://sodipodi.sourceforge.net/DTD/sodipodi-0.dtd"
   xmlns:xlink="http://www.w3.org/1999/xlink"
   xmlns="http://www.w3.org/2000/svg"
   xmlns:svg="http://www.w3.org/2000/svg"
   xmlns:rdf="http://www.w3.org/1999/02/22-rdf-syntax-ns#"
   xmlns:cc="http://creativecommons.org/ns#"
   xmlns:dc="http://purl.org/dc/elements/1.1/">
  <title
     id="title4162">Adwaita Icon Template</title>
  <defs
     id="defs3">
    <linearGradient
       inkscape:collect="always"
       id="linearGradient11840">
      <stop
         style="stop-color:#8b1826;stop-opacity:1"
         offset="0"
         id="stop11836" />
      <stop
         style="stop-color:#ed333b;stop-opacity:1"
         offset="0.15909106"
         id="stop11874" />
      <stop
         style="stop-color:#a51d2d;stop-opacity:1"
         offset="0.29545468"
         id="stop12472" />
      <stop
         style="stop-color:#901927;stop-opacity:1"
         offset="1"
         id="stop11838" />
    </linearGradient>
    <linearGradient
       inkscape:collect="always"
       id="linearGradient10281">
      <stop
         style="stop-color:#c0bfbc;stop-opacity:1"
         offset="0"
         id="stop10277" />
      <stop
         style="stop-color:#deddda;stop-opacity:1"
         offset="0.52005726"
         id="stop10678" />
      <stop
         style="stop-color:#c0bfbc;stop-opacity:1"
         offset="1"
         id="stop10279" />
    </linearGradient>
    <linearGradient
       inkscape:collect="always"
       xlink:href="#linearGradient10281"
       id="linearGradient10283"
       x1="32.168236"
       y1="195.25809"
       x2="64.444725"
       y2="242.45041"
       gradientUnits="userSpaceOnUse" />
    <linearGradient
       inkscape:collect="always"
       xlink:href="#linearGradient10281"
       id="linearGradient11357"
       gradientUnits="userSpaceOnUse"
       x1="32.168236"
       y1="195.25809"
       x2="64.444725"
       y2="242.45041" />
    <linearGradient
       inkscape:collect="always"
       xlink:href="#linearGradient11840"
       id="linearGradient11842"
       x1="37.999986"
       y1="98.000531"
       x2="126"
       y2="98.000534"
       gradientUnits="userSpaceOnUse" />
    <linearGradient
       inkscape:collect="always"
       xlink:href="#linearGradient10281"
       id="linearGradient12880"
       x1="14.881946"
       y1="209.47279"
       x2="57.24205"
       y2="248.12904"
       gradientUnits="userSpaceOnUse" />
    <linearGradient
       inkscape:collect="always"
       xlink:href="#linearGradient10281"
       id="linearGradient13161"
       gradientUnits="userSpaceOnUse"
       x1="14.881946"
       y1="209.47279"
       x2="57.24205"
       y2="248.12904" />
    <linearGradient
       inkscape:collect="always"
       xlink:href="#linearGradient10281"
       id="linearGradient13163"
       gradientUnits="userSpaceOnUse"
       x1="32.168236"
       y1="195.25809"
       x2="64.444725"
       y2="242.45041" />
    <linearGradient
       inkscape:collect="always"
       xlink:href="#linearGradient11840"
       id="linearGradient13165"
       gradientUnits="userSpaceOnUse"
       x1="37.999986"
       y1="98.000531"
       x2="126"
       y2="98.000534" />
  </defs>
  <sodipodi:namedview
     inkscape:document-rotation="0"
     borderlayer="true"
     inkscape:snap-text-baseline="true"
     inkscape:snap-smooth-nodes="true"
     inkscape:snap-midpoints="true"
     inkscape:snap-object-midpoints="true"
     inkscape:snap-center="true"
     showborder="true"
     inkscape:snap-bbox-midpoints="true"
     inkscape:snap-bbox-edge-midpoints="true"
     inkscape:snap-intersection-paths="true"
     inkscape:object-paths="true"
     inkscape:snap-global="true"
     inkscape:bbox-nodes="true"
     inkscape:object-nodes="true"
     inkscape:measure-end="0,0"
     inkscape:measure-start="0,0"
     inkscape:locked="false"
     inkscape:guide-bbox="true"
     showguides="false"
     inkscape:pagecheckerboard="false"
     inkscape:window-maximized="0"
     guidetolerance="13"
     gridtolerance="12"
     objecttolerance="7"
     inkscape:snap-bbox="true"
     inkscape:snap-nodes="true"
     height="300px"
     width="400px"
     inkscape:window-y="23"
     inkscape:window-x="26"
     inkscape:window-height="786"
     inkscape:window-width="1477"
     inkscape:showpageshadow="false"
     inkscape:document-units="px"
     inkscape:grid-bbox="true"
     showgrid="false"
     inkscape:current-layer="layer9"
     inkscape:cy="76.007577"
     inkscape:cx="104.69363"
     inkscape:zoom="2.3879198"
     inkscape:pageshadow="2"
     inkscape:pageopacity="0.0"
     borderopacity="0.25490196"
     bordercolor="#666666"
     pagecolor="#ffffff"
     id="base"
     fill="#f57900"
     stroke="#ef2929">
    <inkscape:grid
       originy="8"
       originx="8"
       empspacing="4"
       visible="true"
       enabled="true"
       spacingy="2"
       spacingx="2"
       id="grid5883"
       type="xygrid" />
    <sodipodi:guide
       inkscape:color="rgb(0,0,255)"
       inkscape:label=""
       inkscape:locked="false"
       id="guide1073"
       orientation="0,1"
       position="72,16" />
    <sodipodi:guide
       inkscape:color="rgb(0,0,255)"
       inkscape:label=""
       inkscape:locked="false"
       id="guide1075"
       orientation="1,0"
       position="20,72" />
    <sodipodi:guide
       inkscape:color="rgb(0,0,255)"
       inkscape:label=""
       inkscape:locked="false"
       id="guide1099"
       orientation="0,1"
       position="72,112" />
    <sodipodi:guide
       inkscape:color="rgb(0,0,255)"
       inkscape:label=""
       inkscape:locked="false"
       id="guide993"
       orientation="0,1"
       position="72,136" />
    <sodipodi:guide
       inkscape:color="rgb(0,0,255)"
       inkscape:label=""
       inkscape:locked="false"
       id="guide995"
       orientation="1,0"
       position="112,72" />
    <sodipodi:guide
       inkscape:color="rgb(0,0,255)"
       inkscape:label=""
       inkscape:locked="false"
       id="guide867"
       orientation="1,0"
       position="8.0000001,72" />
    <sodipodi:guide
       inkscape:color="rgb(0,0,255)"
       inkscape:label=""
       inkscape:locked="false"
       id="guide869"
       orientation="1,0"
       position="128,72" />
    <sodipodi:guide
       inkscape:color="rgb(0,0,255)"
       inkscape:label=""
       inkscape:locked="false"
       id="guide871"
       orientation="0,1"
       position="72,124" />
    <inkscape:grid
       originy="8"
       originx="8"
       dotted="true"
       empopacity="0.08627451"
       empcolor="#000000"
       opacity="0.49019608"
       color="#000000"
       empspacing="8"
       spacingy="1"
       spacingx="1"
       id="grid873"
       type="xygrid" />
    <sodipodi:guide
       inkscape:color="rgb(0,0,255)"
       inkscape:label=""
       inkscape:locked="false"
       id="guide877"
       orientation="1,0"
       position="32,72" />
    <sodipodi:guide
       inkscape:color="rgb(0,0,255)"
       inkscape:label=""
       inkscape:locked="false"
       id="guide879"
       orientation="1,0"
       position="124,72" />
    <sodipodi:guide
       inkscape:color="rgb(0,0,255)"
       inkscape:label=""
       inkscape:locked="false"
       id="guide881"
       orientation="0,1"
       position="72,128" />
    <sodipodi:guide
       inkscape:color="rgb(0,0,255)"
       inkscape:label=""
       inkscape:locked="false"
       id="guide883"
       orientation="0,1"
       position="72,20" />
    <sodipodi:guide
       inkscape:color="rgb(0,0,255)"
       inkscape:label=""
       inkscape:locked="false"
       id="guide885"
       orientation="1,0"
       position="16,72" />
    <sodipodi:guide
       inkscape:color="rgb(0,0,255)"
       inkscape:label=""
       inkscape:locked="false"
       id="guide887"
       orientation="1,0"
       position="136,72" />
    <sodipodi:guide
       inkscape:color="rgb(0,0,255)"
       inkscape:label=""
       inkscape:locked="false"
       id="guide897"
       orientation="0,1"
       position="72,8" />
    <sodipodi:guide
       inkscape:color="rgb(0,0,255)"
       inkscape:label=""
       inkscape:locked="false"
       id="guide899"
       orientation="0,1"
       position="72,32" />
    <sodipodi:guide
       inkscape:color="rgb(0,0,255)"
       inkscape:label=""
       inkscape:locked="false"
       id="guide950"
       orientation="-0.70710678,0.70710678"
       position="264,264" />
    <sodipodi:guide
       inkscape:color="rgb(0,0,255)"
       inkscape:label=""
       inkscape:locked="false"
       id="guide952"
       orientation="0.70710678,0.70710678"
       position="72,72" />
  </sodipodi:namedview>
  <metadata
     id="metadata4">
    <rdf:RDF>
      <cc:Work
         rdf:about="">
        <dc:format>image/svg+xml</dc:format>
        <dc:type
           rdf:resource="http://purl.org/dc/dcmitype/StillImage" />
        <dc:creator>
          <cc:Agent>
            <dc:title>GNOME Design Team</dc:title>
          </cc:Agent>
        </dc:creator>
        <dc:source />
        <cc:license
           rdf:resource="http://creativecommons.org/licenses/by-sa/4.0/" />
        <dc:title>Adwaita Icon Template</dc:title>
        <dc:subject>
          <rdf:Bag />
        </dc:subject>
        <dc:date />
        <dc:rights>
          <cc:Agent>
            <dc:title />
          </cc:Agent>
        </dc:rights>
        <dc:publisher>
          <cc:Agent>
            <dc:title />
          </cc:Agent>
        </dc:publisher>
        <dc:identifier />
        <dc:relation />
        <dc:language />
        <dc:coverage />
        <dc:description />
        <dc:contributor>
          <cc:Agent>
            <dc:title />
          </cc:Agent>
        </dc:contributor>
      </cc:Work>
      <cc:License
         rdf:about="http://creativecommons.org/licenses/by-sa/4.0/">
        <cc:permits
           rdf:resource="http://creativecommons.org/ns#Reproduction" />
        <cc:permits
           rdf:resource="http://creativecommons.org/ns#Distribution" />
        <cc:requires
           rdf:resource="http://creativecommons.org/ns#Notice" />
        <cc:requires
           rdf:resource="http://creativecommons.org/ns#Attribution" />
        <cc:permits
           rdf:resource="http://creativecommons.org/ns#DerivativeWorks" />
        <cc:requires
           rdf:resource="http://creativecommons.org/ns#ShareAlike" />
      </cc:License>
    </rdf:RDF>
  </metadata>
  <g
     transform="translate(8,-156)"
     style="display:inline"
     inkscape:groupmode="layer"
     inkscape:label="App Icon"
     id="layer1">
    <g
       sodipodi:insensitive="true"
       style="display:inline"
       inkscape:label="template"
       id="layer4"
       inkscape:groupmode="layer">
      <rect
         style="display:inline;overflow:visible;visibility:visible;fill:#f0f0f0;fill-opacity:0;fill-rule:nonzero;stroke:none;stroke-width:0.5;marker:none;enable-background:accumulate"
         id="hicolor"
         width="128"
         height="128"
         x="9.2651362e-08"
         y="172"
         inkscape:label="0" />
      <rect
         inkscape:label="0"
         y="172"
         x="160"
         height="16"
         width="16"
         id="symbolic"
         style="display:inline;overflow:visible;visibility:visible;fill:#f0f0f0;fill-opacity:0;fill-rule:nonzero;stroke:none;stroke-width:0.5;marker:none;enable-background:accumulate" />
    </g>
    <g
       sodipodi:insensitive="true"
       style="display:inline"
       inkscape:label="baseplate"
       id="layer2"
       inkscape:groupmode="layer">
      <g
         inkscape:export-ydpi="12"
         inkscape:export-xdpi="12"
         id="g12027"
         transform="matrix(7.9911709,0,0,8.0036407,-167.7909,-4846.0776)"
         style="display:inline;fill:#000000;enable-background:new" />
      <rect
         inkscape:label="0"
         y="172"
         x="9.2651362e-08"
         height="128"
         width="128"
         id="128"
         style="display:inline;overflow:visible;visibility:visible;fill:#f0f0f0;fill-opacity:1;fill-rule:nonzero;stroke:none;stroke-width:0.5;marker:none;enable-background:accumulate" />
      <g
         transform="translate(-24,24)"
         style="fill:none;fill-opacity:0.25098;stroke:#a579b3;stroke-opacity:1"
         id="g883" />
      <g
         transform="translate(-24,24)"
         style="fill:none;fill-opacity:0.25098;stroke:#a579b3;stroke-opacity:1"
         id="g900" />
      <rect
         style="display:inline;overflow:visible;visibility:visible;fill:#f0f0f0;fill-opacity:1;fill-rule:nonzero;stroke:none;stroke-width:0.5;marker:none;enable-background:accumulate"
         id="16"
         width="16"
         height="16"
         x="160"
         y="172"
         inkscape:label="" />
      <text
         inkscape:label="icon-name"
         id="text863"
         y="167"
         x="0"
         style="font-style:normal;font-variant:normal;font-weight:bold;font-stretch:normal;font-size:4px;line-height:125%;font-family:Cantarell;-inkscape-font-specification:'Cantarell, Bold';text-align:start;writing-mode:lr-tb;text-anchor:start;display:inline;fill:#000000;fill-opacity:1;stroke:none;stroke-width:0.332649;enable-background:new"
         xml:space="preserve"><tspan
           y="167"
           x="0"
           id="tspan861"
           sodipodi:role="line"
           style="font-size:4px;stroke-width:0.332649">Hicolor</tspan></text>
      <text
         xml:space="preserve"
         style="font-style:normal;font-variant:normal;font-weight:bold;font-stretch:normal;font-size:4px;line-height:125%;font-family:Cantarell;-inkscape-font-specification:'Cantarell, Bold';text-align:start;writing-mode:lr-tb;text-anchor:start;display:inline;fill:#000000;fill-opacity:1;stroke:none;stroke-width:0.332649;enable-background:new"
         x="160"
         y="167"
         id="text867"
         inkscape:label="icon-name"><tspan
           style="font-size:4px;stroke-width:0.332649"
           sodipodi:role="line"
           id="tspan865"
           x="160"
           y="167">Symbolic</tspan></text>
    </g>
    <g
       style="display:inline"
       inkscape:label="icons"
       id="layer9"
       inkscape:groupmode="layer">
      <path
         id="path6124"
         style="display:inline;fill:#241f31;fill-opacity:1;stroke:none;stroke-width:2;stroke-linecap:round;stroke-linejoin:round;stroke-miterlimit:4;stroke-dasharray:none;stroke-dashoffset:26.4;enable-background:new"
         d="m 379,177.5 c 0,3.01246 2.44209,5 5.45455,5 v -3.18181 h 2.72726 c 0.50208,0 0.9091,0.40701 0.9091,0.90909 0,0.50207 -0.40702,0.90908 -0.9091,0.90908 h -1.36362 V 182.5 h 6.90909 v -5 H 384 Z"
         sodipodi:nodetypes="cccssscccccc" />
      <rect
         style="fill:#c0bfbc;stroke:none;stroke-width:2;stroke-linecap:round;stroke-linejoin:round;stroke-miterlimit:4;stroke-dasharray:none;stroke-dashoffset:26.4"
         id="rect7171"
         width="8"
         height="28"
         x="106"
         y="-4" />
      <g
         style="font-style:normal;font-weight:normal;font-size:40px;line-height:1.25;font-family:sans-serif;letter-spacing:0px;word-spacing:0px;fill:#77767b;fill-opacity:1;stroke:none"
         id="g1017"
         aria-label="あ" />
      <g
         style="font-style:normal;font-variant:normal;font-weight:bold;font-stretch:normal;font-size:40px;line-height:1.25;font-family:Montserrat;-inkscape-font-specification:'Montserrat, Bold';font-variant-ligatures:normal;font-variant-caps:normal;font-variant-numeric:normal;font-variant-east-asian:normal;letter-spacing:0px;word-spacing:0px;fill:#241f31;fill-opacity:1;stroke:none"
         id="g1023"
         aria-label="A" />
      <path
         id="path10105"
         style="display:inline;fill:#9a9996;stroke:none;stroke-width:2;stroke-linecap:round;stroke-linejoin:round;stroke-miterlimit:4;stroke-dasharray:none;stroke-dashoffset:26.4;enable-background:new"
         d="m 16,218 c 0,13.25483 10.745166,22 24,22 v -14 h 12 c 2.209139,0 4,1.79086 4,4 0,2.20914 -1.790861,4 -4,4 h -6 v 6 h 48 v -8 -8 -6 H 38 Z"
         sodipodi:nodetypes="cccssscccccccc" />
      <path
         id="rect7293-0"
         style="display:inline;fill:url(#linearGradient12880);stroke:none;stroke-width:2;stroke-linecap:round;stroke-linejoin:round;stroke-miterlimit:4;stroke-dasharray:none;stroke-dashoffset:26.4;enable-background:new;fill-opacity:1"
         d="m 16,216 c 0,13.25483 10.745166,22 24,22 v -14 h 12 c 2.209139,0 4,1.79086 4,4 0,2.20914 -1.790861,4 -4,4 h -6 v 6 h 48 v -8 -8 -6 H 38 Z"
         sodipodi:nodetypes="cccssscccccccc" />
      <g
         id="g7377"
         transform="rotate(30,80.428204,229.99039)">
        <path
           style="fill:#9a9996;stroke:none;stroke-width:0.999996px;stroke-linecap:butt;stroke-linejoin:miter;stroke-opacity:1"
           d="m 99.5,206.59809 h -84 c 0,12 20,26 38,26 h 46 z"
           id="path10131"
           sodipodi:nodetypes="ccccc" />
        <path
           style="fill:url(#linearGradient10283);stroke:none;stroke-width:0.999996px;stroke-linecap:butt;stroke-linejoin:miter;stroke-opacity:1;fill-opacity:1"
           d="M 98,204 H 14 c 0,12 20,26 38,26 h 46 z"
           id="path2115"
           sodipodi:nodetypes="ccccc" />
        <path
           style="fill:#77767b;stroke:none;stroke-width:1px;stroke-linecap:butt;stroke-linejoin:miter;stroke-opacity:1"
           d="m 26,206 h 32 c 0,1 -2,2 -4,2 H 30 c -2,0 -4,-1 -4,-2 z"
           id="path4951"
           sodipodi:nodetypes="ccccc" />
      </g>
      <g
         id="g9142"
         transform="translate(0,2)">
        <path
           id="path11498"
           style="color:#000000;fill:url(#linearGradient11842);fill-opacity:1;stroke-width:32;stroke-linecap:round"
           d="m 109.16406,54.021484 c -1.11683,0.05851 -2.22444,0.233944 -3.30468,0.523438 -2.71328,0.726581 -5.18746,2.154644 -7.173833,4.140625 l -56,56.000003 c -1.51283,1.51874 -2.705049,3.326 -3.505859,5.31445 H 38 v 5.98047 c -0.0056,4.25038 1.680266,8.32831 4.685547,11.33398 6.248559,6.24938 16.380347,6.24938 22.628906,0 L 121.31445,81.314453 C 124.56023,78.067258 126.25467,73.582195 125.9668,69 H 126 v -6 h -1.62109 c -0.77492,-1.598281 -1.81057,-3.056372 -3.06446,-4.314453 -3.20629,-3.206109 -7.62235,-4.901262 -12.15039,-4.664063 z"
           transform="translate(-8,154)"
           sodipodi:nodetypes="sccccccscccccccs" />
        <path
           style="color:#000000;fill:#e01b24;stroke-linecap:round"
           d="m 97.859375,202.54492 a 16,16 0 0 0 -7.173828,4.14063 l -56,56 a 16,16 0 0 0 0,22.6289 16,16 0 0 0 22.628906,0 l 55.999997,-56 a 16,16 0 0 0 0,-22.6289 16,16 0 0 0 -15.455075,-4.14063 z"
           id="path1594" />
      </g>
      <g
         id="g2583"
         transform="translate(-630.42096,25.33923)">
        <g
           id="g1043"
           transform="matrix(1.21,0,0,1.1,-228.14152,-43.727173)"
           style="display:inline;enable-background:new">
          <path
             style="display:inline;fill:#77767b;stroke:none;stroke-width:0.902587px;stroke-linecap:butt;stroke-linejoin:miter;stroke-opacity:1;enable-background:new"
             d="m 86.152301,225.74834 -41.28771,5.39291 c -12.389131,1.61826 -25.132772,9.59697 -25.132772,9.59697 0,0 12.02409,4.74358 24.412527,3.12542 l 41.287697,-5.39292 0.720258,-12.72238"
             id="path2386-5-3-7"
             sodipodi:nodetypes="cccscc" />
          <path
             style="display:inline;fill:#9a9996;stroke:none;stroke-width:0.902587px;stroke-linecap:butt;stroke-linejoin:miter;stroke-opacity:1;enable-background:new"
             d="m 87.216445,225.09868 -41.28771,5.39291 c -12.389131,1.61826 -25.132772,9.59695 -25.132772,9.59695 0,0 12.02409,4.74358 24.412527,3.12542 l 41.287697,-5.39292 0.720258,-12.72236"
             id="path2386-5-3"
             sodipodi:nodetypes="cccscc" />
          <path
             style="display:inline;fill:#9a9996;stroke:none;stroke-width:1.01065px;stroke-linecap:butt;stroke-linejoin:miter;stroke-opacity:1;enable-background:new"
             d="M 86.89636,234.67828 53.378309,211.35027 C 39.191712,202.69441 34.311663,200.62798 30.414836,200.62799 l -1.816766,1.86554 c -0.52417,5.68832 6.227351,12.67154 6.227351,12.67154 l 5.040745,-5.49322 c 0,0 18.330909,8.53727 -1.321944,11.86406 l 33.268367,22.14757 15.083771,-9.0052"
             id="path2386-5-6"
             sodipodi:nodetypes="ccccccccc" />
          <path
             style="display:inline;fill:#c0bfbc;stroke:none;stroke-width:1.01065px;stroke-linecap:butt;stroke-linejoin:miter;stroke-opacity:1;enable-background:new"
             d="M 87.63479,234.84229 54.116739,211.51428 C 39.930142,202.85842 35.050094,200.79199 31.153267,200.792 l -1.816766,1.86554 c -0.52417,5.68832 6.227351,12.67154 6.227351,12.67154 l 5.040744,-5.49322 c 0,0 18.330909,8.53727 -1.321943,11.86406 l 33.268366,22.14759 15.083771,-9.00522"
             id="path2386-5"
             sodipodi:nodetypes="ccccccccc" />
          <path
             style="fill:#77767b;stroke:none;stroke-width:0.85737px;stroke-linecap:butt;stroke-linejoin:miter;stroke-opacity:1"
             d="m 62.167013,188.13443 c 0,0 6.106905,7.75553 3.139597,12.33446 -2.967299,4.57892 -3.139597,-12.33446 -3.139597,-12.33446 z"
             id="path2436" />
          <path
             style="display:inline;fill:#c0bfbc;stroke:none;stroke-width:1.02706px;stroke-linecap:butt;stroke-linejoin:miter;stroke-opacity:1;enable-background:new"
             d="M 89.972672,234.60709 73.45236,196.66022 c -4.957222,-11.38665 -17.471826,-19.69989 -17.471826,-19.69989 0,0 -2.604409,14.45036 2.352543,25.83637 l 16.520324,37.94686 15.119271,-6.13647"
             id="path2386-3"
             sodipodi:nodetypes="cccscc"
             inkscape:transform-center-x="5.9764444"
             inkscape:transform-center-y="-9.0971648" />
          <path
             style="fill:#deddda;stroke:none;stroke-width:1.02706px;stroke-linecap:butt;stroke-linejoin:miter;stroke-opacity:1"
             d="M 90.490538,234.9067 73.970226,196.95983 C 69.013004,185.57318 56.4984,177.25994 56.4984,177.25994 c 0,0 -2.604409,14.45036 2.352543,25.83637 l 16.520324,37.94691 15.119271,-6.13652"
             id="path2386"
             sodipodi:nodetypes="cccscc" />
          <g
             id="g2384"
             transform="matrix(0.51228627,0.38865405,-0.38865405,0.51228627,114.59056,107.33594)">
            <rect
               style="display:inline;fill:#a51d2d;fill-rule:evenodd;stroke-width:0.593237;enable-background:new"
               id="rect1451-3"
               width="31.999681"
               height="115"
               x="61.170319"
               y="172"
               rx="9.9999008"
               ry="9.9999008" />
            <rect
               style="fill:#e01b24;fill-rule:evenodd;stroke-width:0.593237"
               id="rect1451"
               width="31.999681"
               height="115"
               x="57.549999"
               y="172"
               rx="9.9999008"
               ry="9.9999008" />
          </g>
        </g>
        <path
           style="display:inline;mix-blend-mode:normal;fill:#9a9996;stroke:none;stroke-width:1px;stroke-linecap:butt;stroke-linejoin:miter;stroke-opacity:1;enable-background:new"
           d="m -132.97793,189.67167 c -13.24793,-19.93898 -11.58537,-24.31749 -11.58537,-24.31749 z"
           id="path1045" />
        <text
           xml:space="preserve"
           style="font-style:normal;font-weight:normal;font-size:24.03px;line-height:1.25;font-family:sans-serif;display:inline;fill:#000000;fill-opacity:1;stroke:none;stroke-width:0.600749;enable-background:new"
           x="-167.97935"
           y="234.67975"
           id="text1872"
           transform="scale(0.9614767,1.0400668)"><tspan
             sodipodi:role="line"
             id="tspan1870"
             x="-167.97935"
             y="234.67975"
             style="fill:#a51d2d;stroke-width:0.600749">#</tspan></text>
      </g>
      <g
         id="g6203"
         transform="matrix(-1,0,0,1,126,24)"
         style="stroke:#ffffff">
        <g
           id="g6303">
          <path
             style="fill:none;stroke:#ffffff;stroke-width:3;stroke-linecap:butt;stroke-linejoin:miter;stroke-opacity:1"
             d="M 82,242 70,254"
             id="path6007" />
          <path
             style="fill:none;stroke:#ffffff;stroke-width:3;stroke-linecap:butt;stroke-linejoin:miter;stroke-opacity:1"
             d="M 78,238 66,250"
             id="path6107" />
          <path
             style="fill:none;stroke:#ffffff;stroke-width:3;stroke-linecap:butt;stroke-linejoin:miter;stroke-opacity:1"
             d="m 66,242 12,12"
             id="path6199" />
          <path
             style="fill:none;stroke:#ffffff;stroke-width:3;stroke-linecap:butt;stroke-linejoin:miter;stroke-opacity:1"
             d="m 70,238 12,12"
             id="path6201" />
        </g>
      </g>
      <path
         style="fill:#c0bfbc;stroke:none;stroke-width:2;stroke-linecap:round;stroke-linejoin:round;stroke-miterlimit:4;stroke-dasharray:none;stroke-dashoffset:26.4"
         id="path7163"
         sodipodi:type="arc"
         sodipodi:cx="-122"
         sodipodi:cy="20"
         sodipodi:rx="24"
         sodipodi:ry="24"
         sodipodi:start="0"
         sodipodi:end="1.5707963"
         sodipodi:arc-type="slice"
         d="m -98,20 a 24,24 0 0 1 -24,24 V 20 Z"
         transform="scale(-1)" />
      <rect
         style="fill:#c0bfbc;stroke:none;stroke-width:2;stroke-linecap:round;stroke-linejoin:round;stroke-miterlimit:4;stroke-dasharray:none;stroke-dashoffset:26.4"
         id="rect7165"
         width="8"
         height="46"
         x="114"
         y="-22" />
      <rect
         style="fill:#c0bfbc;stroke:none;stroke-width:2;stroke-linecap:round;stroke-linejoin:round;stroke-miterlimit:4;stroke-dasharray:none;stroke-dashoffset:26.4"
         id="rect7167"
         width="8"
         height="34"
         x="98"
         y="-10" />
      <circle
         style="fill:#f9f06b;stroke:none;stroke-width:1.99999;stroke-linecap:round;stroke-linejoin:round;stroke-miterlimit:4;stroke-dasharray:none;stroke-dashoffset:26.4"
         id="circle7169"
         transform="scale(-1)"
         cx="-110"
         cy="4.0000229"
         r="4" />
      <g
         id="g7748"
         transform="translate(-310)">
        <path
           id="path7712"
           style="display:inline;fill:#deddda;stroke:none;stroke-width:2;stroke-linecap:round;stroke-linejoin:round;stroke-miterlimit:4;stroke-dasharray:none;stroke-dashoffset:26.4;enable-background:new"
           d="m -414,212 c 0,13.25483 10.74517,24 24,24 v -16 h 14 c 2.20914,0 4,1.79086 4,4 0,2.20914 -1.79086,4 -4,4 h -6 v 8 h 46 v -8 -8 -8 h -56 z"
           sodipodi:nodetypes="cccssscccccccc" />
        <g
           id="g7718"
           transform="rotate(30,-128.19615,-573.3908)">
          <path
             style="fill:#c0bfbc;stroke:none;stroke-width:0.999996px;stroke-linecap:butt;stroke-linejoin:miter;stroke-opacity:1"
             d="M 98,204 H 14 c 0,12 20,22 38,22 h 46 z"
             id="path7714"
             sodipodi:nodetypes="ccccc" />
          <path
             style="fill:#77767b;stroke:none;stroke-width:1px;stroke-linecap:butt;stroke-linejoin:miter;stroke-opacity:1"
             d="m 26,206 h 32 l -4,2 H 30 Z"
             id="path7716"
             sodipodi:nodetypes="ccccc" />
        </g>
        <path
           style="fill:none;stroke:#e01b24;stroke-width:32;stroke-linecap:round;stroke-linejoin:miter;stroke-miterlimit:4;stroke-dasharray:none;stroke-opacity:1"
           d="m -384,274 56,-56"
           id="path7720"
           sodipodi:nodetypes="cc" />
        <g
           id="g7734"
           transform="matrix(-1,0,0,1,-282,0)"
           style="stroke:#ffffff">
          <g
             id="g7732">
            <g
               id="g7726"
               style="display:inline;stroke:#ffffff;stroke-width:2;enable-background:new"
               transform="matrix(-1,0,0,1,148,0)">
              <path
                 style="fill:none;stroke:#ffffff;stroke-width:2;stroke-linecap:butt;stroke-linejoin:miter;stroke-opacity:1"
                 d="m 66,242 12,12"
                 id="path7722" />
              <path
                 style="fill:none;stroke:#ffffff;stroke-width:2;stroke-linecap:butt;stroke-linejoin:miter;stroke-opacity:1"
                 d="m 70,238 12,12"
                 id="path7724" />
            </g>
            <path
               style="fill:none;stroke:#ffffff;stroke-width:2;stroke-linecap:butt;stroke-linejoin:miter;stroke-opacity:1"
               d="m 66,242 12,12"
               id="path7728" />
            <path
               style="fill:none;stroke:#ffffff;stroke-width:2;stroke-linecap:butt;stroke-linejoin:miter;stroke-opacity:1"
               d="m 70,238 12,12"
               id="path7730" />
          </g>
        </g>
      </g>
      <g
         id="g9782"
         transform="translate(-24,-206)">
        <path
           style="fill:#c0bfbc;stroke:none;stroke-width:0.999996px;stroke-linecap:butt;stroke-linejoin:miter;stroke-opacity:1"
           d="M 98,204 H 14 c 0,12 20,26 38,26 h 46 z"
           id="path9778"
           sodipodi:nodetypes="ccccc" />
        <path
           style="fill:#77767b;stroke:none;stroke-width:1px;stroke-linecap:butt;stroke-linejoin:miter;stroke-opacity:1"
           d="m 26,206 h 32 c 0,1 -2,2 -4,2 H 30 c -2,0 -4,-1 -4,-2 z"
           id="path9780"
           sodipodi:nodetypes="ccccc" />
      </g>
      <g
         id="g11337"
         transform="translate(-610)">
        <path
           id="path11283"
           style="display:inline;fill:#9a9996;stroke:none;stroke-width:2;stroke-linecap:round;stroke-linejoin:round;stroke-miterlimit:4;stroke-dasharray:none;stroke-dashoffset:26.4;enable-background:new"
           d="m 16,217 c 0,13.25483 10.745166,22 24,22 v -14 h 12 c 2.209139,0 4,1.79086 4,4 0,2.20914 -1.790861,4 -4,4 h -6 v 6 h 48 v -8 -8 -6 H 38 Z"
           sodipodi:nodetypes="cccssscccccccc" />
        <path
           id="path11285"
           style="display:inline;fill:#deddda;stroke:none;stroke-width:2;stroke-linecap:round;stroke-linejoin:round;stroke-miterlimit:4;stroke-dasharray:none;stroke-dashoffset:26.4;enable-background:new"
           d="m 16,216 c 0,13.25483 10.745166,22 24,22 v -14 h 12 c 2.209139,0 4,1.79086 4,4 0,2.20914 -1.790861,4 -4,4 h -6 v 6 h 48 v -8 -8 -6 H 38 Z"
           sodipodi:nodetypes="cccssscccccccc" />
        <g
           id="g11293"
           transform="rotate(30,80.428204,229.99039)">
          <path
             style="fill:#77767b;stroke:none;stroke-width:0.999996px;stroke-linecap:butt;stroke-linejoin:miter;stroke-opacity:1"
             d="M 99,205.73206 H 15 c 0,12 20,26 38,26 h 46 z"
             id="path11287"
             sodipodi:nodetypes="ccccc" />
          <path
             style="fill:url(#linearGradient11357);fill-opacity:1;stroke:none;stroke-width:0.999996px;stroke-linecap:butt;stroke-linejoin:miter;stroke-opacity:1"
             d="M 98,204 H 14 c 0,12 20,26 38,26 h 46 z"
             id="path11289"
             sodipodi:nodetypes="ccccc" />
          <path
             style="fill:#77767b;stroke:none;stroke-width:1px;stroke-linecap:butt;stroke-linejoin:miter;stroke-opacity:1"
             d="m 26,206 h 32 c 0,1 -2,2 -4,2 H 30 c -2,0 -4,-1 -4,-2 z"
             id="path11291"
             sodipodi:nodetypes="ccccc" />
        </g>
        <g
           id="g11303"
           transform="translate(0,2)">
          <path
             style="fill:#a51d2d;stroke:#a51d2d;stroke-width:32;stroke-linecap:round;stroke-linejoin:miter;stroke-miterlimit:4;stroke-dasharray:none;stroke-opacity:1"
             d="m 46,280 56,-56"
             id="path11295"
             sodipodi:nodetypes="cc" />
          <rect
             style="fill:#a51d2d;fill-opacity:1;stroke:none;stroke-width:2;stroke-linecap:round;stroke-linejoin:round;stroke-miterlimit:4;stroke-dasharray:none;stroke-dashoffset:26.4"
             id="rect11297"
             width="16"
             height="6"
             x="102"
             y="217" />
          <rect
             style="fill:#a51d2d;fill-opacity:1;stroke:none;stroke-width:2;stroke-linecap:round;stroke-linejoin:round;stroke-miterlimit:4;stroke-dasharray:none;stroke-dashoffset:26.4"
             id="rect11299"
             width="16"
             height="6"
             x="30"
             y="274" />
          <path
             style="fill:none;stroke:#e01b24;stroke-width:32;stroke-linecap:round;stroke-linejoin:miter;stroke-miterlimit:4;stroke-dasharray:none;stroke-opacity:1"
             d="m 46,274 56,-56"
             id="path11301"
             sodipodi:nodetypes="cc" />
        </g>
        <g
           id="g11317"
           transform="matrix(-1,0,0,1,148,2)"
           style="stroke:#ffffff">
          <g
             id="g11315">
            <g
               id="g11309"
               style="display:inline;stroke:#ffffff;stroke-width:2;enable-background:new"
               transform="matrix(-1,0,0,1,148,0)">
              <path
                 style="fill:none;stroke:#ffffff;stroke-width:2;stroke-linecap:butt;stroke-linejoin:miter;stroke-opacity:1"
                 d="m 66,242 12,12"
                 id="path11305" />
              <path
                 style="fill:none;stroke:#ffffff;stroke-width:2;stroke-linecap:butt;stroke-linejoin:miter;stroke-opacity:1"
                 d="m 70,238 12,12"
                 id="path11307" />
            </g>
            <path
               style="fill:none;stroke:#ffffff;stroke-width:2;stroke-linecap:butt;stroke-linejoin:miter;stroke-opacity:1"
               d="m 66,242 12,12"
               id="path11311" />
            <path
               style="fill:none;stroke:#ffffff;stroke-width:2;stroke-linecap:butt;stroke-linejoin:miter;stroke-opacity:1"
               d="m 70,238 12,12"
               id="path11313" />
          </g>
        </g>
      </g>
      <g
         id="g13141"
         transform="translate(-480)">
        <path
           id="path13093"
           style="display:inline;fill:#9a9996;stroke:none;stroke-width:2;stroke-linecap:round;stroke-linejoin:round;stroke-miterlimit:4;stroke-dasharray:none;stroke-dashoffset:26.4;enable-background:new"
           d="m 16,218 c 0,13.25483 10.745166,22 24,22 v -14 h 12 c 2.209139,0 4,1.79086 4,4 0,2.20914 -1.790861,4 -4,4 h -6 v 6 h 48 v -8 -8 -6 H 38 Z"
           sodipodi:nodetypes="cccssscccccccc" />
        <path
           id="path13095"
           style="display:inline;fill:url(#linearGradient13161);fill-opacity:1;stroke:none;stroke-width:2;stroke-linecap:round;stroke-linejoin:round;stroke-miterlimit:4;stroke-dasharray:none;stroke-dashoffset:26.4;enable-background:new"
           d="m 16,216 c 0,13.25483 10.745166,22 24,22 v -14 h 12 c 2.209139,0 4,1.79086 4,4 0,2.20914 -1.790861,4 -4,4 h -6 v 6 h 48 v -8 -8 -6 H 38 Z"
           sodipodi:nodetypes="cccssscccccccc" />
        <g
           id="g13103"
           transform="rotate(30,80.428204,229.99039)">
          <path
             style="fill:#9a9996;stroke:none;stroke-width:0.999996px;stroke-linecap:butt;stroke-linejoin:miter;stroke-opacity:1"
             d="m 99.5,206.59809 h -84 c 0,12 20,26 38,26 h 46 z"
             id="path13097"
             sodipodi:nodetypes="ccccc" />
          <path
             style="fill:url(#linearGradient13163);fill-opacity:1;stroke:none;stroke-width:0.999996px;stroke-linecap:butt;stroke-linejoin:miter;stroke-opacity:1"
             d="M 98,204 H 14 c 0,12 20,26 38,26 h 46 z"
             id="path13099"
             sodipodi:nodetypes="ccccc" />
          <path
             style="fill:#77767b;stroke:none;stroke-width:1px;stroke-linecap:butt;stroke-linejoin:miter;stroke-opacity:1"
             d="m 26,206 h 32 c 0,1 -2,2 -4,2 H 30 c -2,0 -4,-1 -4,-2 z"
             id="path13101"
             sodipodi:nodetypes="ccccc" />
        </g>
        <g
           id="g13109"
           transform="translate(0,2)">
          <path
             id="path13105"
             style="color:#000000;fill:url(#linearGradient13165);fill-opacity:1;stroke-width:32;stroke-linecap:round"
             d="m 109.16406,54.021484 c -1.11683,0.05851 -2.22444,0.233944 -3.30468,0.523438 -2.71328,0.726581 -5.18746,2.154644 -7.173833,4.140625 l -56,56.000003 c -1.51283,1.51874 -2.705049,3.326 -3.505859,5.31445 H 38 v 5.98047 c -0.0056,4.25038 1.680266,8.32831 4.685547,11.33398 6.248559,6.24938 16.380347,6.24938 22.628906,0 L 121.31445,81.314453 C 124.56023,78.067258 126.25467,73.582195 125.9668,69 H 126 v -6 h -1.62109 c -0.77492,-1.598281 -1.81057,-3.056372 -3.06446,-4.314453 -3.20629,-3.206109 -7.62235,-4.901262 -12.15039,-4.664063 z"
             transform="translate(-8,154)"
             sodipodi:nodetypes="sccccccscccccccs" />
          <path
             style="color:#000000;fill:#e01b24;stroke-linecap:round"
             d="m 97.859375,202.54492 a 16,16 0 0 0 -7.173828,4.14063 l -56,56 a 16,16 0 0 0 0,22.6289 16,16 0 0 0 22.628906,0 l 55.999997,-56 a 16,16 0 0 0 0,-22.6289 16,16 0 0 0 -15.455075,-4.14063 z"
             id="path13107" />
        </g>
        <g
           id="g13123"
           transform="matrix(-1,0,0,1,148,2)"
           style="stroke:#ffffff">
          <g
             id="g13121">
            <g
               id="g13115"
               style="display:inline;stroke:#ffffff;stroke-width:2;enable-background:new"
               transform="matrix(-1,0,0,1,148,0)">
              <path
                 style="fill:none;stroke:#ffffff;stroke-width:2;stroke-linecap:butt;stroke-linejoin:miter;stroke-opacity:1"
                 d="m 66,242 12,12"
                 id="path13111" />
              <path
                 style="fill:none;stroke:#ffffff;stroke-width:2;stroke-linecap:butt;stroke-linejoin:miter;stroke-opacity:1"
                 d="m 70,238 12,12"
                 id="path13113" />
            </g>
            <path
               style="fill:none;stroke:#ffffff;stroke-width:2;stroke-linecap:butt;stroke-linejoin:miter;stroke-opacity:1"
               d="m 66,242 12,12"
               id="path13117" />
            <path
               style="fill:none;stroke:#ffffff;stroke-width:2;stroke-linecap:butt;stroke-linejoin:miter;stroke-opacity:1"
               d="m 70,238 12,12"
               id="path13119" />
          </g>
        </g>
      </g>
      <path
         d="m 423.066,171.986 h -0.132 c -1.626,0 -2.934,1.332 -2.934,2.986 V 185 c 0,1.654 1.308,2.986 2.934,2.986 h 0.132 c 1.626,0 2.934,-1.332 2.934,-2.986 v -10.028 c 0,-1.654 -1.308,-2.986 -2.934,-2.986 z m -2.594,0 c -0.878,0.714 -1.469,1.793 -1.469,3 v 1 h -2.125 c 0.075,-1.092 -1.248,-2 -2,-2 -0.68,0 -1,0.012 -1,1 v 1 h -1.218 c -1.229,-0.6 -1.782,-1.969 -1.782,-2.687 0,-0.736 2.386,-1.312 3.688,-1.312 z m -1.472,5 v 4.313 c -2.766,2.662 -6.125,2.406 -6.125,2.406 0,0 -0.353,-1.52 1.906,-4.03 l 2.375,-2.689 h 1.781 c 0.023,0.003 0.043,-10e-4 0.063,0 z m -2.975,2.532 -1.685,1.738 c 1.8,0.166 2.151,-0.856 1.684,-1.737 z"
         style="display:inline;fill:#241f31;marker:none;enable-background:new"
         overflow="visible"
         color="#000000"
         fill="#474747"
         id="path18141" />
      <path
         style="display:inline;fill:#241f31;fill-opacity:1;stroke:none;stroke-width:0.999995px;stroke-linecap:butt;stroke-linejoin:miter;stroke-opacity:1;enable-background:new"
         d="m 393,172 h -13 c 0,2.30769 3.09523,5 5.88096,5 H 393 Z"
         id="path6114"
         sodipodi:nodetypes="ccccc" />
      <path
         d="m 393.066,171.986 h -0.132 c -1.626,0 -2.934,1.332 -2.934,2.986 V 185 c 0,1.654 1.308,2.986 2.934,2.986 h 0.132 c 1.626,0 2.934,-1.332 2.934,-2.986 v -10.028 c 0,-1.654 -1.308,-2.986 -2.934,-2.986 z"
         style="display:inline;fill:#241f31;marker:none;enable-background:new"
         overflow="visible"
         color="#000000"
         fill="#474747"
         id="path6116"
         sodipodi:nodetypes="sssssssss" />
      <path
         d="m 393.066,171.986 h -0.132 c -1.626,0 -2.934,1.332 -2.934,2.986 V 185 c 0,1.654 1.308,2.986 2.934,2.986 h 0.132 c 1.626,0 2.934,-1.332 2.934,-2.986 v -10.028 c 0,-1.654 -1.308,-2.986 -2.934,-2.986 z"
         style="display:inline;fill:#241f31;stroke:#f6f5f4;stroke-width:2;marker:none;enable-background:new"
         overflow="visible"
         color="#000000"
         fill="#474747"
         id="path6118"
         sodipodi:nodetypes="sssssssss" />
      <path
         d="m 393.066,171.986 h -0.132 c -1.626,0 -2.934,1.332 -2.934,2.986 V 185 c 0,1.654 1.308,2.986 2.934,2.986 h 0.132 c 1.626,0 2.934,-1.332 2.934,-2.986 v -10.028 c 0,-1.654 -1.308,-2.986 -2.934,-2.986 z"
         style="display:inline;fill:#241f31;stroke:none;stroke-width:2;marker:none;enable-background:new"
         overflow="visible"
         color="#000000"
         fill="#474747"
         id="path6120"
         sodipodi:nodetypes="sssssssss" />
      <path
         style="display:inline;fill:#f0f0f0;fill-opacity:1;stroke:none;stroke-width:0.999997px;stroke-linecap:butt;stroke-linejoin:miter;stroke-opacity:1;enable-background:new"
         d="m 382,173 h 3.84502 c 0,0.5 -0.36531,1 -0.73063,1 h -2.38376 C 382.36532,174 382,173.5 382,173 Z"
         id="path6122"
         sodipodi:nodetypes="ccccc" />
      <g
         id="g6239"
         transform="translate(180)">
        <path
           style="display:inline;fill:#241f31;fill-opacity:1;stroke:none;stroke-width:0.999995px;stroke-linecap:butt;stroke-linejoin:miter;stroke-opacity:1;enable-background:new"
           d="m 193,172 h -13 c 0,2.30769 3.09523,5 5.88096,5 H 193 Z"
           id="path6224"
           sodipodi:nodetypes="ccccc" />
        <path
           d="m 193.066,171.986 h -0.132 c -1.626,0 -2.934,1.332 -2.934,2.986 V 185 c 0,1.654 1.308,2.986 2.934,2.986 h 0.132 c 1.626,0 2.934,-1.332 2.934,-2.986 v -10.028 c 0,-1.654 -1.308,-2.986 -2.934,-2.986 z"
           style="display:inline;fill:#241f31;marker:none;enable-background:new"
           overflow="visible"
           color="#000000"
           fill="#474747"
           id="path6226"
           sodipodi:nodetypes="sssssssss" />
        <path
           d="m 193.066,171.986 h -0.132 c -1.626,0 -2.934,1.332 -2.934,2.986 V 185 c 0,1.654 1.308,2.986 2.934,2.986 h 0.132 c 1.626,0 2.934,-1.332 2.934,-2.986 v -10.028 c 0,-1.654 -1.308,-2.986 -2.934,-2.986 z"
           style="display:inline;fill:#241f31;stroke:#f6f5f4;stroke-width:2;marker:none;enable-background:new"
           overflow="visible"
           color="#000000"
           fill="#474747"
           id="path6228"
           sodipodi:nodetypes="sssssssss" />
        <path
           d="m 193.066,171.986 h -0.132 c -1.626,0 -2.934,1.332 -2.934,2.986 V 185 c 0,1.654 1.308,2.986 2.934,2.986 h 0.132 c 1.626,0 2.934,-1.332 2.934,-2.986 v -10.028 c 0,-1.654 -1.308,-2.986 -2.934,-2.986 z"
           style="display:inline;fill:#241f31;stroke:none;stroke-width:2;marker:none;enable-background:new"
           overflow="visible"
           color="#000000"
           fill="#474747"
           id="path6230"
           sodipodi:nodetypes="sssssssss" />
        <path
           style="display:inline;fill:#f0f0f0;fill-opacity:1;stroke:none;stroke-width:0.999997px;stroke-linecap:butt;stroke-linejoin:miter;stroke-opacity:1;enable-background:new"
           d="m 182,173 h 3.84502 c 0,0.5 -0.36531,1 -0.73063,1 h -2.38376 C 182.36532,174 182,173.5 182,173 Z"
           id="path6232"
           sodipodi:nodetypes="ccccc" />
      </g>
      <path
         d="m 173.066,171.986 h -0.132 c -1.626,0 -2.934,1.332 -2.934,2.986 V 185 c 0,1.654 1.308,2.986 2.934,2.986 h 0.132 c 1.626,0 2.934,-1.332 2.934,-2.986 v -10.028 c 0,-1.654 -1.308,-2.986 -2.934,-2.986 z m -2.594,0 c -0.878,0.714 -1.469,1.793 -1.469,3 v 1 h -2.125 c 0.075,-1.092 -1.248,-2 -2,-2 -0.68,0 -1,0.012 -1,1 v 1 h -1.218 c -1.229,-0.6 -1.782,-1.969 -1.782,-2.687 0,-0.736 2.386,-1.312 3.688,-1.312 z m -1.472,5 v 4.313 c -2.766,2.662 -6.125,2.406 -6.125,2.406 0,0 -0.353,-1.52 1.906,-4.03 l 2.375,-2.689 h 1.781 c 0.023,0.003 0.043,-10e-4 0.063,0 z m -2.975,2.532 -1.685,1.738 c 1.8,0.166 2.151,-0.856 1.684,-1.737 z"
         style="display:inline;fill:#241f31;marker:none;enable-background:new"
         overflow="visible"
         color="#000000"
         fill="#474747"
         id="path6357" />
    </g>
    <g
       sodipodi:insensitive="true"
       style="display:none"
       inkscape:label="grid"
       id="layer3"
       inkscape:groupmode="layer">
      <circle
         style="display:inline;opacity:0.1;vector-effect:none;fill:none;fill-opacity:1;stroke:#000000;stroke-width:0.99;stroke-linecap:butt;stroke-linejoin:miter;stroke-miterlimit:4;stroke-dasharray:0.99, 0.99;stroke-dashoffset:0;stroke-opacity:1;marker:none;marker-start:none;marker-mid:none;marker-end:none;paint-order:normal;enable-background:new"
         id="circle2892"
         r="59.504131"
         cy="236"
         cx="64.000031" />
      <rect
         style="display:inline;opacity:0.1;vector-effect:none;fill:none;fill-opacity:1;stroke:#000000;stroke-width:0.99;stroke-linecap:butt;stroke-linejoin:miter;stroke-miterlimit:4;stroke-dasharray:0.99, 0.99;stroke-dashoffset:0;stroke-opacity:1;marker:none;marker-start:none;marker-mid:none;marker-end:none;paint-order:normal;enable-background:new"
         id="rect2894"
         width="87.009987"
         height="111.01005"
         x="20.495007"
         y="180.49496"
         rx="8.701004"
         ry="7.9292889" />
      <rect
         style="display:inline;opacity:0.1;vector-effect:none;fill:none;fill-opacity:1;stroke:#000000;stroke-width:0.99;stroke-linecap:butt;stroke-linejoin:miter;stroke-miterlimit:4;stroke-dasharray:0.99, 0.99;stroke-dashoffset:0;stroke-opacity:1;marker:none;marker-start:none;marker-mid:none;marker-end:none;paint-order:normal;enable-background:new"
         id="rect2896"
         width="103.00952"
         height="103.00952"
         x="12.495266"
         y="184.49524"
         rx="7.9238095"
         ry="7.9238095" />
      <rect
         style="display:inline;opacity:0.1;vector-effect:none;fill:none;fill-opacity:1;stroke:#000000;stroke-width:0.99;stroke-linecap:butt;stroke-linejoin:miter;stroke-miterlimit:4;stroke-dasharray:0.99, 0.99;stroke-dashoffset:0;stroke-opacity:1;marker:none;marker-start:none;marker-mid:none;marker-end:none;paint-order:normal;enable-background:new"
         id="rect2898"
         width="111.01004"
         height="87.010048"
         x="8.4950066"
         y="200.49496"
         rx="7.9292889"
         ry="8.701005" />
      <path
         style="display:inline;fill:none;stroke:#62a0ea;stroke-width:2;stroke-linecap:butt;stroke-linejoin:miter;stroke-miterlimit:4;stroke-dasharray:none;stroke-opacity:1;enable-background:new"
         d="M 2.6203015e-5,288.99999 H 128.00003"
         id="path2900"
         inkscape:connector-curvature="0" />
    </g>
  </g>
</svg>
