<?xml version="1.0" encoding="UTF-8" standalone="no"?>
<svg
   xmlns:dc="http://purl.org/dc/elements/1.1/"
   xmlns:cc="http://creativecommons.org/ns#"
   xmlns:rdf="http://www.w3.org/1999/02/22-rdf-syntax-ns#"
   xmlns:svg="http://www.w3.org/2000/svg"
   xmlns="http://www.w3.org/2000/svg"
   xmlns:xlink="http://www.w3.org/1999/xlink"
   xmlns:sodipodi="http://sodipodi.sourceforge.net/DTD/sodipodi-0.dtd"
   xmlns:inkscape="http://www.inkscape.org/namespaces/inkscape"
   viewBox="0 0 128 128"
   style="display:inline;enable-background:new"
   version="1.0"
   inkscape:output_extension="org.inkscape.output.svg.inkscape"
   sodipodi:docname="org.gnome.CandyStore.svg"
   inkscape:version="0.92.4 5da689c313, 2019-01-14"
   sodipodi:version="0.32"
   id="svg11300"
   height="128"
   width="128"
   inkscape:export-filename="Template.png"
   inkscape:export-xdpi="96"
   inkscape:export-ydpi="96">
  <title
     id="title4162">Adwaita Icon Template</title>
  <defs
     id="defs3">
    <linearGradient
       inkscape:collect="always"
       id="linearGradient1126">
      <stop
         style="stop-color:#c0bfbc;stop-opacity:1"
         offset="0"
         id="stop1114" />
      <stop
         id="stop1116"
         offset="0.04166667"
         style="stop-color:#deddda;stop-opacity:1" />
      <stop
         style="stop-color:#c0bfbc;stop-opacity:1"
         offset="0.08333334"
         id="stop1118" />
      <stop
         id="stop1120"
         offset="0.91666669"
         style="stop-color:#c0bfbc;stop-opacity:1" />
      <stop
         style="stop-color:#deddda;stop-opacity:1"
         offset="0.95833331"
         id="stop1122" />
      <stop
         style="stop-color:#9a9996;stop-opacity:1"
         offset="1"
         id="stop1124" />
    </linearGradient>
    <linearGradient
       inkscape:collect="always"
       id="linearGradient1125">
      <stop
         style="stop-color:#3584e4;stop-opacity:1"
         offset="0"
         id="stop1113" />
      <stop
         id="stop1115"
         offset="0.04166667"
         style="stop-color:#62a0ea;stop-opacity:1" />
      <stop
         style="stop-color:#1c71d8;stop-opacity:1"
         offset="0.08333334"
         id="stop1117" />
      <stop
         id="stop1119"
         offset="0.91666669"
         style="stop-color:#1c71d8;stop-opacity:1" />
      <stop
         style="stop-color:#62a0ea;stop-opacity:1"
         offset="0.95833331"
         id="stop1121" />
      <stop
         style="stop-color:#1c71d8;stop-opacity:1"
         offset="1"
         id="stop1123" />
    </linearGradient>
    <linearGradient
       id="linearGradient1014"
       inkscape:collect="always">
      <stop
         id="stop1010"
         offset="0"
         style="stop-color:#bbdef9;stop-opacity:1" />
      <stop
         id="stop1012"
         offset="1"
         style="stop-color:#deeffb;stop-opacity:1" />
    </linearGradient>
    <linearGradient
       id="linearGradient898"
       inkscape:collect="always">
      <stop
         id="stop894"
         offset="0"
         style="stop-color:#fed5ae;stop-opacity:1;" />
      <stop
         id="stop896"
         offset="1"
         style="stop-color:#feddbe;stop-opacity:1" />
    </linearGradient>
    <linearGradient
       id="linearGradient1494"
       inkscape:collect="always">
      <stop
         id="stop1490"
         offset="0"
         style="stop-color:#babdb6;stop-opacity:1;" />
      <stop
         id="stop1492"
         offset="1"
         style="stop-color:#babdb6;stop-opacity:0;" />
    </linearGradient>
    <linearGradient
       gradientUnits="userSpaceOnUse"
       y2="20"
       x2="280"
       y1="172"
       x1="280"
       id="linearGradient1496"
       xlink:href="#linearGradient1494"
       inkscape:collect="always" />
    <clipPath
       id="clipPath940"
       clipPathUnits="userSpaceOnUse">
      <rect
         style="opacity:0.1;fill:#000000;fill-opacity:1;stroke:none;stroke-width:4.23333311;stroke-linecap:butt;stroke-linejoin:miter;stroke-miterlimit:4;stroke-dasharray:none;stroke-dashoffset:0;stroke-opacity:1;marker:none;marker-start:none;marker-mid:none;marker-end:none;paint-order:normal"
         id="rect942"
         width="126.99947"
         height="31.75"
         x="140.59975"
         y="436.16724"
         rx="8.4666662"
         ry="8.4666662" />
    </clipPath>
    <clipPath
       id="clipPath920"
       clipPathUnits="userSpaceOnUse">
      <rect
         ry="8.4666662"
         rx="8.4666662"
         y="250.92276"
         x="140.59975"
         height="31.75"
         width="126.99947"
         id="rect922"
         style="opacity:0.1;fill:#000000;fill-opacity:1;stroke:none;stroke-width:4.23333311;stroke-linecap:butt;stroke-linejoin:miter;stroke-miterlimit:4;stroke-dasharray:none;stroke-dashoffset:0;stroke-opacity:1;marker:none;marker-start:none;marker-mid:none;marker-end:none;paint-order:normal" />
    </clipPath>
    <clipPath
       id="clipPath936"
       clipPathUnits="userSpaceOnUse">
      <rect
         ry="8.4666662"
         rx="8.4666662"
         y="399.46786"
         x="140.59975"
         height="31.75"
         width="126.99947"
         id="rect938"
         style="opacity:0.1;fill:#000000;fill-opacity:1;stroke:none;stroke-width:4.23333311;stroke-linecap:butt;stroke-linejoin:miter;stroke-miterlimit:4;stroke-dasharray:none;stroke-dashoffset:0;stroke-opacity:1;marker:none;marker-start:none;marker-mid:none;marker-end:none;paint-order:normal" />
    </clipPath>
    <clipPath
       id="clipPath898"
       clipPathUnits="userSpaceOnUse">
      <rect
         ry="8.4666662"
         rx="8.4666662"
         y="214.22339"
         x="140.59975"
         height="31.75"
         width="126.99947"
         id="rect900"
         style="opacity:0.1;fill:#000000;fill-opacity:1;stroke:none;stroke-width:4.23333311;stroke-linecap:butt;stroke-linejoin:miter;stroke-miterlimit:4;stroke-dasharray:none;stroke-dashoffset:0;stroke-opacity:1;marker:none;marker-start:none;marker-mid:none;marker-end:none;paint-order:normal" />
    </clipPath>
    <clipPath
       id="clipPath924"
       clipPathUnits="userSpaceOnUse">
      <rect
         style="opacity:0.1;fill:#000000;fill-opacity:1;stroke:none;stroke-width:4.23333311;stroke-linecap:butt;stroke-linejoin:miter;stroke-miterlimit:4;stroke-dasharray:none;stroke-dashoffset:0;stroke-opacity:1;marker:none;marker-start:none;marker-mid:none;marker-end:none;paint-order:normal"
         id="rect926"
         width="126.99947"
         height="31.75"
         x="140.59975"
         y="288.20465"
         rx="8.4666662"
         ry="8.4666662" />
    </clipPath>
    <clipPath
       id="clipPath928"
       clipPathUnits="userSpaceOnUse">
      <rect
         ry="8.4666662"
         rx="8.4666662"
         y="324.90402"
         x="140.59975"
         height="31.75"
         width="126.99947"
         id="rect930"
         style="opacity:0.1;fill:#000000;fill-opacity:1;stroke:none;stroke-width:4.23333311;stroke-linecap:butt;stroke-linejoin:miter;stroke-miterlimit:4;stroke-dasharray:none;stroke-dashoffset:0;stroke-opacity:1;marker:none;marker-start:none;marker-mid:none;marker-end:none;paint-order:normal" />
    </clipPath>
    <clipPath
       id="clipPath932"
       clipPathUnits="userSpaceOnUse">
      <rect
         style="opacity:0.1;fill:#000000;fill-opacity:1;stroke:none;stroke-width:4.23333311;stroke-linecap:butt;stroke-linejoin:miter;stroke-miterlimit:4;stroke-dasharray:none;stroke-dashoffset:0;stroke-opacity:1;marker:none;marker-start:none;marker-mid:none;marker-end:none;paint-order:normal"
         id="rect934"
         width="126.99947"
         height="31.75"
         x="140.59975"
         y="362.18594"
         rx="8.4666662"
         ry="8.4666662" />
    </clipPath>
    <clipPath
       id="clipPath944"
       clipPathUnits="userSpaceOnUse">
      <rect
         ry="8.4666662"
         rx="8.4666662"
         y="473.44913"
         x="140.59975"
         height="31.75"
         width="253.86797"
         id="rect946"
         style="opacity:0.1;fill:#000000;fill-opacity:1;stroke:none;stroke-width:4.23333311;stroke-linecap:butt;stroke-linejoin:miter;stroke-miterlimit:4;stroke-dasharray:none;stroke-dashoffset:0;stroke-opacity:1;marker:none;marker-start:none;marker-mid:none;marker-end:none;paint-order:normal" />
    </clipPath>
    <clipPath
       clipPathUnits="userSpaceOnUse"
       id="clipPath898-3">
      <rect
         style="opacity:0.1;fill:#000000;fill-opacity:1;stroke:none;stroke-width:4.23333311;stroke-linecap:butt;stroke-linejoin:miter;stroke-miterlimit:4;stroke-dasharray:none;stroke-dashoffset:0;stroke-opacity:1;marker:none;marker-start:none;marker-mid:none;marker-end:none;paint-order:normal"
         id="rect900-6"
         width="126.99947"
         height="31.75"
         x="140.59975"
         y="214.22339"
         rx="8.4666662"
         ry="8.4666662" />
    </clipPath>
    <clipPath
       clipPathUnits="userSpaceOnUse"
       id="clipPath920-7">
      <rect
         style="opacity:0.1;fill:#000000;fill-opacity:1;stroke:none;stroke-width:4.23333311;stroke-linecap:butt;stroke-linejoin:miter;stroke-miterlimit:4;stroke-dasharray:none;stroke-dashoffset:0;stroke-opacity:1;marker:none;marker-start:none;marker-mid:none;marker-end:none;paint-order:normal"
         id="rect922-5"
         width="126.99947"
         height="31.75"
         x="140.59975"
         y="250.92276"
         rx="8.4666662"
         ry="8.4666662" />
    </clipPath>
    <clipPath
       clipPathUnits="userSpaceOnUse"
       id="clipPath924-3">
      <rect
         ry="8.4666662"
         rx="8.4666662"
         y="288.20465"
         x="140.59975"
         height="31.75"
         width="126.99947"
         id="rect926-5"
         style="opacity:0.1;fill:#000000;fill-opacity:1;stroke:none;stroke-width:4.23333311;stroke-linecap:butt;stroke-linejoin:miter;stroke-miterlimit:4;stroke-dasharray:none;stroke-dashoffset:0;stroke-opacity:1;marker:none;marker-start:none;marker-mid:none;marker-end:none;paint-order:normal" />
    </clipPath>
    <clipPath
       clipPathUnits="userSpaceOnUse"
       id="clipPath928-6">
      <rect
         style="opacity:0.1;fill:#000000;fill-opacity:1;stroke:none;stroke-width:4.23333311;stroke-linecap:butt;stroke-linejoin:miter;stroke-miterlimit:4;stroke-dasharray:none;stroke-dashoffset:0;stroke-opacity:1;marker:none;marker-start:none;marker-mid:none;marker-end:none;paint-order:normal"
         id="rect930-2"
         width="126.99947"
         height="31.75"
         x="140.59975"
         y="324.90402"
         rx="8.4666662"
         ry="8.4666662" />
    </clipPath>
    <clipPath
       clipPathUnits="userSpaceOnUse"
       id="clipPath932-9">
      <rect
         ry="8.4666662"
         rx="8.4666662"
         y="362.18594"
         x="140.59975"
         height="31.75"
         width="126.99947"
         id="rect934-1"
         style="opacity:0.1;fill:#000000;fill-opacity:1;stroke:none;stroke-width:4.23333311;stroke-linecap:butt;stroke-linejoin:miter;stroke-miterlimit:4;stroke-dasharray:none;stroke-dashoffset:0;stroke-opacity:1;marker:none;marker-start:none;marker-mid:none;marker-end:none;paint-order:normal" />
    </clipPath>
    <clipPath
       clipPathUnits="userSpaceOnUse"
       id="clipPath936-2">
      <rect
         style="opacity:0.1;fill:#000000;fill-opacity:1;stroke:none;stroke-width:4.23333311;stroke-linecap:butt;stroke-linejoin:miter;stroke-miterlimit:4;stroke-dasharray:none;stroke-dashoffset:0;stroke-opacity:1;marker:none;marker-start:none;marker-mid:none;marker-end:none;paint-order:normal"
         id="rect938-7"
         width="126.99947"
         height="31.75"
         x="140.59975"
         y="399.46786"
         rx="8.4666662"
         ry="8.4666662" />
    </clipPath>
    <clipPath
       clipPathUnits="userSpaceOnUse"
       id="clipPath940-0">
      <rect
         ry="8.4666662"
         rx="8.4666662"
         y="436.16724"
         x="140.59975"
         height="31.75"
         width="126.99947"
         id="rect942-9"
         style="opacity:0.1;fill:#000000;fill-opacity:1;stroke:none;stroke-width:4.23333311;stroke-linecap:butt;stroke-linejoin:miter;stroke-miterlimit:4;stroke-dasharray:none;stroke-dashoffset:0;stroke-opacity:1;marker:none;marker-start:none;marker-mid:none;marker-end:none;paint-order:normal" />
    </clipPath>
    <clipPath
       clipPathUnits="userSpaceOnUse"
       id="clipPath944-3">
      <rect
         style="opacity:0.1;fill:#000000;fill-opacity:1;stroke:none;stroke-width:4.23333311;stroke-linecap:butt;stroke-linejoin:miter;stroke-miterlimit:4;stroke-dasharray:none;stroke-dashoffset:0;stroke-opacity:1;marker:none;marker-start:none;marker-mid:none;marker-end:none;paint-order:normal"
         id="rect946-6"
         width="253.86797"
         height="31.75"
         x="140.59975"
         y="473.44913"
         rx="8.4666662"
         ry="8.4666662" />
    </clipPath>
    <linearGradient
       y2="203.74754"
       x2="256.04312"
       y1="-148.25246"
       x1="256.04312"
       gradientTransform="matrix(1,0,0,0.99916076,-63.999999,148.17114)"
       gradientUnits="userSpaceOnUse"
       id="linearGradient1232-8"
       xlink:href="#linearGradient1014"
       inkscape:collect="always" />
    <linearGradient
       gradientTransform="matrix(0.24999998,0,0,0.24999998,-16.0109,37.06311)"
       gradientUnits="userSpaceOnUse"
       y2="186.22676"
       x2="256.04312"
       y1="-204.09633"
       x1="256.04312"
       id="linearGradient900-7"
       xlink:href="#linearGradient898"
       inkscape:collect="always" />
    <clipPath
       id="clipPath901"
       clipPathUnits="userSpaceOnUse">
      <path
         inkscape:connector-curvature="0"
         style="display:inline;opacity:1;fill:#81dffe;fill-opacity:1;stroke:none;stroke-width:0.00498205px;stroke-linecap:butt;stroke-linejoin:miter;stroke-miterlimit:4;stroke-dasharray:none;stroke-dashoffset:0;stroke-opacity:1;marker:none;marker-start:none;marker-mid:none;marker-end:none;paint-order:normal;enable-background:new"
         d="m 12,20 v 88 8 h 104 v -8 -88 z"
         id="path903" />
    </clipPath>
    <clipPath
       id="clipPath2417"
       clipPathUnits="userSpaceOnUse">
      <rect
         style="opacity:1;fill:#3584e4;fill-opacity:1;stroke:none;stroke-width:16;stroke-linecap:round;stroke-linejoin:round;stroke-miterlimit:4;stroke-dasharray:none;stroke-dashoffset:0;stroke-opacity:1"
         id="rect2419"
         width="72"
         height="26"
         x="28"
         y="198"
         ry="5.3448386" />
    </clipPath>
    <clipPath
       id="clipPath1024"
       clipPathUnits="userSpaceOnUse">
      <rect
         style="opacity:1;fill:#3584e4;fill-opacity:1;stroke:none;stroke-width:16;stroke-linecap:round;stroke-linejoin:round;stroke-miterlimit:4;stroke-dasharray:none;stroke-dashoffset:0;stroke-opacity:1"
         id="rect1022"
         width="72"
         height="26"
         x="28"
         y="198"
         ry="5.3448386" />
    </clipPath>
    <linearGradient
       gradientTransform="translate(0,140)"
       gradientUnits="userSpaceOnUse"
       y2="280"
       x2="116"
       y1="280"
       x1="12"
       id="linearGradient1057"
       xlink:href="#linearGradient1125"
       inkscape:collect="always" />
    <clipPath
       clipPathUnits="userSpaceOnUse"
       id="clipPath1088">
      <rect
         ry="4"
         y="28"
         x="12"
         height="88"
         width="104"
         id="rect1090"
         style="opacity:1;vector-effect:none;fill:#f6f5f4;fill-opacity:1;stroke:none;stroke-width:27.71278;stroke-linecap:butt;stroke-linejoin:round;stroke-miterlimit:4;stroke-dasharray:none;stroke-dashoffset:0;stroke-opacity:1;marker:none;marker-start:none;marker-mid:none;marker-end:none;paint-order:normal" />
    </clipPath>
    <linearGradient
       inkscape:collect="always"
       xlink:href="#linearGradient1126"
       id="linearGradient1112"
       x1="12"
       y1="248"
       x2="116"
       y2="248"
       gradientUnits="userSpaceOnUse"
       gradientTransform="translate(0,-4)" />
  </defs>
  <sodipodi:namedview
     inkscape:document-rotation="0"
     borderlayer="true"
     inkscape:snap-midpoints="true"
     inkscape:snap-object-midpoints="true"
     inkscape:snap-center="true"
     inkscape:snap-text-baseline="true"
     inkscape:bbox-paths="true"
     inkscape:snap-smooth-nodes="true"
     showborder="false"
     inkscape:snap-bbox-midpoints="true"
     inkscape:snap-bbox-edge-midpoints="true"
     inkscape:snap-intersection-paths="true"
     inkscape:object-paths="true"
     inkscape:snap-global="true"
     inkscape:bbox-nodes="true"
     inkscape:object-nodes="true"
     inkscape:measure-end="0,0"
     inkscape:measure-start="0,0"
     inkscape:locked="false"
     inkscape:guide-bbox="true"
     showguides="false"
     inkscape:pagecheckerboard="true"
     inkscape:window-maximized="1"
     guidetolerance="13"
     gridtolerance="12"
     objecttolerance="7"
     inkscape:snap-bbox="false"
     inkscape:snap-nodes="true"
     height="300px"
     width="400px"
     inkscape:window-y="27"
     inkscape:window-x="0"
     inkscape:window-height="1016"
     inkscape:window-width="1920"
     inkscape:showpageshadow="false"
     inkscape:document-units="px"
     inkscape:grid-bbox="true"
     showgrid="false"
     inkscape:current-layer="layer9"
     inkscape:cy="52.811706"
     inkscape:cx="107.16378"
     inkscape:zoom="4"
     inkscape:pageshadow="2"
     inkscape:pageopacity="0"
     borderopacity="0.25490196"
     bordercolor="#666666"
     pagecolor="#ffffff"
     id="base"
     fill="#f57900"
     stroke="#ef2929">
    <inkscape:grid
       originy="0"
       originx="0"
       empspacing="4"
       visible="true"
       enabled="true"
       spacingy="2"
       spacingx="2"
       id="grid5883"
       type="xygrid" />
    <sodipodi:guide
       inkscape:locked="false"
       id="guide1073"
       orientation="0,1"
       position="216,216" />
    <sodipodi:guide
       inkscape:locked="false"
       id="guide1075"
       orientation="1,0"
       position="216.00001,216" />
    <sodipodi:guide
       inkscape:locked="false"
       id="guide1099"
       orientation="0,1"
       position="212.48559,512" />
    <sodipodi:guide
       inkscape:locked="false"
       id="guide993"
       orientation="0,1"
       position="424,272" />
    <sodipodi:guide
       inkscape:locked="false"
       id="guide995"
       orientation="1,0"
       position="424.00001,272" />
  </sodipodi:namedview>
  <metadata
     id="metadata4">
    <rdf:RDF>
      <cc:Work
         rdf:about="">
        <dc:format>image/svg+xml</dc:format>
        <dc:type
           rdf:resource="http://purl.org/dc/dcmitype/StillImage" />
        <dc:creator>
          <cc:Agent>
            <dc:title>GNOME Design Team</dc:title>
          </cc:Agent>
        </dc:creator>
        <dc:source />
        <cc:license
           rdf:resource="http://creativecommons.org/licenses/by-sa/4.0/" />
        <dc:title>Adwaita Icon Template</dc:title>
        <dc:subject>
          <rdf:Bag />
        </dc:subject>
        <dc:date />
        <dc:rights>
          <cc:Agent>
            <dc:title />
          </cc:Agent>
        </dc:rights>
        <dc:publisher>
          <cc:Agent>
            <dc:title />
          </cc:Agent>
        </dc:publisher>
        <dc:identifier />
        <dc:relation />
        <dc:language />
        <dc:coverage />
        <dc:description />
        <dc:contributor>
          <cc:Agent>
            <dc:title />
          </cc:Agent>
        </dc:contributor>
      </cc:Work>
      <cc:License
         rdf:about="http://creativecommons.org/licenses/by-sa/4.0/">
        <cc:permits
           rdf:resource="http://creativecommons.org/ns#Reproduction" />
        <cc:permits
           rdf:resource="http://creativecommons.org/ns#Distribution" />
        <cc:requires
           rdf:resource="http://creativecommons.org/ns#Notice" />
        <cc:requires
           rdf:resource="http://creativecommons.org/ns#Attribution" />
        <cc:permits
           rdf:resource="http://creativecommons.org/ns#DerivativeWorks" />
        <cc:requires
           rdf:resource="http://creativecommons.org/ns#ShareAlike" />
      </cc:License>
    </rdf:RDF>
  </metadata>
  <g
     transform="translate(0,-172)"
     style="display:inline"
     inkscape:groupmode="layer"
     inkscape:label="Software"
     id="layer1">
    <g
       sodipodi:insensitive="true"
       style="display:none"
       inkscape:label="baseplate"
       id="layer2"
       inkscape:groupmode="layer">
      <rect
         inkscape:label="512x512"
         y="172"
         x="9.2651362e-08"
         height="128"
         width="128"
         id="rect13805"
         style="display:inline;overflow:visible;visibility:visible;fill:#f0f0f0;fill-opacity:1;fill-rule:nonzero;stroke:none;stroke-width:0.5;marker:none;enable-background:accumulate" />
      <g
         transform="matrix(0.25,0,0,0.25,6.9488522e-8,225)"
         id="g1168"
         style="display:inline;enable-background:new">
        <rect
           style="opacity:0.1;fill:#2864b0;fill-opacity:1;stroke:none;stroke-width:1;stroke-linecap:butt;stroke-linejoin:miter;stroke-miterlimit:4;stroke-dasharray:none;stroke-dashoffset:0;stroke-opacity:1;marker:none;marker-start:none;marker-mid:none;marker-end:none;paint-order:normal"
           id="rect1110"
           width="319.99979"
           height="448"
           x="96"
           y="-180"
           rx="32"
           ry="32" />
        <rect
           style="display:inline;opacity:0.1;fill:#2864b0;fill-opacity:1;stroke:none;stroke-width:1;stroke-linecap:butt;stroke-linejoin:miter;stroke-miterlimit:4;stroke-dasharray:none;stroke-dashoffset:0;stroke-opacity:1;marker:none;marker-start:none;marker-mid:none;marker-end:none;paint-order:normal;enable-background:new"
           id="rect1110-8"
           width="416"
           height="416"
           x="48"
           y="-164"
           rx="32"
           ry="32" />
        <rect
           style="display:inline;opacity:0.1;fill:#2864b0;fill-opacity:1;stroke:none;stroke-width:1;stroke-linecap:butt;stroke-linejoin:miter;stroke-miterlimit:4;stroke-dasharray:none;stroke-dashoffset:0;stroke-opacity:1;marker:none;marker-start:none;marker-mid:none;marker-end:none;paint-order:normal;enable-background:new"
           id="rect1110-8-9"
           width="448"
           height="320"
           x="32"
           y="-116"
           rx="32"
           ry="32" />
        <circle
           style="opacity:0.1;fill:#2864b0;fill-opacity:1;stroke:none;stroke-width:1;stroke-linecap:butt;stroke-linejoin:miter;stroke-miterlimit:4;stroke-dasharray:none;stroke-dashoffset:0;stroke-opacity:1;marker:none;marker-start:none;marker-mid:none;marker-end:none;paint-order:normal"
           id="path1142"
           r="240"
           cy="44"
           cx="256" />
      </g>
      <rect
         style="display:inline;overflow:visible;visibility:visible;fill:#f0f0f0;fill-opacity:1;fill-rule:nonzero;stroke:none;stroke-width:0.5;marker:none;enable-background:accumulate"
         id="symbolic-3"
         width="16"
         height="16"
         x="160"
         y="172"
         inkscape:label="0" />
    </g>
    <g
       sodipodi:insensitive="true"
       inkscape:label="template"
       id="layer3"
       inkscape:groupmode="layer"
       style="display:none">
      <rect
         style="display:inline;overflow:visible;visibility:visible;fill:#f0f0f0;fill-opacity:0;fill-rule:nonzero;stroke:none;stroke-width:0.5;marker:none;enable-background:accumulate"
         id="hicolor"
         width="128"
         height="128"
         x="0"
         y="172"
         inkscape:label="0" />
      <rect
         inkscape:label="0"
         y="172"
         x="160"
         height="16"
         width="16"
         id="symbolic"
         style="display:inline;overflow:visible;visibility:visible;fill:#f0f0f0;fill-opacity:0;fill-rule:nonzero;stroke:none;stroke-width:0.5;marker:none;enable-background:accumulate" />
    </g>
    <g
       style="display:inline"
       inkscape:label="icons"
       id="layer9"
       inkscape:groupmode="layer">
      <path
         id="path1102"
         d="m 16,200 c -2.216,0 -4,1.784 -4,4 v 80 c 0,2.216 1.784,4 4,4 h 96 c 2.216,0 4,-1.784 4,-4 v -80 c 0,-2.216 -1.784,-4 -4,-4 z m 8,40 h 40 v 32 H 24 Z"
         style="opacity:1;vector-effect:none;fill:url(#linearGradient1112);fill-opacity:1;stroke:none;stroke-width:27.71278;stroke-linecap:butt;stroke-linejoin:round;stroke-miterlimit:4;stroke-dasharray:none;stroke-dashoffset:0;stroke-opacity:1;marker:none;marker-start:none;marker-mid:none;marker-end:none;paint-order:normal"
         inkscape:connector-curvature="0"
         sodipodi:nodetypes="sssssssssccccc" />
      <g
         inkscape:transform-center-x="-56.112896"
         inkscape:transform-center-y="101.02853"
         transform="rotate(-30,403.50258,307.81151)"
         id="g1710" />
      <path
         inkscape:connector-curvature="0"
         style="color:#000000;display:inline;overflow:visible;visibility:visible;opacity:1;fill:#bebebe;fill-opacity:1;fill-rule:nonzero;stroke:none;stroke-width:1;marker:none;enable-background:accumulate;stop-opacity:1"
         d="m 168,172 c -1.65335,0 -3,1.34665 -3,3 v 1 h -1.90625 C 162.48781,176 162,176.48781 162,177.09375 v 9.8125 c 0,0.60594 0.48781,1.09375 1.09375,1.09375 h 9.8125 C 173.51219,188 174,187.51219 174,186.90625 v -9.8125 C 174,176.48781 173.51219,176 172.90625,176 H 171 v -1 c 0,-1.65335 -1.34665,-3 -3,-3 z m 0,1 c 1.11665,0 2,0.88335 2,2 v 1 h -4 v -1 c 0,-1.11665 0.88335,-2 2,-2 z m -2.53125,4 c 0.28679,0 0.53125,0.22386 0.53125,0.5 0,0.27614 -0.24446,0.5 -0.53125,0.5 -0.28679,0 -0.5,-0.22386 -0.5,-0.5 0,-0.27614 0.21321,-0.5 0.5,-0.5 z m 5,0 c 0.28679,0 0.53125,0.22386 0.53125,0.5 0,0.27614 -0.24446,0.5 -0.53125,0.5 -0.28679,0 -0.5,-0.22386 -0.5,-0.5 0,-0.27614 0.21321,-0.5 0.5,-0.5 z"
         id="rect43509-3-4-3"
         inkscape:label="gnome-software" />
      <rect
         y="240"
         x="24"
         height="28"
         width="40"
         id="rect1071"
         style="opacity:0.8;fill:#98c1f1;fill-opacity:1;stroke:none;stroke-width:3.99999976;stroke-linecap:round;stroke-linejoin:round;stroke-miterlimit:4;stroke-dasharray:3.99999976, 3.99999976;stroke-dashoffset:3.99999976;stroke-opacity:1" />
      <path
         style="opacity:1;vector-effect:none;fill:#f6f5f4;fill-opacity:1;stroke:none;stroke-width:27.71278;stroke-linecap:butt;stroke-linejoin:round;stroke-miterlimit:4;stroke-dasharray:none;stroke-dashoffset:0;stroke-opacity:1;marker:none;marker-start:none;marker-mid:none;marker-end:none;paint-order:normal"
         d="m 16,196 c -2.216,0 -4,1.784 -4,4 v 80 c 0,2.216 1.784,4 4,4 h 96 c 2.216,0 4,-1.784 4,-4 v -80 c 0,-2.216 -1.784,-4 -4,-4 z m 8,40 h 40 v 32 H 24 Z"
         id="rect1038"
         inkscape:connector-curvature="0" />
      <rect
         ry="12"
         y="204"
         x="76"
         height="24"
         width="24"
         id="rect1056"
         style="opacity:1;fill:#deddda;fill-opacity:1;stroke:none;stroke-width:3.99999976;stroke-linecap:round;stroke-linejoin:round;stroke-miterlimit:4;stroke-dasharray:3.99999978, 3.99999978;stroke-dashoffset:3.99999976;stroke-opacity:1" />
      <rect
         style="opacity:1;fill:#ed333b;fill-opacity:1;stroke:none;stroke-width:3.99999976;stroke-linecap:round;stroke-linejoin:round;stroke-miterlimit:4;stroke-dasharray:3.99999978, 3.99999978;stroke-dashoffset:3.99999976;stroke-opacity:1"
         id="rect1052"
         width="24"
         height="24"
         x="52"
         y="204"
         ry="12" />
      <rect
         style="opacity:1;fill:#ed333b;fill-opacity:1;stroke:none;stroke-width:3.99999976;stroke-linecap:round;stroke-linejoin:round;stroke-miterlimit:4;stroke-dasharray:3.99999978, 3.99999978;stroke-dashoffset:3.99999976;stroke-opacity:1"
         id="rect1043"
         width="24"
         height="24"
         x="4"
         y="204"
         ry="12" />
      <rect
         ry="12"
         y="204"
         x="28"
         height="24"
         width="24"
         id="rect1047"
         style="opacity:1;fill:#deddda;fill-opacity:1;stroke:none;stroke-width:3.99999976;stroke-linecap:round;stroke-linejoin:round;stroke-miterlimit:4;stroke-dasharray:3.99999978, 3.99999978;stroke-dashoffset:3.99999976;stroke-opacity:1" />
      <rect
         style="opacity:1;fill:#ed333b;fill-opacity:1;stroke:none;stroke-width:3.99999976;stroke-linecap:round;stroke-linejoin:round;stroke-miterlimit:4;stroke-dasharray:3.99999978, 3.99999978;stroke-dashoffset:3.99999976;stroke-opacity:1"
         id="rect1060"
         width="24"
         height="24"
         x="100"
         y="204"
         ry="12" />
      <path
         style="opacity:1;fill:#f66151;fill-opacity:1;stroke:none;stroke-width:3.99999976;stroke-linecap:round;stroke-linejoin:round;stroke-miterlimit:4;stroke-dasharray:3.99999976, 3.99999976;stroke-dashoffset:3.99999976;stroke-opacity:1"
         d="M 10 12 C 6.676 12 4 14.676 4 18 L 4 20 L 4 30 L 4 44 L 100 44 L 108 44 L 124 44 L 124 30 L 124 20 L 124 18 C 124 14.676 121.324 12 118 12 L 10 12 z "
         transform="translate(0,172)"
         id="rect1041" />
      <path
         style="opacity:1;fill:#f6f5f4;fill-opacity:1;stroke:none;stroke-width:3.99999976;stroke-linecap:round;stroke-linejoin:round;stroke-miterlimit:4;stroke-dasharray:3.99999976, 3.99999976;stroke-dashoffset:3.99999976;stroke-opacity:1"
         d="m 28,184 v 32 h 24 v -32 z m 48,0 v 32 h 24 v -32 z"
         id="rect1045"
         inkscape:connector-curvature="0"
         sodipodi:nodetypes="cccccccccc" />
      <rect
         style="opacity:1;fill:#26a269;fill-opacity:1;stroke:none;stroke-width:4;stroke-linecap:round;stroke-linejoin:round;stroke-miterlimit:4;stroke-dasharray:none;stroke-dashoffset:4;stroke-opacity:1"
         id="rect1128"
         width="24"
         height="8"
         x="76"
         y="280" />
      <path
         style="opacity:1;fill:#33d17a;fill-opacity:1;stroke:none;stroke-width:3.99999976;stroke-linecap:round;stroke-linejoin:round;stroke-miterlimit:4;stroke-dasharray:3.99999976, 3.99999976;stroke-dashoffset:3.99999976;stroke-opacity:1"
         d="M 88 72 C 81.352 72 76 77.352 76 84 L 76 96 L 76 112 L 100 112 L 100 96 L 100 84 C 100 77.352 94.648 72 88 72 z "
         transform="translate(0,172)"
         id="rect1064" />
      <rect
         style="opacity:0.8;fill:#62a0ea;fill-opacity:1;stroke:none;stroke-width:3.99999976;stroke-linecap:round;stroke-linejoin:round;stroke-miterlimit:4;stroke-dasharray:3.99999976, 3.99999976000000013;stroke-dashoffset:3.99999976;stroke-opacity:1"
         id="rect1130"
         width="40"
         height="4"
         x="24"
         y="236" />
      <path
         style="opacity:0.2;fill:#ffffff;fill-opacity:1;fill-rule:evenodd;stroke:none;stroke-width:1px;stroke-linecap:butt;stroke-linejoin:miter;stroke-opacity:1"
         d="M 24,258 V 248 L 36,236 H 46 Z"
         id="path1132"
         inkscape:connector-curvature="0"
         sodipodi:nodetypes="ccccc" />
      <path
         sodipodi:nodetypes="ccccc"
         inkscape:connector-curvature="0"
         id="path1134"
         d="m 24,266 v -4 l 26,-26 h 4 z"
         style="opacity:0.2;fill:#ffffff;fill-opacity:1;fill-rule:evenodd;stroke:none;stroke-width:1px;stroke-linecap:butt;stroke-linejoin:miter;stroke-opacity:1" />
      <rect
         style="opacity:1;fill:#26a269;fill-opacity:1;stroke:none;stroke-width:4;stroke-linecap:round;stroke-linejoin:round;stroke-miterlimit:4;stroke-dasharray:none;stroke-dashoffset:4;stroke-opacity:1"
         id="rect1097"
         width="4"
         height="14"
         x="93"
         y="260"
         ry="2" />
    </g>
    <g
       style="fill:url(#linearGradient1496);fill-opacity:1"
       id="g1480" />
  </g>
</svg>
