<?xml version="1.0" encoding="UTF-8" standalone="no"?>
<svg
   viewBox="0 0 192 152"
   style="display:inline;enable-background:new"
   version="1.0"
   inkscape:output_extension="org.inkscape.output.svg.inkscape"
   sodipodi:docname="org.gnome.Software.Source.svg"
   inkscape:version="1.1 (c68e22c387, 2021-05-23)"
   sodipodi:version="0.32"
   id="svg11300"
   height="152"
   width="192"
   inkscape:export-filename="Template.png"
   inkscape:export-xdpi="96"
   inkscape:export-ydpi="96"
   xmlns:inkscape="http://www.inkscape.org/namespaces/inkscape"
   xmlns:sodipodi="http://sodipodi.sourceforge.net/DTD/sodipodi-0.dtd"
   xmlns:xlink="http://www.w3.org/1999/xlink"
   xmlns="http://www.w3.org/2000/svg"
   xmlns:svg="http://www.w3.org/2000/svg"
   xmlns:rdf="http://www.w3.org/1999/02/22-rdf-syntax-ns#"
   xmlns:cc="http://creativecommons.org/ns#"
   xmlns:dc="http://purl.org/dc/elements/1.1/">
  <title
     id="title4162">Adwaita Icon Template</title>
  <defs
     id="defs3">
    <linearGradient
       xlink:href="#linearGradient1036"
       id="linearGradient1099"
       gradientUnits="userSpaceOnUse"
       gradientTransform="translate(604.81684,170.58641)"
       x1="32"
       y1="236"
       x2="96"
       y2="236" />
    <linearGradient
       id="linearGradient1036">
      <stop
         style="stop-color:#d5d3cf;stop-opacity:1;"
         offset="0"
         id="stop1032" />
      <stop
         style="stop-color:#f6f5f4;stop-opacity:1"
         offset="1"
         id="stop1034" />
    </linearGradient>
    <radialGradient
       xlink:href="#linearGradient1069"
       id="radialGradient1103"
       gradientUnits="userSpaceOnUse"
       gradientTransform="matrix(0.88333331,0,0,0.88333331,-460.35018,463.11973)"
       cx="-244"
       cy="-76"
       fx="-244"
       fy="-76"
       r="32" />
    <linearGradient
       id="linearGradient1069">
      <stop
         style="stop-color:#d5d3cf;stop-opacity:1"
         offset="0"
         id="stop1065" />
      <stop
         style="stop-color:#949390;stop-opacity:1"
         offset="1"
         id="stop1067-1" />
    </linearGradient>
    <linearGradient
       gradientTransform="translate(-470.5864,432.81685)"
       xlink:href="#linearGradient1025"
       id="linearGradient1027"
       x1="64"
       y1="262.5"
       x2="64"
       y2="232"
       gradientUnits="userSpaceOnUse" />
    <linearGradient
       id="linearGradient1025">
      <stop
         style="stop-color:#9a9996;stop-opacity:1"
         offset="0"
         id="stop1021" />
      <stop
         style="stop-color:#77767b;stop-opacity:1"
         offset="1"
         id="stop1023" />
    </linearGradient>
    <inkscape:path-effect
       is_visible="true"
       id="path-effect35304-9"
       effect="spiro" />
    <clipPath
       id="clipPath1609-7"
       clipPathUnits="userSpaceOnUse">
      <path
         style="fill:#e74747;stroke:none;stroke-width:0.25px;stroke-linecap:butt;stroke-linejoin:miter;stroke-opacity:1"
         d="m 252,116 28,-28 v -8 h -36 v 36 z"
         id="path1611-5"
         inkscape:connector-curvature="0"
         sodipodi:nodetypes="cccccc" />
    </clipPath>
    <linearGradient
       id="linearGradient1697">
      <stop
         style="stop-color:#deddda;stop-opacity:1"
         offset="0"
         id="stop1685" />
      <stop
         id="stop1687"
         offset="0.04545455"
         style="stop-color:#eeeeec;stop-opacity:1" />
      <stop
         style="stop-color:#deddda;stop-opacity:1"
         offset="0.09090909"
         id="stop1689" />
      <stop
         id="stop1691"
         offset="0.90909094"
         style="stop-color:#deddda;stop-opacity:1" />
      <stop
         style="stop-color:#eeeeec;stop-opacity:1"
         offset="0.95454544"
         id="stop1693" />
      <stop
         style="stop-color:#c0bfbc;stop-opacity:1"
         offset="1"
         id="stop1695" />
    </linearGradient>
    <clipPath
       id="clipPath1289"
       clipPathUnits="userSpaceOnUse">
      <path
         sodipodi:nodetypes="scccsssscccssss"
         inkscape:connector-curvature="0"
         id="path1291"
         d="m 64,-148 h 64 l 64,-64 64,64 h 192 c 17.728,0 32,14.272 32,32 v 288 c 0,17.728 -14.272,32 -32,32 H 256 l -64,-64 -64,64 H 64 C 46.272,204 32,189.728 32,172 v -288 c 0,-17.728 14.408898,-34.19889 32,-32 z"
         style="display:inline;opacity:1;vector-effect:none;fill:none;fill-opacity:1;stroke:#000000;stroke-width:4;stroke-linecap:round;stroke-linejoin:round;stroke-miterlimit:4;stroke-dasharray:none;stroke-dashoffset:0;stroke-opacity:1;marker:none;marker-start:none;marker-mid:none;marker-end:none;paint-order:normal;enable-background:new" />
    </clipPath>
    <linearGradient
       gradientTransform="matrix(0,6,-12,0,-64,209.99687)"
       gradientUnits="userSpaceOnUse"
       x2="1"
       id="paint3_linear-2-6-5">
      <stop
         id="stop91-0-7-4"
         stop-color="#C01C27" />
      <stop
         id="stop93-2-5-7"
         stop-color="#E01B24"
         offset="1" />
    </linearGradient>
    <clipPath
       id="clipPath1609"
       clipPathUnits="userSpaceOnUse">
      <path
         style="fill:#e74747;stroke:none;stroke-width:0.25px;stroke-linecap:butt;stroke-linejoin:miter;stroke-opacity:1"
         d="m 252,116 28,-28 v -8 h -36 v 36 z"
         id="path1611"
         inkscape:connector-curvature="0"
         sodipodi:nodetypes="cccccc" />
    </clipPath>
    <linearGradient
       y2="280"
       x2="116"
       y1="280"
       x1="12"
       gradientUnits="userSpaceOnUse"
       id="linearGradient1111"
       xlink:href="#linearGradient1071"
       inkscape:collect="always" />
    <linearGradient
       id="linearGradient1071"
       inkscape:collect="always">
      <stop
         id="stop1059"
         offset="0"
         style="stop-color:#3584e4;stop-opacity:1" />
      <stop
         style="stop-color:#98c1f1;stop-opacity:1"
         offset="0.04166667"
         id="stop1061" />
      <stop
         id="stop1063"
         offset="0.08333334"
         style="stop-color:#62a0ea;stop-opacity:1" />
      <stop
         style="stop-color:#62a0ea;stop-opacity:1"
         offset="0.91666669"
         id="stop1065-3" />
      <stop
         id="stop1067"
         offset="0.95833331"
         style="stop-color:#98c1f1;stop-opacity:1" />
      <stop
         id="stop1069"
         offset="1"
         style="stop-color:#3584e4;stop-opacity:1" />
    </linearGradient>
    <linearGradient
       y2="266"
       x2="116"
       y1="266"
       x1="12"
       gradientUnits="userSpaceOnUse"
       id="linearGradient1288"
       xlink:href="#linearGradient1149"
       inkscape:collect="always" />
    <linearGradient
       id="linearGradient1149"
       inkscape:collect="always">
      <stop
         id="stop1137"
         offset="0"
         style="stop-color:#3584e4;stop-opacity:1" />
      <stop
         style="stop-color:#62a0ea;stop-opacity:1"
         offset="0.03846154"
         id="stop1139" />
      <stop
         id="stop1141"
         offset="0.07692308"
         style="stop-color:#1c71d8;stop-opacity:1" />
      <stop
         style="stop-color:#1c71d8;stop-opacity:1"
         offset="0.92307693"
         id="stop1143" />
      <stop
         id="stop1145"
         offset="0.96153843"
         style="stop-color:#62a0ea;stop-opacity:1" />
      <stop
         id="stop1147"
         offset="1"
         style="stop-color:#1c71d8;stop-opacity:1" />
    </linearGradient>
    <linearGradient
       id="a"
       gradientUnits="userSpaceOnUse"
       x1="36"
       x2="60"
       y1="68"
       y2="68"
       gradientTransform="translate(-8,156)">
      <stop
         offset="0"
         stop-color="#ed336c"
         id="stop2" />
      <stop
         offset="1"
         stop-color="#ffa348"
         id="stop4" />
    </linearGradient>
    <linearGradient
       id="b"
       gradientTransform="rotate(90,6,130)"
       gradientUnits="userSpaceOnUse"
       x1="72"
       x2="96"
       y1="68"
       y2="68">
      <stop
         offset="0"
         stop-color="#404ce6"
         id="stop7" />
      <stop
         offset="1"
         stop-color="#c061cb"
         id="stop9" />
    </linearGradient>
    <linearGradient
       id="c"
       gradientUnits="userSpaceOnUse"
       x1="68.84919"
       x2="95.257637"
       y1="84"
       y2="84"
       gradientTransform="translate(-8,156)">
      <stop
         offset="0"
         stop-color="#33d1c6"
         id="stop12" />
      <stop
         offset="1"
         stop-color="#1c25d8"
         id="stop14" />
    </linearGradient>
  </defs>
  <sodipodi:namedview
     inkscape:document-rotation="0"
     borderlayer="true"
     inkscape:snap-text-baseline="true"
     inkscape:snap-smooth-nodes="true"
     inkscape:snap-midpoints="true"
     inkscape:snap-object-midpoints="true"
     inkscape:snap-center="true"
     showborder="true"
     inkscape:snap-bbox-midpoints="true"
     inkscape:snap-bbox-edge-midpoints="true"
     inkscape:snap-intersection-paths="true"
     inkscape:object-paths="true"
     inkscape:snap-global="true"
     inkscape:bbox-nodes="true"
     inkscape:object-nodes="true"
     inkscape:measure-end="0,0"
     inkscape:measure-start="0,0"
     inkscape:locked="false"
     inkscape:guide-bbox="true"
     showguides="false"
     inkscape:pagecheckerboard="false"
     inkscape:window-maximized="1"
     guidetolerance="13"
     gridtolerance="12"
     objecttolerance="7"
     inkscape:snap-bbox="true"
     inkscape:snap-nodes="true"
     height="300px"
     width="400px"
     inkscape:window-y="0"
     inkscape:window-x="0"
     inkscape:window-height="1016"
     inkscape:window-width="1920"
     inkscape:showpageshadow="false"
     inkscape:document-units="px"
     inkscape:grid-bbox="true"
     showgrid="false"
     inkscape:current-layer="layer9"
     inkscape:cy="-40.599502"
     inkscape:cx="-86.83966"
     inkscape:zoom="2"
     inkscape:pageshadow="2"
     inkscape:pageopacity="0.0"
     borderopacity="0.25490196"
     bordercolor="#666666"
     pagecolor="#ffffff"
     id="base"
     fill="#f57900"
     stroke="#ef2929">
    <inkscape:grid
       originy="8"
       originx="8"
       empspacing="4"
       visible="true"
       enabled="true"
       spacingy="2"
       spacingx="2"
       id="grid5883"
       type="xygrid" />
    <sodipodi:guide
       inkscape:color="rgb(0,0,255)"
       inkscape:label=""
       inkscape:locked="false"
       id="guide1073"
       orientation="0,1"
       position="72,16" />
    <sodipodi:guide
       inkscape:color="rgb(0,0,255)"
       inkscape:label=""
       inkscape:locked="false"
       id="guide1075"
       orientation="1,0"
       position="20,72" />
    <sodipodi:guide
       inkscape:color="rgb(0,0,255)"
       inkscape:label=""
       inkscape:locked="false"
       id="guide1099"
       orientation="0,1"
       position="72,112" />
    <sodipodi:guide
       inkscape:color="rgb(0,0,255)"
       inkscape:label=""
       inkscape:locked="false"
       id="guide993"
       orientation="0,1"
       position="72,136" />
    <sodipodi:guide
       inkscape:color="rgb(0,0,255)"
       inkscape:label=""
       inkscape:locked="false"
       id="guide995"
       orientation="1,0"
       position="112,72" />
    <sodipodi:guide
       inkscape:color="rgb(0,0,255)"
       inkscape:label=""
       inkscape:locked="false"
       id="guide867"
       orientation="1,0"
       position="8.0000001,72" />
    <sodipodi:guide
       inkscape:color="rgb(0,0,255)"
       inkscape:label=""
       inkscape:locked="false"
       id="guide869"
       orientation="1,0"
       position="128,72" />
    <sodipodi:guide
       inkscape:color="rgb(0,0,255)"
       inkscape:label=""
       inkscape:locked="false"
       id="guide871"
       orientation="0,1"
       position="72,124" />
    <inkscape:grid
       originy="8"
       originx="8"
       dotted="true"
       empopacity="0.08627451"
       empcolor="#000000"
       opacity="0.49019608"
       color="#000000"
       empspacing="8"
       spacingy="1"
       spacingx="1"
       id="grid873"
       type="xygrid" />
    <sodipodi:guide
       inkscape:color="rgb(0,0,255)"
       inkscape:label=""
       inkscape:locked="false"
       id="guide877"
       orientation="1,0"
       position="32,72" />
    <sodipodi:guide
       inkscape:color="rgb(0,0,255)"
       inkscape:label=""
       inkscape:locked="false"
       id="guide879"
       orientation="1,0"
       position="124,72" />
    <sodipodi:guide
       inkscape:color="rgb(0,0,255)"
       inkscape:label=""
       inkscape:locked="false"
       id="guide881"
       orientation="0,1"
       position="72,128" />
    <sodipodi:guide
       inkscape:color="rgb(0,0,255)"
       inkscape:label=""
       inkscape:locked="false"
       id="guide883"
       orientation="0,1"
       position="72,20" />
    <sodipodi:guide
       inkscape:color="rgb(0,0,255)"
       inkscape:label=""
       inkscape:locked="false"
       id="guide885"
       orientation="1,0"
       position="16,72" />
    <sodipodi:guide
       inkscape:color="rgb(0,0,255)"
       inkscape:label=""
       inkscape:locked="false"
       id="guide887"
       orientation="1,0"
       position="136,72" />
    <sodipodi:guide
       inkscape:color="rgb(0,0,255)"
       inkscape:label=""
       inkscape:locked="false"
       id="guide897"
       orientation="0,1"
       position="72,8" />
    <sodipodi:guide
       inkscape:color="rgb(0,0,255)"
       inkscape:label=""
       inkscape:locked="false"
       id="guide899"
       orientation="0,1"
       position="72,32" />
    <sodipodi:guide
       inkscape:color="rgb(0,0,255)"
       inkscape:label=""
       inkscape:locked="false"
       id="guide950"
       orientation="-0.70710678,0.70710678"
       position="264,264" />
    <sodipodi:guide
       inkscape:color="rgb(0,0,255)"
       inkscape:label=""
       inkscape:locked="false"
       id="guide952"
       orientation="0.70710678,0.70710678"
       position="72,72" />
  </sodipodi:namedview>
  <metadata
     id="metadata4">
    <rdf:RDF>
      <cc:Work
         rdf:about="">
        <dc:format>image/svg+xml</dc:format>
        <dc:type
           rdf:resource="http://purl.org/dc/dcmitype/StillImage" />
        <dc:creator>
          <cc:Agent>
            <dc:title>GNOME Design Team</dc:title>
          </cc:Agent>
        </dc:creator>
        <dc:source />
        <cc:license
           rdf:resource="http://creativecommons.org/licenses/by-sa/4.0/" />
        <dc:title>Adwaita Icon Template</dc:title>
        <dc:subject>
          <rdf:Bag />
        </dc:subject>
        <dc:date />
        <dc:rights>
          <cc:Agent>
            <dc:title />
          </cc:Agent>
        </dc:rights>
        <dc:publisher>
          <cc:Agent>
            <dc:title />
          </cc:Agent>
        </dc:publisher>
        <dc:identifier />
        <dc:relation />
        <dc:language />
        <dc:coverage />
        <dc:description />
        <dc:contributor>
          <cc:Agent>
            <dc:title />
          </cc:Agent>
        </dc:contributor>
      </cc:Work>
      <cc:License
         rdf:about="http://creativecommons.org/licenses/by-sa/4.0/">
        <cc:permits
           rdf:resource="http://creativecommons.org/ns#Reproduction" />
        <cc:permits
           rdf:resource="http://creativecommons.org/ns#Distribution" />
        <cc:requires
           rdf:resource="http://creativecommons.org/ns#Notice" />
        <cc:requires
           rdf:resource="http://creativecommons.org/ns#Attribution" />
        <cc:permits
           rdf:resource="http://creativecommons.org/ns#DerivativeWorks" />
        <cc:requires
           rdf:resource="http://creativecommons.org/ns#ShareAlike" />
      </cc:License>
    </rdf:RDF>
  </metadata>
  <g
     transform="translate(8,-156)"
     style="display:inline"
     inkscape:groupmode="layer"
     inkscape:label="App Icon"
     id="layer1">
    <g
       sodipodi:insensitive="true"
       style="display:inline"
       inkscape:label="template"
       id="layer4"
       inkscape:groupmode="layer">
      <rect
         style="display:inline;overflow:visible;visibility:visible;fill:#f0f0f0;fill-opacity:0;fill-rule:nonzero;stroke:none;stroke-width:0.5;marker:none;enable-background:accumulate"
         id="hicolor"
         width="128"
         height="128"
         x="9.2651362e-08"
         y="172"
         inkscape:label="0" />
      <rect
         inkscape:label="0"
         y="172"
         x="160"
         height="16"
         width="16"
         id="symbolic"
         style="display:inline;overflow:visible;visibility:visible;fill:#f0f0f0;fill-opacity:0;fill-rule:nonzero;stroke:none;stroke-width:0.5;marker:none;enable-background:accumulate" />
    </g>
    <g
       sodipodi:insensitive="true"
       style="display:none"
       inkscape:label="baseplate"
       id="layer2"
       inkscape:groupmode="layer">
      <g
         inkscape:export-ydpi="12"
         inkscape:export-xdpi="12"
         id="g12027"
         transform="matrix(7.9911709,0,0,8.0036407,-167.7909,-4846.0776)"
         style="display:inline;fill:#000000;enable-background:new" />
      <rect
         inkscape:label="0"
         y="172"
         x="9.2651362e-08"
         height="128"
         width="128"
         id="128"
         style="display:inline;overflow:visible;visibility:visible;fill:#f0f0f0;fill-opacity:1;fill-rule:nonzero;stroke:none;stroke-width:0.5;marker:none;enable-background:accumulate" />
      <g
         transform="translate(-24,24)"
         style="fill:none;fill-opacity:0.25098;stroke:#a579b3;stroke-opacity:1"
         id="g883" />
      <g
         transform="translate(-24,24)"
         style="fill:none;fill-opacity:0.25098;stroke:#a579b3;stroke-opacity:1"
         id="g900" />
      <rect
         style="display:inline;overflow:visible;visibility:visible;fill:#f0f0f0;fill-opacity:1;fill-rule:nonzero;stroke:none;stroke-width:0.5;marker:none;enable-background:accumulate"
         id="16"
         width="16"
         height="16"
         x="160"
         y="172"
         inkscape:label="" />
      <text
         inkscape:label="icon-name"
         id="text863"
         y="167"
         x="0"
         style="font-style:normal;font-variant:normal;font-weight:bold;font-stretch:normal;font-size:4px;line-height:125%;font-family:Cantarell;-inkscape-font-specification:'Cantarell, Bold';text-align:start;writing-mode:lr-tb;text-anchor:start;display:inline;fill:#000000;fill-opacity:1;stroke:none;stroke-width:0.332649;enable-background:new"
         xml:space="preserve"><tspan
           y="167"
           x="0"
           id="tspan861"
           sodipodi:role="line"
           style="font-size:4px;stroke-width:0.332649">Hicolor</tspan></text>
      <text
         xml:space="preserve"
         style="font-style:normal;font-variant:normal;font-weight:bold;font-stretch:normal;font-size:4px;line-height:125%;font-family:Cantarell;-inkscape-font-specification:'Cantarell, Bold';text-align:start;writing-mode:lr-tb;text-anchor:start;display:inline;fill:#000000;fill-opacity:1;stroke:none;stroke-width:0.332649;enable-background:new"
         x="160"
         y="167"
         id="text867"
         inkscape:label="icon-name"><tspan
           style="font-size:4px;stroke-width:0.332649"
           sodipodi:role="line"
           id="tspan865"
           x="160"
           y="167">Symbolic</tspan></text>
    </g>
    <g
       style="display:inline"
       inkscape:label="icons"
       id="layer9"
       inkscape:groupmode="layer">
      <path
         style="display:inline;vector-effect:none;fill:#d6e5fa;fill-opacity:1;stroke:none;stroke-width:29.6262;stroke-linecap:butt;stroke-linejoin:round;stroke-miterlimit:4;stroke-dasharray:none;stroke-dashoffset:0;stroke-opacity:1;marker:none;marker-start:none;marker-mid:none;marker-end:none;paint-order:normal;enable-background:new"
         d="M -384.01587,332 H -288 v 44.00684 L -284,400 v 28 h -104 v -28 l 3.98413,-23.90478 z"
         id="rect1051"
         inkscape:connector-curvature="0"
         sodipodi:nodetypes="ccccccccc" />
      <path
         inkscape:connector-curvature="0"
         style="display:inline;fill:#3584e4;fill-opacity:1;stroke:none;stroke-width:0.0112982px;stroke-linecap:butt;stroke-linejoin:miter;stroke-miterlimit:4;stroke-dasharray:none;stroke-dashoffset:0;stroke-opacity:1;marker:none;marker-start:none;marker-mid:none;marker-end:none;paint-order:normal;enable-background:new"
         d="m -336,350 a 20,20.000002 0 0 0 -20,20 20,20.000002 0 0 0 20,20 20,20.000002 0 0 0 20,-20 20,20.000002 0 0 0 -20,-20 z m -8,10 a 1.9999997,2 0 0 1 2,2 1.9999997,2 0 0 1 -2,2 1.9999997,2 0 0 1 -2,-2 1.9999997,2 0 0 1 2,-2 z m 8,0 a 1.9999997,2 0 0 1 2,2 1.9999997,2 0 0 1 -2,2 1.9999997,2 0 0 1 -2,-2 1.9999997,2 0 0 1 2,-2 z m 8,0 a 1.9999997,2 0 0 1 2,2 1.9999997,2 0 0 1 -2,2 1.9999997,2 0 0 1 -2,-2 1.9999997,2 0 0 1 2,-2 z m -16,8 a 1.9999997,2 0 0 1 2,2 1.9999997,2 0 0 1 -2,2 1.9999997,2 0 0 1 -2,-2 1.9999997,2 0 0 1 2,-2 z m 8,0 a 1.9999997,2 0 0 1 2,2 1.9999997,2 0 0 1 -2,2 1.9999997,2 0 0 1 -2,-2 1.9999997,2 0 0 1 2,-2 z m 8,0 a 1.9999997,2 0 0 1 2,2 1.9999997,2 0 0 1 -2,2 1.9999997,2 0 0 1 -2,-2 1.9999997,2 0 0 1 2,-2 z m -16,8 a 1.9999997,2 0 0 1 2,2 1.9999997,2 0 0 1 -2,2 1.9999997,2 0 0 1 -2,-2 1.9999997,2 0 0 1 2,-2 z m 8,0 a 1.9999997,2 0 0 1 2,2 1.9999997,2 0 0 1 -2,2 1.9999997,2 0 0 1 -2,-2 1.9999997,2 0 0 1 2,-2 z m 8,0 a 1.9999997,2 0 0 1 2,2 1.9999997,2 0 0 1 -2,2 1.9999997,2 0 0 1 -2,-2 1.9999997,2 0 0 1 2,-2 z"
         id="path920" />
      <path
         style="display:inline;vector-effect:none;fill:#ffffff;fill-opacity:0.389764;stroke:none;stroke-width:2.03322;stroke-linecap:round;stroke-linejoin:miter;stroke-miterlimit:4;stroke-dasharray:none;stroke-dashoffset:0;stroke-opacity:1;marker:none;marker-start:none;marker-mid:none;marker-end:none;paint-order:normal;enable-background:new"
         d="m -388,400 h 104 l -4,-24 h -96 z"
         id="rect1040"
         inkscape:connector-curvature="0"
         sodipodi:nodetypes="ccccc" />
      <g
         style="display:inline;enable-background:new"
         id="g1292"
         transform="translate(-400,140)">
        <circle
           style="opacity:1;fill:#1a5fb4;fill-opacity:1;stroke:none;stroke-width:4;stroke-linecap:round;stroke-linejoin:round;stroke-miterlimit:4;stroke-dasharray:none;stroke-dashoffset:0;stroke-opacity:1"
           id="path1047"
           cx="50"
           cy="201"
           r="5" />
        <circle
           r="5"
           cy="201"
           cx="78"
           id="circle1049"
           style="opacity:1;fill:#1a5fb4;fill-opacity:1;stroke:none;stroke-width:4;stroke-linecap:round;stroke-linejoin:round;stroke-miterlimit:4;stroke-dasharray:none;stroke-dashoffset:0;stroke-opacity:1" />
      </g>
      <path
         sodipodi:nodetypes="csssc"
         inkscape:connector-curvature="0"
         id="rect1044"
         d="m -350,340 v -8 c 0,-7.756 6.244,-14 14,-14 7.756,0 14,6.244 14,14 v 8"
         style="display:inline;fill:none;fill-opacity:1;stroke:#62a0ea;stroke-width:4;stroke-linecap:round;stroke-linejoin:round;stroke-miterlimit:4;stroke-dasharray:none;stroke-dashoffset:0;stroke-opacity:1;enable-background:new" />
      <rect
         ry="0"
         rx="0"
         y="280"
         x="-528"
         height="8"
         width="104"
         id="rect895"
         style="display:inline;fill:#98c1f1;fill-opacity:1;stroke:none;stroke-width:0.00498205px;stroke-linecap:butt;stroke-linejoin:miter;stroke-miterlimit:4;stroke-dasharray:none;stroke-dashoffset:0;stroke-opacity:1;marker:none;marker-start:none;marker-mid:none;marker-end:none;paint-order:normal;enable-background:new" />
      <rect
         y="192"
         x="-528"
         height="88"
         width="104"
         id="rect897"
         style="display:inline;vector-effect:none;fill:#e7f0fc;fill-opacity:1;stroke:none;stroke-width:27.7128;stroke-linecap:butt;stroke-linejoin:round;stroke-miterlimit:4;stroke-dasharray:none;stroke-dashoffset:0;stroke-opacity:1;marker:none;marker-start:none;marker-mid:none;marker-end:none;paint-order:normal;enable-background:new" />
      <path
         style="display:inline;opacity:0.2;fill:#1a5fb4;fill-opacity:1;stroke:none;stroke-width:0.666667px;stroke-linecap:butt;stroke-linejoin:miter;stroke-opacity:1;enable-background:new"
         d="m -528,280 h 104 l -4,4 h -96 z"
         id="path900"
         inkscape:connector-curvature="0"
         sodipodi:nodetypes="ccccc" />
      <circle
         style="display:inline;fill:#1c71d8;fill-opacity:1;stroke:none;stroke-width:4;stroke-linecap:round;stroke-linejoin:round;stroke-miterlimit:4;stroke-dasharray:none;stroke-dashoffset:0;stroke-opacity:1;enable-background:new"
         id="circle902"
         cx="-490"
         cy="200"
         r="4" />
      <circle
         r="4"
         cy="200"
         cx="-462"
         id="circle904"
         style="display:inline;fill:#1c71d8;fill-opacity:1;stroke:none;stroke-width:4;stroke-linecap:round;stroke-linejoin:round;stroke-miterlimit:4;stroke-dasharray:none;stroke-dashoffset:0;stroke-opacity:1;enable-background:new" />
      <path
         style="display:inline;fill:none;fill-opacity:1;stroke:#62a0ea;stroke-width:4;stroke-linecap:round;stroke-linejoin:round;stroke-miterlimit:4;stroke-dasharray:none;stroke-dashoffset:0;stroke-opacity:1;enable-background:new"
         d="m -490,200 v -8 c 0,-7.756 6.244,-14 14,-14 7.756,0 14,6.244 14,14 v 8"
         id="path906"
         inkscape:connector-curvature="0"
         sodipodi:nodetypes="csssc" />
      <path
         id="path908"
         d="m -476,216 a 20,20.000002 0 0 0 -20,20 20,20.000002 0 0 0 20,20 20,20.000002 0 0 0 20,-20 20,20.000002 0 0 0 -20,-20 z m -8,10 a 1.9999997,2 0 0 1 2,2 1.9999997,2 0 0 1 -2,2 1.9999997,2 0 0 1 -2,-2 1.9999997,2 0 0 1 2,-2 z m 8,0 a 1.9999997,2 0 0 1 2,2 1.9999997,2 0 0 1 -2,2 1.9999997,2 0 0 1 -2,-2 1.9999997,2 0 0 1 2,-2 z m 8,0 a 1.9999997,2 0 0 1 2,2 1.9999997,2 0 0 1 -2,2 1.9999997,2 0 0 1 -2,-2 1.9999997,2 0 0 1 2,-2 z m -16,8 a 1.9999997,2 0 0 1 2,2 1.9999997,2 0 0 1 -2,2 1.9999997,2 0 0 1 -2,-2 1.9999997,2 0 0 1 2,-2 z m 8,0 a 1.9999997,2 0 0 1 2,2 1.9999997,2 0 0 1 -2,2 1.9999997,2 0 0 1 -2,-2 1.9999997,2 0 0 1 2,-2 z m 8,0 a 1.9999997,2 0 0 1 2,2 1.9999997,2 0 0 1 -2,2 1.9999997,2 0 0 1 -2,-2 1.9999997,2 0 0 1 2,-2 z m -16,8 a 1.9999997,2 0 0 1 2,2 1.9999997,2 0 0 1 -2,2 1.9999997,2 0 0 1 -2,-2 1.9999997,2 0 0 1 2,-2 z m 8,0 a 1.9999997,2 0 0 1 2,2 1.9999997,2 0 0 1 -2,2 1.9999997,2 0 0 1 -2,-2 1.9999997,2 0 0 1 2,-2 z m 8,0 a 1.9999997,2 0 0 1 2,2 1.9999997,2 0 0 1 -2,2 1.9999997,2 0 0 1 -2,-2 1.9999997,2 0 0 1 2,-2 z"
         style="display:inline;opacity:0.93;fill:#3584e4;fill-opacity:1;stroke:none;stroke-width:0.0112982px;stroke-linecap:butt;stroke-linejoin:miter;stroke-miterlimit:4;stroke-dasharray:none;stroke-dashoffset:0;stroke-opacity:1;marker:none;marker-start:none;marker-mid:none;marker-end:none;paint-order:normal;enable-background:new"
         inkscape:connector-curvature="0" />
      <path
         sodipodi:nodetypes="ccccc"
         inkscape:connector-curvature="0"
         id="path910"
         d="m -528,288 h 104 l -4,-4 h -96 z"
         style="display:inline;opacity:0.1;fill:#ffffff;fill-opacity:1;stroke:none;stroke-width:0.666667px;stroke-linecap:butt;stroke-linejoin:miter;stroke-opacity:1;enable-background:new" />
      <path
         style="display:inline;opacity:0.1;fill:#3584e4;fill-opacity:1;stroke:none;stroke-width:0.666667px;stroke-linecap:butt;stroke-linejoin:miter;stroke-opacity:1;enable-background:new"
         d="m -528,280 v 8 l 4,-4 z"
         id="path912"
         inkscape:connector-curvature="0"
         sodipodi:nodetypes="cccc" />
      <path
         sodipodi:nodetypes="cccc"
         inkscape:connector-curvature="0"
         id="path914"
         d="m -424,280 v 8 l -4,-4 z"
         style="display:inline;opacity:0.1;fill:#3584e4;fill-opacity:1;stroke:none;stroke-width:0.666667px;stroke-linecap:butt;stroke-linejoin:miter;stroke-opacity:1;enable-background:new" />
      <g
         style="display:inline;enable-background:new"
         transform="translate(-670)"
         id="g969">
        <rect
           style="display:inline;opacity:1;fill:#98c1f1;fill-opacity:1;stroke:none;stroke-width:0.00498205px;stroke-linecap:butt;stroke-linejoin:miter;stroke-miterlimit:4;stroke-dasharray:none;stroke-dashoffset:0;stroke-opacity:1;marker:none;marker-start:none;marker-mid:none;marker-end:none;paint-order:normal;enable-background:new"
           id="rect927"
           width="104"
           height="8"
           x="12"
           y="280"
           rx="0"
           ry="0" />
        <rect
           style="opacity:1;vector-effect:none;fill:#e7f0fc;fill-opacity:1;stroke:none;stroke-width:27.7128;stroke-linecap:butt;stroke-linejoin:round;stroke-miterlimit:4;stroke-dasharray:none;stroke-dashoffset:0;stroke-opacity:1;marker:none;marker-start:none;marker-mid:none;marker-end:none;paint-order:normal"
           id="rect929"
           width="104"
           height="88"
           x="12"
           y="192" />
        <path
           sodipodi:nodetypes="ccccc"
           inkscape:connector-curvature="0"
           id="path931"
           d="m 12,280 h 104 l -4,4 H 16 Z"
           style="opacity:0.4;fill:#3584e4;fill-opacity:1;stroke:none;stroke-width:0.666667px;stroke-linecap:butt;stroke-linejoin:miter;stroke-opacity:1" />
        <circle
           r="4"
           cy="200"
           cx="50"
           id="circle933"
           style="opacity:1;fill:#1c71d8;fill-opacity:1;stroke:none;stroke-width:4;stroke-linecap:round;stroke-linejoin:round;stroke-miterlimit:4;stroke-dasharray:none;stroke-dashoffset:0;stroke-opacity:1" />
        <circle
           style="opacity:1;fill:#1c71d8;fill-opacity:1;stroke:none;stroke-width:4;stroke-linecap:round;stroke-linejoin:round;stroke-miterlimit:4;stroke-dasharray:none;stroke-dashoffset:0;stroke-opacity:1"
           id="circle935"
           cx="78"
           cy="200"
           r="4" />
        <path
           sodipodi:nodetypes="csssc"
           inkscape:connector-curvature="0"
           id="path937"
           d="m 50,200 v -8 c 0,-7.756 6.244,-14 14,-14 7.756,0 14,6.244 14,14 v 8"
           style="opacity:1;fill:none;fill-opacity:1;stroke:#62a0ea;stroke-width:4;stroke-linecap:round;stroke-linejoin:round;stroke-miterlimit:4;stroke-dasharray:none;stroke-dashoffset:0;stroke-opacity:1" />
        <circle
           r="20"
           cy="236"
           cx="64"
           id="circle939"
           style="opacity:1;vector-effect:none;fill:#3584e4;fill-opacity:1;stroke:none;stroke-width:2;stroke-linecap:square;stroke-linejoin:round;stroke-miterlimit:4;stroke-dasharray:none;stroke-dashoffset:0;stroke-opacity:1" />
        <path
           style="opacity:0.1;fill:#ffffff;fill-opacity:1;stroke:none;stroke-width:0.666667px;stroke-linecap:butt;stroke-linejoin:miter;stroke-opacity:1"
           d="m 12,288 h 104 l -4,-4 H 16 Z"
           id="path941"
           inkscape:connector-curvature="0"
           sodipodi:nodetypes="ccccc" />
        <path
           sodipodi:nodetypes="cccc"
           inkscape:connector-curvature="0"
           id="path943"
           d="m 12,280 v 8 l 4,-4 z"
           style="opacity:0.1;fill:#3584e4;fill-opacity:1;stroke:none;stroke-width:0.666667px;stroke-linecap:butt;stroke-linejoin:miter;stroke-opacity:1" />
        <path
           style="opacity:0.1;fill:#3584e4;fill-opacity:1;stroke:none;stroke-width:0.666667px;stroke-linecap:butt;stroke-linejoin:miter;stroke-opacity:1"
           d="m 116,280 v 8 l -4,-4 z"
           id="path945"
           inkscape:connector-curvature="0"
           sodipodi:nodetypes="cccc" />
        <circle
           r="3"
           cy="231"
           cx="59"
           id="circle947"
           style="opacity:1;vector-effect:none;fill:#ffffff;fill-opacity:1;stroke:none;stroke-width:2;stroke-linecap:square;stroke-linejoin:round;stroke-miterlimit:4;stroke-dasharray:none;stroke-dashoffset:0;stroke-opacity:1" />
        <circle
           style="opacity:1;vector-effect:none;fill:#ffffff;fill-opacity:1;stroke:none;stroke-width:2;stroke-linecap:square;stroke-linejoin:round;stroke-miterlimit:4;stroke-dasharray:none;stroke-dashoffset:0;stroke-opacity:1"
           id="circle949"
           cx="69"
           cy="231"
           r="3" />
        <circle
           style="opacity:1;vector-effect:none;fill:#ffffff;fill-opacity:1;stroke:none;stroke-width:2;stroke-linecap:square;stroke-linejoin:round;stroke-miterlimit:4;stroke-dasharray:none;stroke-dashoffset:0;stroke-opacity:1"
           id="circle951"
           cx="59"
           cy="241"
           r="3" />
        <circle
           r="3"
           cy="241"
           cx="69"
           id="circle953"
           style="opacity:1;vector-effect:none;fill:#ffffff;fill-opacity:1;stroke:none;stroke-width:2;stroke-linecap:square;stroke-linejoin:round;stroke-miterlimit:4;stroke-dasharray:none;stroke-dashoffset:0;stroke-opacity:1" />
      </g>
      <g
         style="display:inline;enable-background:new"
         transform="translate(-800)"
         id="g1013">
        <rect
           style="display:inline;opacity:1;fill:#98c1f1;fill-opacity:1;stroke:none;stroke-width:0.00498205px;stroke-linecap:butt;stroke-linejoin:miter;stroke-miterlimit:4;stroke-dasharray:none;stroke-dashoffset:0;stroke-opacity:1;marker:none;marker-start:none;marker-mid:none;marker-end:none;paint-order:normal;enable-background:new"
           id="rect971"
           width="104"
           height="8"
           x="12"
           y="280"
           rx="0"
           ry="0" />
        <rect
           style="opacity:1;vector-effect:none;fill:#e7f0fc;fill-opacity:1;stroke:none;stroke-width:27.7128;stroke-linecap:butt;stroke-linejoin:round;stroke-miterlimit:4;stroke-dasharray:none;stroke-dashoffset:0;stroke-opacity:1;marker:none;marker-start:none;marker-mid:none;marker-end:none;paint-order:normal"
           id="rect973"
           width="104"
           height="88"
           x="12"
           y="192" />
        <path
           sodipodi:nodetypes="ccccc"
           inkscape:connector-curvature="0"
           id="path975"
           d="m 12,280 h 104 l -4,4 H 16 Z"
           style="opacity:0.4;fill:#3584e4;fill-opacity:1;stroke:none;stroke-width:0.666667px;stroke-linecap:butt;stroke-linejoin:miter;stroke-opacity:1" />
        <circle
           r="4"
           cy="200"
           cx="50"
           id="circle977"
           style="opacity:1;fill:#1c71d8;fill-opacity:1;stroke:none;stroke-width:4;stroke-linecap:round;stroke-linejoin:round;stroke-miterlimit:4;stroke-dasharray:none;stroke-dashoffset:0;stroke-opacity:1" />
        <circle
           style="opacity:1;fill:#1c71d8;fill-opacity:1;stroke:none;stroke-width:4;stroke-linecap:round;stroke-linejoin:round;stroke-miterlimit:4;stroke-dasharray:none;stroke-dashoffset:0;stroke-opacity:1"
           id="circle979"
           cx="78"
           cy="200"
           r="4" />
        <path
           sodipodi:nodetypes="csssc"
           inkscape:connector-curvature="0"
           id="path981"
           d="m 50,200 v -8 c 0,-7.756 6.244,-14 14,-14 7.756,0 14,6.244 14,14 v 8"
           style="opacity:1;fill:none;fill-opacity:1;stroke:#62a0ea;stroke-width:4;stroke-linecap:round;stroke-linejoin:round;stroke-miterlimit:4;stroke-dasharray:none;stroke-dashoffset:0;stroke-opacity:1" />
        <circle
           r="24"
           cy="236"
           cx="64"
           id="circle983"
           style="opacity:1;vector-effect:none;fill:#3584e4;fill-opacity:1;stroke:none;stroke-width:2;stroke-linecap:square;stroke-linejoin:round;stroke-miterlimit:4;stroke-dasharray:none;stroke-dashoffset:0;stroke-opacity:1" />
        <path
           style="opacity:0.1;fill:#ffffff;fill-opacity:1;stroke:none;stroke-width:0.666667px;stroke-linecap:butt;stroke-linejoin:miter;stroke-opacity:1"
           d="m 12,288 h 104 l -4,-4 H 16 Z"
           id="path985"
           inkscape:connector-curvature="0"
           sodipodi:nodetypes="ccccc" />
        <path
           sodipodi:nodetypes="cccc"
           inkscape:connector-curvature="0"
           id="path987"
           d="m 12,280 v 8 l 4,-4 z"
           style="opacity:0.1;fill:#3584e4;fill-opacity:1;stroke:none;stroke-width:0.666667px;stroke-linecap:butt;stroke-linejoin:miter;stroke-opacity:1" />
        <path
           style="opacity:0.1;fill:#3584e4;fill-opacity:1;stroke:none;stroke-width:0.666667px;stroke-linecap:butt;stroke-linejoin:miter;stroke-opacity:1"
           d="m 116,280 v 8 l -4,-4 z"
           id="path989"
           inkscape:connector-curvature="0"
           sodipodi:nodetypes="cccc" />
        <circle
           r="3"
           cy="229"
           cx="57"
           id="circle991"
           style="opacity:1;vector-effect:none;fill:#ffffff;fill-opacity:1;stroke:none;stroke-width:2;stroke-linecap:square;stroke-linejoin:round;stroke-miterlimit:4;stroke-dasharray:none;stroke-dashoffset:0;stroke-opacity:1" />
        <circle
           style="opacity:1;vector-effect:none;fill:#ffffff;fill-opacity:1;stroke:none;stroke-width:2;stroke-linecap:square;stroke-linejoin:round;stroke-miterlimit:4;stroke-dasharray:none;stroke-dashoffset:0;stroke-opacity:1"
           id="circle993"
           cx="71"
           cy="229"
           r="3" />
        <circle
           style="opacity:1;vector-effect:none;fill:#ffffff;fill-opacity:1;stroke:none;stroke-width:2;stroke-linecap:square;stroke-linejoin:round;stroke-miterlimit:4;stroke-dasharray:none;stroke-dashoffset:0;stroke-opacity:1"
           id="circle995"
           cx="57"
           cy="243"
           r="3" />
        <circle
           r="3"
           cy="243"
           cx="71"
           id="circle997"
           style="opacity:1;vector-effect:none;fill:#ffffff;fill-opacity:1;stroke:none;stroke-width:2;stroke-linecap:square;stroke-linejoin:round;stroke-miterlimit:4;stroke-dasharray:none;stroke-dashoffset:0;stroke-opacity:1" />
      </g>
      <g
         style="display:inline;enable-background:new"
         transform="translate(-860)"
         id="g1049">
        <rect
           style="opacity:1;vector-effect:none;fill:#e7f0fc;fill-opacity:1;stroke:none;stroke-width:27.7128;stroke-linecap:butt;stroke-linejoin:round;stroke-miterlimit:4;stroke-dasharray:none;stroke-dashoffset:0;stroke-opacity:1;marker:none;marker-start:none;marker-mid:none;marker-end:none;paint-order:normal"
           id="rect1013"
           width="104"
           height="76"
           x="-58"
           y="192" />
        <circle
           r="4"
           cy="200"
           cx="-20"
           id="circle1015"
           style="opacity:1;fill:#1c71d8;fill-opacity:1;stroke:none;stroke-width:4;stroke-linecap:round;stroke-linejoin:round;stroke-miterlimit:4;stroke-dasharray:none;stroke-dashoffset:0;stroke-opacity:1" />
        <circle
           style="opacity:1;fill:#1c71d8;fill-opacity:1;stroke:none;stroke-width:4;stroke-linecap:round;stroke-linejoin:round;stroke-miterlimit:4;stroke-dasharray:none;stroke-dashoffset:0;stroke-opacity:1"
           id="circle1017"
           cx="8"
           cy="200"
           r="4" />
        <path
           sodipodi:nodetypes="csssc"
           inkscape:connector-curvature="0"
           id="path1019"
           d="m -20,200 v -8 c 0,-7.756 6.244,-14 14,-14 7.756,0 14,6.244 14,14 v 8"
           style="opacity:1;fill:none;fill-opacity:1;stroke:#98c1f1;stroke-width:4;stroke-linecap:round;stroke-linejoin:round;stroke-miterlimit:4;stroke-dasharray:none;stroke-dashoffset:0;stroke-opacity:1" />
        <circle
           r="24"
           cy="236"
           cx="-6"
           id="circle1021"
           style="opacity:1;vector-effect:none;fill:#3584e4;fill-opacity:1;stroke:none;stroke-width:2;stroke-linecap:square;stroke-linejoin:round;stroke-miterlimit:4;stroke-dasharray:none;stroke-dashoffset:0;stroke-opacity:1" />
        <g
           id="g1031"
           transform="translate(-70)">
          <circle
             style="opacity:1;vector-effect:none;fill:#e7f0fc;fill-opacity:1;stroke:none;stroke-width:2;stroke-linecap:square;stroke-linejoin:round;stroke-miterlimit:4;stroke-dasharray:none;stroke-dashoffset:0;stroke-opacity:1"
             id="circle1023"
             cx="58"
             cy="230"
             r="4" />
          <circle
             r="4"
             cy="230"
             cx="70"
             id="circle1025"
             style="opacity:1;vector-effect:none;fill:#e7f0fc;fill-opacity:1;stroke:none;stroke-width:2;stroke-linecap:square;stroke-linejoin:round;stroke-miterlimit:4;stroke-dasharray:none;stroke-dashoffset:0;stroke-opacity:1" />
          <circle
             r="4"
             cy="241.99998"
             cx="58"
             id="circle1027"
             style="opacity:1;vector-effect:none;fill:#e7f0fc;fill-opacity:1;stroke:none;stroke-width:2;stroke-linecap:square;stroke-linejoin:round;stroke-miterlimit:4;stroke-dasharray:none;stroke-dashoffset:0;stroke-opacity:1" />
          <circle
             style="opacity:1;vector-effect:none;fill:#e7f0fc;fill-opacity:1;stroke:none;stroke-width:2;stroke-linecap:square;stroke-linejoin:round;stroke-miterlimit:4;stroke-dasharray:none;stroke-dashoffset:0;stroke-opacity:1"
             id="circle1029"
             cx="70"
             cy="241.99998"
             r="4" />
        </g>
        <path
           sodipodi:nodetypes="csssscc"
           inkscape:connector-curvature="0"
           id="path1033"
           d="m 46,264 v 8 c 0,4.432 -3.568,8 -8,8 h -88 c -4.432,0 -8,-3.568 -8,-8 v -8 z"
           style="opacity:1;vector-effect:none;fill:#e7f0fc;fill-opacity:1;stroke:none;stroke-width:8;stroke-linecap:round;stroke-linejoin:round;stroke-miterlimit:4;stroke-dasharray:none;stroke-dashoffset:0;stroke-opacity:0.673228" />
        <path
           inkscape:connector-curvature="0"
           id="path1035"
           d="m -58,272 v 8 c 0,4.432 3.568,8 8,8 h 88 c 4.432,0 8,-3.568 8,-8 v -8 c 0,4.432 -3.568,8 -8,8 h -88 c -4.432,0 -8,-3.568 -8,-8 z"
           style="opacity:1;vector-effect:none;fill:#62a0ea;fill-opacity:1;stroke:none;stroke-width:8;stroke-linecap:round;stroke-linejoin:round;stroke-miterlimit:4;stroke-dasharray:none;stroke-dashoffset:0;stroke-opacity:0.673228" />
      </g>
      <g
         style="display:inline;enable-background:new"
         transform="translate(-1050)"
         id="g1109">
        <rect
           style="opacity:1;vector-effect:none;fill:#e7f0fc;fill-opacity:1;stroke:none;stroke-width:27.7128;stroke-linecap:butt;stroke-linejoin:round;stroke-miterlimit:4;stroke-dasharray:none;stroke-dashoffset:0;stroke-opacity:1;marker:none;marker-start:none;marker-mid:none;marker-end:none;paint-order:normal"
           id="rect1073"
           width="104"
           height="76"
           x="12"
           y="192" />
        <circle
           r="4"
           cy="200"
           cx="50"
           id="circle1075"
           style="opacity:1;fill:#1c71d8;fill-opacity:1;stroke:none;stroke-width:4;stroke-linecap:round;stroke-linejoin:round;stroke-miterlimit:4;stroke-dasharray:none;stroke-dashoffset:0;stroke-opacity:1" />
        <circle
           style="opacity:1;fill:#1c71d8;fill-opacity:1;stroke:none;stroke-width:4;stroke-linecap:round;stroke-linejoin:round;stroke-miterlimit:4;stroke-dasharray:none;stroke-dashoffset:0;stroke-opacity:1"
           id="circle1077"
           cx="78"
           cy="200"
           r="4" />
        <path
           sodipodi:nodetypes="csssc"
           inkscape:connector-curvature="0"
           id="path1079"
           d="m 50,200 v -8 c 0,-7.756 6.244,-14 14,-14 7.756,0 14,6.244 14,14 v 8"
           style="opacity:1;fill:none;fill-opacity:1;stroke:#98c1f1;stroke-width:4;stroke-linecap:round;stroke-linejoin:round;stroke-miterlimit:4;stroke-dasharray:none;stroke-dashoffset:0;stroke-opacity:1" />
        <path
           sodipodi:nodetypes="csssscc"
           inkscape:connector-curvature="0"
           id="path1081"
           d="m 116,254 v 18 c 0,4.432 -3.568,8 -8,8 H 20 c -4.432,0 -8,-3.568 -8,-8 v -18 z"
           style="opacity:1;vector-effect:none;fill:#e7f0fc;fill-opacity:1;stroke:none;stroke-width:8;stroke-linecap:round;stroke-linejoin:round;stroke-miterlimit:4;stroke-dasharray:none;stroke-dashoffset:0;stroke-opacity:0.673228" />
        <path
           inkscape:connector-curvature="0"
           id="path1083"
           d="m 12,272 v 8 c 0,4.432 3.568,8 8,8 h 88 c 4.432,0 8,-3.568 8,-8 v -8 c 0,4.432 -3.568,8 -8,8 H 20 c -4.432,0 -8,-3.568 -8,-8 z"
           style="opacity:1;vector-effect:none;fill:url(#linearGradient1111);fill-opacity:1;stroke:none;stroke-width:8;stroke-linecap:round;stroke-linejoin:round;stroke-miterlimit:4;stroke-dasharray:none;stroke-dashoffset:0;stroke-opacity:0.673228" />
        <circle
           r="24"
           cy="236"
           cx="64"
           id="circle1085"
           style="opacity:1;vector-effect:none;fill:#3584e4;fill-opacity:1;stroke:none;stroke-width:2;stroke-linecap:square;stroke-linejoin:round;stroke-miterlimit:4;stroke-dasharray:none;stroke-dashoffset:0;stroke-opacity:1" />
        <g
           id="g1095">
          <circle
             style="opacity:1;vector-effect:none;fill:#e7f0fc;fill-opacity:1;stroke:none;stroke-width:2;stroke-linecap:square;stroke-linejoin:round;stroke-miterlimit:4;stroke-dasharray:none;stroke-dashoffset:0;stroke-opacity:1"
             id="circle1087"
             cx="58"
             cy="230"
             r="4" />
          <circle
             r="4"
             cy="230"
             cx="70"
             id="circle1089"
             style="opacity:1;vector-effect:none;fill:#e7f0fc;fill-opacity:1;stroke:none;stroke-width:2;stroke-linecap:square;stroke-linejoin:round;stroke-miterlimit:4;stroke-dasharray:none;stroke-dashoffset:0;stroke-opacity:1" />
          <circle
             r="4"
             cy="241.99998"
             cx="58"
             id="circle1091"
             style="opacity:1;vector-effect:none;fill:#e7f0fc;fill-opacity:1;stroke:none;stroke-width:2;stroke-linecap:square;stroke-linejoin:round;stroke-miterlimit:4;stroke-dasharray:none;stroke-dashoffset:0;stroke-opacity:1" />
          <circle
             style="opacity:1;vector-effect:none;fill:#e7f0fc;fill-opacity:1;stroke:none;stroke-width:2;stroke-linecap:square;stroke-linejoin:round;stroke-miterlimit:4;stroke-dasharray:none;stroke-dashoffset:0;stroke-opacity:1"
             id="circle1093"
             cx="70"
             cy="241.99998"
             r="4" />
        </g>
      </g>
      <path
         sodipodi:nodetypes="ccccc"
         inkscape:connector-curvature="0"
         id="rect1151"
         d="m -788,420 h 104 c 0,3.97477 -4.01639,8 -8,8 h -88 c -4.94975,0 -8,-3.40041 -8,-8 z"
         style="display:inline;fill:#a2c7f2;fill-opacity:1;stroke:none;stroke-width:0.00498205px;stroke-linecap:butt;stroke-linejoin:miter;stroke-miterlimit:4;stroke-dasharray:none;stroke-dashoffset:0;stroke-opacity:1;marker:none;marker-start:none;marker-mid:none;marker-end:none;paint-order:normal;enable-background:new" />
      <rect
         style="display:inline;vector-effect:none;fill:#e7f0fc;fill-opacity:1;stroke:none;stroke-width:27.7128;stroke-linecap:butt;stroke-linejoin:round;stroke-miterlimit:4;stroke-dasharray:none;stroke-dashoffset:0;stroke-opacity:1;marker:none;marker-start:none;marker-mid:none;marker-end:none;paint-order:normal;enable-background:new"
         id="rect1153"
         width="104"
         height="88"
         x="-788"
         y="332" />
      <circle
         r="4"
         cy="340"
         cx="-750"
         id="circle1157"
         style="display:inline;fill:#1c71d8;fill-opacity:1;stroke:none;stroke-width:4;stroke-linecap:round;stroke-linejoin:round;stroke-miterlimit:4;stroke-dasharray:none;stroke-dashoffset:0;stroke-opacity:1;enable-background:new" />
      <circle
         style="display:inline;fill:#1c71d8;fill-opacity:1;stroke:none;stroke-width:4;stroke-linecap:round;stroke-linejoin:round;stroke-miterlimit:4;stroke-dasharray:none;stroke-dashoffset:0;stroke-opacity:1;enable-background:new"
         id="circle1159"
         cx="-722"
         cy="340"
         r="4" />
      <path
         sodipodi:nodetypes="csssc"
         inkscape:connector-curvature="0"
         id="path1161"
         d="m -750,340 v -8 c 0,-7.756 6.244,-14 14,-14 7.756,0 14,6.244 14,14 v 8"
         style="display:inline;fill:none;fill-opacity:1;stroke:#62a0ea;stroke-width:4;stroke-linecap:round;stroke-linejoin:round;stroke-miterlimit:4;stroke-dasharray:none;stroke-dashoffset:0;stroke-opacity:1;enable-background:new" />
      <circle
         r="24"
         cy="376"
         cx="-736"
         id="circle1163"
         style="display:inline;vector-effect:none;fill:#3584e4;fill-opacity:1;stroke:none;stroke-width:2;stroke-linecap:square;stroke-linejoin:round;stroke-miterlimit:4;stroke-dasharray:none;stroke-dashoffset:0;stroke-opacity:1;enable-background:new" />
      <circle
         r="3"
         cy="369"
         cx="-743"
         id="circle1171"
         style="display:inline;vector-effect:none;fill:#ffffff;fill-opacity:1;stroke:none;stroke-width:2;stroke-linecap:square;stroke-linejoin:round;stroke-miterlimit:4;stroke-dasharray:none;stroke-dashoffset:0;stroke-opacity:1;enable-background:new" />
      <circle
         style="display:inline;vector-effect:none;fill:#ffffff;fill-opacity:1;stroke:none;stroke-width:2;stroke-linecap:square;stroke-linejoin:round;stroke-miterlimit:4;stroke-dasharray:none;stroke-dashoffset:0;stroke-opacity:1;enable-background:new"
         id="circle1173"
         cx="-729"
         cy="369"
         r="3" />
      <circle
         style="display:inline;vector-effect:none;fill:#ffffff;fill-opacity:1;stroke:none;stroke-width:2;stroke-linecap:square;stroke-linejoin:round;stroke-miterlimit:4;stroke-dasharray:none;stroke-dashoffset:0;stroke-opacity:1;enable-background:new"
         id="circle1175"
         cx="-743"
         cy="383"
         r="3" />
      <circle
         r="3"
         cy="383"
         cx="-729"
         id="circle1177"
         style="display:inline;vector-effect:none;fill:#ffffff;fill-opacity:1;stroke:none;stroke-width:2;stroke-linecap:square;stroke-linejoin:round;stroke-miterlimit:4;stroke-dasharray:none;stroke-dashoffset:0;stroke-opacity:1;enable-background:new" />
      <g
         style="display:inline;enable-background:new"
         transform="translate(-1170)"
         id="g1286">
        <rect
           style="opacity:1;vector-effect:none;fill:url(#linearGradient1288);fill-opacity:1;stroke:none;stroke-width:8;stroke-linecap:round;stroke-linejoin:round;stroke-miterlimit:4;stroke-dasharray:none;stroke-dashoffset:0;stroke-opacity:0.673228"
           id="rect1250"
           width="104"
           height="44"
           x="12"
           y="244"
           rx="8"
           ry="8" />
        <rect
           style="opacity:1;vector-effect:none;fill:#3584e4;fill-opacity:1;stroke:none;stroke-width:27.7128;stroke-linecap:butt;stroke-linejoin:round;stroke-miterlimit:4;stroke-dasharray:none;stroke-dashoffset:0;stroke-opacity:1;marker:none;marker-start:none;marker-mid:none;marker-end:none;paint-order:normal"
           id="rect1252"
           width="104"
           height="76"
           x="12"
           y="192" />
        <circle
           r="5"
           cy="201"
           cx="50"
           id="circle1254"
           style="opacity:1;fill:#1a5fb4;fill-opacity:1;stroke:none;stroke-width:4;stroke-linecap:round;stroke-linejoin:round;stroke-miterlimit:4;stroke-dasharray:none;stroke-dashoffset:0;stroke-opacity:1" />
        <circle
           style="opacity:1;fill:#1a5fb4;fill-opacity:1;stroke:none;stroke-width:4;stroke-linecap:round;stroke-linejoin:round;stroke-miterlimit:4;stroke-dasharray:none;stroke-dashoffset:0;stroke-opacity:1"
           id="circle1256"
           cx="78"
           cy="201"
           r="5" />
        <path
           sodipodi:nodetypes="csssc"
           inkscape:connector-curvature="0"
           id="path1258"
           d="m 50,200 v -8 c 0,-7.756 6.244,-14 14,-14 7.756,0 14,6.244 14,14 v 8"
           style="opacity:1;fill:none;fill-opacity:1;stroke:#e7f0fc;stroke-width:4;stroke-linecap:round;stroke-linejoin:round;stroke-miterlimit:4;stroke-dasharray:none;stroke-dashoffset:0;stroke-opacity:1" />
        <path
           sodipodi:nodetypes="csssscc"
           inkscape:connector-curvature="0"
           id="path1260"
           d="m 116,254 v 18 c 0,4.432 -3.568,8 -8,8 H 20 c -4.432,0 -8,-3.568 -8,-8 v -18 z"
           style="opacity:1;vector-effect:none;fill:#3584e4;fill-opacity:1;stroke:none;stroke-width:8;stroke-linecap:round;stroke-linejoin:round;stroke-miterlimit:4;stroke-dasharray:none;stroke-dashoffset:0;stroke-opacity:0.673228" />
        <circle
           r="24"
           cy="236"
           cx="64"
           id="circle1262"
           style="opacity:1;vector-effect:none;fill:#e7f0fc;fill-opacity:1;stroke:none;stroke-width:2;stroke-linecap:square;stroke-linejoin:round;stroke-miterlimit:4;stroke-dasharray:none;stroke-dashoffset:0;stroke-opacity:1" />
        <g
           id="g1272">
          <circle
             style="opacity:1;vector-effect:none;fill:#3584e4;fill-opacity:1;stroke:none;stroke-width:2;stroke-linecap:square;stroke-linejoin:round;stroke-miterlimit:4;stroke-dasharray:none;stroke-dashoffset:0;stroke-opacity:1"
             id="circle1264"
             cx="58"
             cy="230"
             r="4" />
          <circle
             r="4"
             cy="230"
             cx="70"
             id="circle1266"
             style="opacity:1;vector-effect:none;fill:#3584e4;fill-opacity:1;stroke:none;stroke-width:2;stroke-linecap:square;stroke-linejoin:round;stroke-miterlimit:4;stroke-dasharray:none;stroke-dashoffset:0;stroke-opacity:1" />
          <circle
             r="4"
             cy="241.99998"
             cx="58"
             id="circle1268"
             style="opacity:1;vector-effect:none;fill:#3584e4;fill-opacity:1;stroke:none;stroke-width:2;stroke-linecap:square;stroke-linejoin:round;stroke-miterlimit:4;stroke-dasharray:none;stroke-dashoffset:0;stroke-opacity:1" />
          <circle
             style="opacity:1;vector-effect:none;fill:#3584e4;fill-opacity:1;stroke:none;stroke-width:2;stroke-linecap:square;stroke-linejoin:round;stroke-miterlimit:4;stroke-dasharray:none;stroke-dashoffset:0;stroke-opacity:1"
             id="circle1270"
             cx="70"
             cy="241.99998"
             r="4" />
        </g>
      </g>
      <g
         style="display:inline;enable-background:new"
         transform="translate(-1290)"
         id="g1332">
        <rect
           style="opacity:1;vector-effect:none;fill:#98c1f1;fill-opacity:1;stroke:none;stroke-width:8;stroke-linecap:round;stroke-linejoin:round;stroke-miterlimit:4;stroke-dasharray:none;stroke-dashoffset:0;stroke-opacity:0.673228"
           id="rect1296"
           width="104"
           height="44"
           x="12"
           y="244"
           rx="8"
           ry="8" />
        <rect
           style="opacity:1;vector-effect:none;fill:#e7f0fc;fill-opacity:1;stroke:none;stroke-width:27.7128;stroke-linecap:butt;stroke-linejoin:round;stroke-miterlimit:4;stroke-dasharray:none;stroke-dashoffset:0;stroke-opacity:1;marker:none;marker-start:none;marker-mid:none;marker-end:none;paint-order:normal"
           id="rect1298"
           width="104"
           height="88"
           x="12"
           y="192" />
        <g
           id="g1304">
          <circle
             style="opacity:1;fill:#1a5fb4;fill-opacity:1;stroke:none;stroke-width:4;stroke-linecap:round;stroke-linejoin:round;stroke-miterlimit:4;stroke-dasharray:none;stroke-dashoffset:0;stroke-opacity:1"
             id="circle1300"
             cx="50"
             cy="201"
             r="5" />
          <circle
             r="5"
             cy="201"
             cx="78"
             id="circle1302"
             style="opacity:1;fill:#1a5fb4;fill-opacity:1;stroke:none;stroke-width:4;stroke-linecap:round;stroke-linejoin:round;stroke-miterlimit:4;stroke-dasharray:none;stroke-dashoffset:0;stroke-opacity:1" />
        </g>
        <path
           sodipodi:nodetypes="csssc"
           inkscape:connector-curvature="0"
           id="path1306"
           d="m 50,200 v -8 c 0,-7.756 6.244,-14 14,-14 7.756,0 14,6.244 14,14 v 8"
           style="opacity:1;fill:none;fill-opacity:1;stroke:#62a0ea;stroke-width:4;stroke-linecap:round;stroke-linejoin:round;stroke-miterlimit:4;stroke-dasharray:none;stroke-dashoffset:0;stroke-opacity:1" />
        <circle
           r="24"
           cy="236"
           cx="64"
           id="circle1308"
           style="opacity:1;vector-effect:none;fill:#3584e4;fill-opacity:1;stroke:none;stroke-width:2;stroke-linecap:square;stroke-linejoin:round;stroke-miterlimit:4;stroke-dasharray:none;stroke-dashoffset:0;stroke-opacity:1" />
        <g
           style="fill:#e7f0fc;fill-opacity:1"
           id="g1318">
          <circle
             style="opacity:1;vector-effect:none;fill:#e7f0fc;fill-opacity:1;stroke:none;stroke-width:2;stroke-linecap:square;stroke-linejoin:round;stroke-miterlimit:4;stroke-dasharray:none;stroke-dashoffset:0;stroke-opacity:1"
             id="circle1310"
             cx="58"
             cy="230"
             r="4" />
          <circle
             r="4"
             cy="230"
             cx="70"
             id="circle1312"
             style="opacity:1;vector-effect:none;fill:#e7f0fc;fill-opacity:1;stroke:none;stroke-width:2;stroke-linecap:square;stroke-linejoin:round;stroke-miterlimit:4;stroke-dasharray:none;stroke-dashoffset:0;stroke-opacity:1" />
          <circle
             r="4"
             cy="241.99998"
             cx="58"
             id="circle1314"
             style="opacity:1;vector-effect:none;fill:#e7f0fc;fill-opacity:1;stroke:none;stroke-width:2;stroke-linecap:square;stroke-linejoin:round;stroke-miterlimit:4;stroke-dasharray:none;stroke-dashoffset:0;stroke-opacity:1" />
          <circle
             style="opacity:1;vector-effect:none;fill:#e7f0fc;fill-opacity:1;stroke:none;stroke-width:2;stroke-linecap:square;stroke-linejoin:round;stroke-miterlimit:4;stroke-dasharray:none;stroke-dashoffset:0;stroke-opacity:1"
             id="circle1316"
             cx="70"
             cy="241.99998"
             r="4" />
        </g>
      </g>
      <path
         inkscape:connector-curvature="0"
         style="color:#000000;display:inline;overflow:visible;visibility:visible;fill:#241f31;fill-opacity:1;fill-rule:nonzero;stroke:none;stroke-width:1;marker:none;enable-background:accumulate"
         d="m 208,172 c -1.6533,0 -3,1.34665 -3,3 v 1 h -1.9062 c -0.606,0 -1.0938,0.48781 -1.0938,1.09375 v 9.8125 c 0,0.60594 0.4878,1.09375 1.0938,1.09375 h 9.8125 c 0.6059,0 1.0937,-0.48781 1.0937,-1.09375 v -9.8125 C 214,176.48781 213.5122,176 212.9063,176 H 211 v -1 c 0,-1.65335 -1.3466,-3 -3,-3 z m 0,1 c 1.1167,0 2,0.88335 2,2 v 1 h -4 v -1 c 0,-1.11665 0.8834,-2 2,-2 z m -2.5312,4 c 0.2867,0 0.5312,0.22386 0.5312,0.5 0,0.27614 -0.2445,0.5 -0.5312,0.5 -0.2868,0 -0.5,-0.22386 -0.5,-0.5 0,-0.27614 0.2132,-0.5 0.5,-0.5 z m 5,0 c 0.2867,0 0.5312,0.22386 0.5312,0.5 0,0.27614 -0.2445,0.5 -0.5312,0.5 -0.2868,0 -0.5,-0.22386 -0.5,-0.5 0,-0.27614 0.2132,-0.5 0.5,-0.5 z"
         id="rect43509-3-4-3"
         inkscape:label="gnome-software" />
      <g
         id="g358"
         transform="translate(-240)">
        <rect
           ry="8"
           rx="8"
           y="244"
           x="12"
           height="44"
           width="104"
           id="rect1020"
           style="display:inline;vector-effect:none;fill:#98c1f1;fill-opacity:1;stroke:none;stroke-width:8;stroke-linecap:round;stroke-linejoin:round;stroke-miterlimit:4;stroke-dasharray:none;stroke-dashoffset:0;stroke-opacity:0.673228;enable-background:new" />
        <rect
           y="192"
           x="12"
           height="88"
           width="104"
           id="rect1023"
           style="display:inline;vector-effect:none;fill:#e7f0fc;fill-opacity:1;stroke:none;stroke-width:27.7128;stroke-linecap:butt;stroke-linejoin:round;stroke-miterlimit:4;stroke-dasharray:none;stroke-dashoffset:0;stroke-opacity:1;marker:none;marker-start:none;marker-mid:none;marker-end:none;paint-order:normal;enable-background:new" />
        <g
           style="display:inline;enable-background:new"
           id="g1030">
          <circle
             r="5"
             cy="201"
             cx="50"
             id="circle1026"
             style="opacity:1;fill:#1a5fb4;fill-opacity:1;stroke:none;stroke-width:4;stroke-linecap:round;stroke-linejoin:round;stroke-miterlimit:4;stroke-dasharray:none;stroke-dashoffset:0;stroke-opacity:1" />
          <circle
             style="opacity:1;fill:#1a5fb4;fill-opacity:1;stroke:none;stroke-width:4;stroke-linecap:round;stroke-linejoin:round;stroke-miterlimit:4;stroke-dasharray:none;stroke-dashoffset:0;stroke-opacity:1"
             id="circle1028"
             cx="78"
             cy="201"
             r="5" />
        </g>
        <path
           style="display:inline;fill:none;fill-opacity:1;stroke:#62a0ea;stroke-width:4;stroke-linecap:round;stroke-linejoin:round;stroke-miterlimit:4;stroke-dasharray:none;stroke-dashoffset:0;stroke-opacity:1;enable-background:new"
           d="m 50,200 v -8 c 0,-7.756 6.244,-14 14,-14 7.756,0 14,6.244 14,14 v 8"
           id="path1032"
           inkscape:connector-curvature="0"
           sodipodi:nodetypes="csssc" />
        <path
           id="path1034"
           d="m 64,216 a 20,20.000002 0 0 0 -20,20 20,20.000002 0 0 0 20,20 20,20.000002 0 0 0 20,-20 20,20.000002 0 0 0 -20,-20 z m -8,10 a 1.9999997,2 0 0 1 2,2 1.9999997,2 0 0 1 -2,2 1.9999997,2 0 0 1 -2,-2 1.9999997,2 0 0 1 2,-2 z m 8,0 a 1.9999997,2 0 0 1 2,2 1.9999997,2 0 0 1 -2,2 1.9999997,2 0 0 1 -2,-2 1.9999997,2 0 0 1 2,-2 z m 8,0 a 1.9999997,2 0 0 1 2,2 1.9999997,2 0 0 1 -2,2 1.9999997,2 0 0 1 -2,-2 1.9999997,2 0 0 1 2,-2 z m -16,8 a 1.9999997,2 0 0 1 2,2 1.9999997,2 0 0 1 -2,2 1.9999997,2 0 0 1 -2,-2 1.9999997,2 0 0 1 2,-2 z m 8,0 a 1.9999997,2 0 0 1 2,2 1.9999997,2 0 0 1 -2,2 1.9999997,2 0 0 1 -2,-2 1.9999997,2 0 0 1 2,-2 z m 8,0 a 1.9999997,2 0 0 1 2,2 1.9999997,2 0 0 1 -2,2 1.9999997,2 0 0 1 -2,-2 1.9999997,2 0 0 1 2,-2 z m -16,8 a 1.9999997,2 0 0 1 2,2 1.9999997,2 0 0 1 -2,2 1.9999997,2 0 0 1 -2,-2 1.9999997,2 0 0 1 2,-2 z m 8,0 a 1.9999997,2 0 0 1 2,2 1.9999997,2 0 0 1 -2,2 1.9999997,2 0 0 1 -2,-2 1.9999997,2 0 0 1 2,-2 z m 8,0 a 1.9999997,2 0 0 1 2,2 1.9999997,2 0 0 1 -2,2 1.9999997,2 0 0 1 -2,-2 1.9999997,2 0 0 1 2,-2 z"
           style="display:inline;fill:#3584e4;fill-opacity:1;stroke:none;stroke-width:0.0112982px;stroke-linecap:butt;stroke-linejoin:miter;stroke-miterlimit:4;stroke-dasharray:none;stroke-dashoffset:0;stroke-opacity:1;marker:none;marker-start:none;marker-mid:none;marker-end:none;paint-order:normal;enable-background:new"
           inkscape:connector-curvature="0" />
      </g>
      <g
         id="g437"
         transform="translate(8.0003502,15.908817)">
        <path
           d="m 36,172 c 2.666667,-2.66667 5.333333,-5.33333 8,-8 8,0 16,0 24,0 2.666667,2.66667 5.333333,5.33333 8,8 -13.333333,0 -26.666667,0 -40,0 z"
           fill="#c0bfbc"
           id="path17" />
        <path
           d="m 44,164 c -2.666667,2.66667 -5.333333,5.33333 -8,8 0,5.33333 0,10.66667 0,16 2.666667,0 5.333333,0 8,0 0,-8 0,-16 0,-24 z"
           fill="#f6f5f4"
           id="path19" />
        <path
           d="m 68,164 c 2.666667,2.66667 5.333333,5.33333 8,8 0,5.33333 0,10.66667 0,16 -2.666667,0 -5.333333,0 -8,0 0,-8 0,-16 0,-24 z"
           fill="#f6f5f4"
           id="path21" />
        <path
           d="m 8,228 c 32.272287,0.0275 64.547353,-0.055 96.8179,0.0413 5.00739,0.34579 7.87655,5.51877 7.1821,10.13694 -0.10048,9.1417 0.20598,18.30914 -0.16254,27.43394 -0.79338,4.6412 -5.67804,6.98226 -10.01571,6.38781 -31.546203,-0.0275 -63.095185,0.055 -94.6396526,-0.0413 C 2.1747128,271.6129 -0.69444777,266.43992 0,261.82175 0.10048012,252.68005 -0.20598381,243.51261 0.16254424,234.38781 0.85257573,230.74902 4.2929966,227.93675 8,228 Z"
           fill="#deddda"
           id="path23" />
        <path
           d="m 0,184 c 37.333333,0 74.666667,0 112,0 0,26.66667 0,53.33333 0,80 -37.333333,0 -74.666667,0 -112,0 0,-26.66667 0,-53.33333 0,-80 z"
           fill="#e5e5e1"
           id="path25" />
        <path
           d="m 0,224 c 37.333333,0 74.666667,0 112,0 0,13.33333 0,26.66667 0,40 -37.333333,0 -74.666667,0 -112,0 0,-13.33333 0,-26.66667 0,-40 z"
           fill="#f6f5f4"
           id="path27" />
        <path
           d="m 36,212 c 4.589374,0.36427 9.986061,-1.24839 13.656738,2.34326 C 53.248111,218.0121 51.6358,223.41102 52,228 c 0.172212,5.15731 -5.035762,8.76747 -9.867071,8 -4.437851,-0.11148 -9.991416,0.93858 -12.766573,-3.52726 C 27.090295,228.71864 28.312265,224.16136 28,220 c -0.09146,-4.30104 3.696022,-8.09102 8,-8 z"
           fill="url(#a)"
           id="path29"
           style="fill:url(#a)" />
        <path
           d="m 68,220 c -8.7414,0.39995 -15.065289,-10.22403 -10.551965,-17.72057 3.790558,-7.7944 15.980351,-8.38412 20.502946,-0.9894 C 83.418288,208.90016 77.380993,220.27755 68,220 Z"
           fill="url(#b)"
           id="path31"
           style="fill:url(#b)" />
        <path
           d="m 74.789062,226.97656 c -6.078625,3.56432 -12.330559,6.86683 -18.300048,10.59601 -2.993423,3.32106 1.206124,6.00285 3.963889,7.25695 5.077965,2.81189 10.017564,5.9077 15.183144,8.5398 4.386605,0.91313 4.647035,-4.06256 4.363953,-7.10346 -0.07768,-5.72172 0.156898,-11.464 -0.119934,-17.1726 -0.5233,-2.15722 -3.192144,-3.2671 -5.091004,-2.1167 z"
           fill="url(#c)"
           id="path33"
           style="fill:url(#c)" />
      </g>
      <path
         style="display:inline;fill:#c0d9f6;fill-opacity:1;stroke:none;stroke-width:1px;stroke-linecap:butt;stroke-linejoin:miter;stroke-opacity:1;enable-background:new"
         d="m -388,400 4,11.5 -4,16.5 h 104 l -4,-16.5 4,-11.5 z"
         id="path1036"
         inkscape:connector-curvature="0"
         sodipodi:nodetypes="ccccccc" />
      <path
         inkscape:connector-curvature="0"
         id="path1038"
         d="m -388,400 4,11.5 h 96 l 4,-11.5 z"
         style="display:inline;fill:#a2c7f2;fill-opacity:1;stroke:none;stroke-width:1px;stroke-linecap:butt;stroke-linejoin:miter;stroke-opacity:1;enable-background:new"
         sodipodi:nodetypes="ccccc" />
      <rect
         y="332"
         x="-528"
         height="96"
         width="104"
         id="rect1029"
         style="display:inline;vector-effect:none;fill:#d6e5fa;fill-opacity:1;stroke:none;stroke-width:29.6262;stroke-linecap:butt;stroke-linejoin:round;stroke-miterlimit:4;stroke-dasharray:none;stroke-dashoffset:0;stroke-opacity:1;marker:none;marker-start:none;marker-mid:none;marker-end:none;paint-order:normal;enable-background:new" />
      <path
         id="path1031"
         d="m -476,356 a 20,20.000002 0 0 0 -20,20 20,20.000002 0 0 0 20,20 20,20.000002 0 0 0 20,-20 20,20.000002 0 0 0 -20,-20 z m -8,10 a 1.9999997,2 0 0 1 2,2 1.9999997,2 0 0 1 -2,2 1.9999997,2 0 0 1 -2,-2 1.9999997,2 0 0 1 2,-2 z m 8,0 a 1.9999997,2 0 0 1 2,2 1.9999997,2 0 0 1 -2,2 1.9999997,2 0 0 1 -2,-2 1.9999997,2 0 0 1 2,-2 z m 8,0 a 1.9999997,2 0 0 1 2,2 1.9999997,2 0 0 1 -2,2 1.9999997,2 0 0 1 -2,-2 1.9999997,2 0 0 1 2,-2 z m -16,8 a 1.9999997,2 0 0 1 2,2 1.9999997,2 0 0 1 -2,2 1.9999997,2 0 0 1 -2,-2 1.9999997,2 0 0 1 2,-2 z m 8,0 a 1.9999997,2 0 0 1 2,2 1.9999997,2 0 0 1 -2,2 1.9999997,2 0 0 1 -2,-2 1.9999997,2 0 0 1 2,-2 z m 8,0 a 1.9999997,2 0 0 1 2,2 1.9999997,2 0 0 1 -2,2 1.9999997,2 0 0 1 -2,-2 1.9999997,2 0 0 1 2,-2 z m -16,8 a 1.9999997,2 0 0 1 2,2 1.9999997,2 0 0 1 -2,2 1.9999997,2 0 0 1 -2,-2 1.9999997,2 0 0 1 2,-2 z m 8,0 a 1.9999997,2 0 0 1 2,2 1.9999997,2 0 0 1 -2,2 1.9999997,2 0 0 1 -2,-2 1.9999997,2 0 0 1 2,-2 z m 8,0 a 1.9999997,2 0 0 1 2,2 1.9999997,2 0 0 1 -2,2 1.9999997,2 0 0 1 -2,-2 1.9999997,2 0 0 1 2,-2 z"
         style="display:inline;fill:#3584e4;fill-opacity:1;stroke:none;stroke-width:0.0112982px;stroke-linecap:butt;stroke-linejoin:miter;stroke-miterlimit:4;stroke-dasharray:none;stroke-dashoffset:0;stroke-opacity:1;marker:none;marker-start:none;marker-mid:none;marker-end:none;paint-order:normal;enable-background:new"
         inkscape:connector-curvature="0" />
      <rect
         transform="scale(1,-1)"
         y="-416"
         x="-528"
         height="31.75"
         width="104"
         id="rect1033"
         style="display:inline;vector-effect:none;fill:#ffffff;fill-opacity:0.389764;stroke:none;stroke-width:2.33857;stroke-linecap:round;stroke-linejoin:miter;stroke-miterlimit:4;stroke-dasharray:none;stroke-dashoffset:0;stroke-opacity:1;marker:none;marker-start:none;marker-mid:none;marker-end:none;paint-order:normal;enable-background:new" />
      <g
         style="display:inline;enable-background:new"
         id="g1039"
         transform="translate(-540,140)">
        <circle
           r="5"
           cy="201"
           cx="50"
           id="circle1035"
           style="opacity:1;fill:#1a5fb4;fill-opacity:1;stroke:none;stroke-width:4;stroke-linecap:round;stroke-linejoin:round;stroke-miterlimit:4;stroke-dasharray:none;stroke-dashoffset:0;stroke-opacity:1" />
        <circle
           style="opacity:1;fill:#1a5fb4;fill-opacity:1;stroke:none;stroke-width:4;stroke-linecap:round;stroke-linejoin:round;stroke-miterlimit:4;stroke-dasharray:none;stroke-dashoffset:0;stroke-opacity:1"
           id="circle1037"
           cx="78"
           cy="201"
           r="5" />
      </g>
      <path
         style="display:inline;fill:none;fill-opacity:1;stroke:#62a0ea;stroke-width:4;stroke-linecap:round;stroke-linejoin:round;stroke-miterlimit:4;stroke-dasharray:none;stroke-dashoffset:0;stroke-opacity:1;enable-background:new"
         d="m -490,340 v -8 c 0,-7.756 6.244,-14 14,-14 7.756,0 14,6.244 14,14 v 8"
         id="path1041"
         inkscape:connector-curvature="0"
         sodipodi:nodetypes="csssc" />
      <path
         sodipodi:nodetypes="ccccccc"
         inkscape:connector-curvature="0"
         id="path1043"
         d="m -528,416 4,4 -4,8 h 104 l -4,-8 4,-4 z"
         style="display:inline;fill:#c0d9f6;fill-opacity:1;stroke:none;stroke-width:1px;stroke-linecap:butt;stroke-linejoin:miter;stroke-opacity:1;enable-background:new" />
      <path
         sodipodi:nodetypes="ccccc"
         style="display:inline;fill:#a2c7f2;fill-opacity:1;stroke:none;stroke-width:1px;stroke-linecap:butt;stroke-linejoin:miter;stroke-opacity:1;enable-background:new"
         d="m -528,416 4,4 h 96 l 4,-4 z"
         id="path1045"
         inkscape:connector-curvature="0" />
      <path
         d="m 161,177 v 8 c 0,1.10937 0.89062,2 2,2 h 10 c 1.10937,0 2,-0.89063 2,-2 v -8 z m 7,1.75 c 0.69141,0 1.25,0.55859 1.25,1.25 0,0.69141 -0.55859,1.25 -1.25,1.25 -0.69141,0 -1.25,-0.55859 -1.25,-1.25 0,-0.69141 0.55859,-1.25 1.25,-1.25 z m -2,3 c 0.69141,0 1.25,0.55859 1.25,1.25 0,0.69141 -0.55859,1.25 -1.25,1.25 -0.69141,0 -1.25,-0.55859 -1.25,-1.25 0,-0.69141 0.55859,-1.25 1.25,-1.25 z m 4,0 c 0.69141,0 1.25,0.55859 1.25,1.25 0,0.69141 -0.55859,1.25 -1.25,1.25 -0.69141,0 -1.25,-0.55859 -1.25,-1.25 0,-0.69141 0.55859,-1.25 1.25,-1.25 z m 0,0"
         id="path2"
         style="fill:#241f31;fill-opacity:1" />
      <path
         d="m 166,174 -1,1 v 3 h 2 v -3 h 2 v 3 h 2 v -3 l -1,-1 z m 0,0"
         id="path4"
         style="fill:#241f31;fill-opacity:1" />
    </g>
    <g
       sodipodi:insensitive="true"
       style="display:none"
       inkscape:label="grid"
       id="layer3"
       inkscape:groupmode="layer">
      <circle
         style="display:inline;opacity:0.1;vector-effect:none;fill:none;fill-opacity:1;stroke:#000000;stroke-width:0.99;stroke-linecap:butt;stroke-linejoin:miter;stroke-miterlimit:4;stroke-dasharray:0.99, 0.99;stroke-dashoffset:0;stroke-opacity:1;marker:none;marker-start:none;marker-mid:none;marker-end:none;paint-order:normal;enable-background:new"
         id="circle2892"
         r="59.504131"
         cy="236"
         cx="64.000031" />
      <rect
         style="display:inline;opacity:0.1;vector-effect:none;fill:none;fill-opacity:1;stroke:#000000;stroke-width:0.99;stroke-linecap:butt;stroke-linejoin:miter;stroke-miterlimit:4;stroke-dasharray:0.99, 0.99;stroke-dashoffset:0;stroke-opacity:1;marker:none;marker-start:none;marker-mid:none;marker-end:none;paint-order:normal;enable-background:new"
         id="rect2894"
         width="87.009987"
         height="111.01005"
         x="20.495007"
         y="180.49496"
         rx="8.701004"
         ry="7.9292889" />
      <rect
         style="display:inline;opacity:0.1;vector-effect:none;fill:none;fill-opacity:1;stroke:#000000;stroke-width:0.99;stroke-linecap:butt;stroke-linejoin:miter;stroke-miterlimit:4;stroke-dasharray:0.99, 0.99;stroke-dashoffset:0;stroke-opacity:1;marker:none;marker-start:none;marker-mid:none;marker-end:none;paint-order:normal;enable-background:new"
         id="rect2896"
         width="103.00952"
         height="103.00952"
         x="12.495266"
         y="184.49524"
         rx="7.9238095"
         ry="7.9238095" />
      <rect
         style="display:inline;opacity:0.1;vector-effect:none;fill:none;fill-opacity:1;stroke:#000000;stroke-width:0.99;stroke-linecap:butt;stroke-linejoin:miter;stroke-miterlimit:4;stroke-dasharray:0.99, 0.99;stroke-dashoffset:0;stroke-opacity:1;marker:none;marker-start:none;marker-mid:none;marker-end:none;paint-order:normal;enable-background:new"
         id="rect2898"
         width="111.01004"
         height="87.010048"
         x="8.4950066"
         y="200.49496"
         rx="7.9292889"
         ry="8.701005" />
      <path
         style="display:inline;fill:none;stroke:#62a0ea;stroke-width:2;stroke-linecap:butt;stroke-linejoin:miter;stroke-miterlimit:4;stroke-dasharray:none;stroke-opacity:1;enable-background:new"
         d="M 2.6203015e-5,288.99999 H 128.00003"
         id="path2900"
         inkscape:connector-curvature="0" />
    </g>
  </g>
</svg>
