<?xml version="1.0" encoding="UTF-8" standalone="no"?>
<svg
   xmlns:dc="http://purl.org/dc/elements/1.1/"
   xmlns:cc="http://creativecommons.org/ns#"
   xmlns:rdf="http://www.w3.org/1999/02/22-rdf-syntax-ns#"
   xmlns:svg="http://www.w3.org/2000/svg"
   xmlns="http://www.w3.org/2000/svg"
   xmlns:xlink="http://www.w3.org/1999/xlink"
   xmlns:sodipodi="http://sodipodi.sourceforge.net/DTD/sodipodi-0.dtd"
   xmlns:inkscape="http://www.inkscape.org/namespaces/inkscape"
   inkscape:export-ydpi="96"
   inkscape:export-xdpi="96"
   inkscape:export-filename="Template.png"
   width="192"
   height="152"
   id="svg11300"
   sodipodi:version="0.32"
   inkscape:version="1.0 (4035a4fb49, 2020-05-01)"
   sodipodi:docname="de.haeckerfelix.Fragments.Source.svg"
   inkscape:output_extension="org.inkscape.output.svg.inkscape"
   version="1.0"
   style="display:inline;enable-background:new"
   viewBox="0 0 192 152">
  <title
     id="title4162">Adwaita Icon Template</title>
  <defs
     id="defs3">
    <linearGradient
       y2="236"
       x2="96"
       y1="236"
       x1="32"
       gradientTransform="translate(604.81684,170.58641)"
       gradientUnits="userSpaceOnUse"
       id="linearGradient1099"
       xlink:href="#linearGradient1036" />
    <linearGradient
       id="linearGradient1036">
      <stop
         id="stop1032"
         offset="0"
         style="stop-color:#d5d3cf;stop-opacity:1;" />
      <stop
         id="stop1034"
         offset="1"
         style="stop-color:#f6f5f4;stop-opacity:1" />
    </linearGradient>
    <radialGradient
       r="32"
       fy="-76"
       fx="-244"
       cy="-76"
       cx="-244"
       gradientTransform="matrix(0.88333331,0,0,0.88333331,-460.35018,463.11973)"
       gradientUnits="userSpaceOnUse"
       id="radialGradient1103"
       xlink:href="#linearGradient1069" />
    <linearGradient
       id="linearGradient1069">
      <stop
         id="stop1065"
         offset="0"
         style="stop-color:#d5d3cf;stop-opacity:1" />
      <stop
         id="stop1067-1"
         offset="1"
         style="stop-color:#949390;stop-opacity:1" />
    </linearGradient>
    <linearGradient
       gradientUnits="userSpaceOnUse"
       y2="232"
       x2="64"
       y1="262.5"
       x1="64"
       id="linearGradient1027"
       xlink:href="#linearGradient1025"
       gradientTransform="translate(-470.5864,432.81685)" />
    <linearGradient
       id="linearGradient1025">
      <stop
         id="stop1021"
         offset="0"
         style="stop-color:#9a9996;stop-opacity:1" />
      <stop
         id="stop1023"
         offset="1"
         style="stop-color:#77767b;stop-opacity:1" />
    </linearGradient>
    <inkscape:path-effect
       effect="spiro"
       id="path-effect35304-9"
       is_visible="true" />
    <clipPath
       clipPathUnits="userSpaceOnUse"
       id="clipPath1609-7">
      <path
         sodipodi:nodetypes="cccccc"
         inkscape:connector-curvature="0"
         id="path1611-5"
         d="m 252,116 28,-28 v -8 h -36 v 36 z"
         style="fill:#e74747;stroke:none;stroke-width:0.25px;stroke-linecap:butt;stroke-linejoin:miter;stroke-opacity:1" />
    </clipPath>
    <linearGradient
       id="linearGradient1697">
      <stop
         id="stop1685"
         offset="0"
         style="stop-color:#deddda;stop-opacity:1" />
      <stop
         style="stop-color:#eeeeec;stop-opacity:1"
         offset="0.04545455"
         id="stop1687" />
      <stop
         id="stop1689"
         offset="0.09090909"
         style="stop-color:#deddda;stop-opacity:1" />
      <stop
         style="stop-color:#deddda;stop-opacity:1"
         offset="0.90909094"
         id="stop1691" />
      <stop
         id="stop1693"
         offset="0.95454544"
         style="stop-color:#eeeeec;stop-opacity:1" />
      <stop
         id="stop1695"
         offset="1"
         style="stop-color:#c0bfbc;stop-opacity:1" />
    </linearGradient>
    <clipPath
       clipPathUnits="userSpaceOnUse"
       id="clipPath1289">
      <path
         style="display:inline;opacity:1;vector-effect:none;fill:none;fill-opacity:1;stroke:#000000;stroke-width:4;stroke-linecap:round;stroke-linejoin:round;stroke-miterlimit:4;stroke-dasharray:none;stroke-dashoffset:0;stroke-opacity:1;marker:none;marker-start:none;marker-mid:none;marker-end:none;paint-order:normal;enable-background:new"
         d="m 64,-148 h 64 l 64,-64 64,64 h 192 c 17.728,0 32,14.272 32,32 v 288 c 0,17.728 -14.272,32 -32,32 H 256 l -64,-64 -64,64 H 64 C 46.272,204 32,189.728 32,172 v -288 c 0,-17.728 14.408898,-34.19889 32,-32 z"
         id="path1291"
         inkscape:connector-curvature="0"
         sodipodi:nodetypes="scccsssscccssss" />
    </clipPath>
    <linearGradient
       id="paint3_linear-2-6-5"
       x2="1"
       gradientUnits="userSpaceOnUse"
       gradientTransform="matrix(0,6,-12,0,-64,209.99687)">
      <stop
         stop-color="#C01C27"
         id="stop91-0-7-4" />
      <stop
         offset="1"
         stop-color="#E01B24"
         id="stop93-2-5-7" />
    </linearGradient>
    <clipPath
       clipPathUnits="userSpaceOnUse"
       id="clipPath1609">
      <path
         sodipodi:nodetypes="cccccc"
         inkscape:connector-curvature="0"
         id="path1611"
         d="m 252,116 28,-28 v -8 h -36 v 36 z"
         style="fill:#e74747;stroke:none;stroke-width:0.25px;stroke-linecap:butt;stroke-linejoin:miter;stroke-opacity:1" />
    </clipPath>
    <clipPath
       clipPathUnits="userSpaceOnUse"
       id="clipPath1773">
      <rect
         clip-path="none"
         transform="rotate(45)"
         ry="8.0000029"
         rx="8.0000029"
         y="222.42186"
         x="27.306532"
         height="84.026009"
         width="84.026009"
         id="rect1775"
         style="display:inline;opacity:1;vector-effect:none;fill:#4a86cf;fill-opacity:1;stroke:none;stroke-width:6.51673;stroke-linecap:butt;stroke-linejoin:miter;stroke-miterlimit:4;stroke-dasharray:none;stroke-dashoffset:0;stroke-opacity:1;marker:none;marker-start:none;marker-mid:none;marker-end:none;paint-order:normal;enable-background:new" />
    </clipPath>
    <clipPath
       clipPathUnits="userSpaceOnUse"
       id="clipPath1031">
      <path
         sodipodi:nodetypes="sssccccssssccccsss"
         inkscape:connector-curvature="0"
         id="path1033"
         d="m 64,175.30664 c -2.044953,0 -4.089301,0.78266 -5.65625,2.34961 l -52.6875,52.6875 C 4.0888112,231.91119 3.3117154,233.95506 3.3144531,236 H 3.3125 v 2 h 0.00195 c -0.00274,2.04494 0.7743556,4.08881 2.3417969,5.65625 l 52.6875001,52.6875 c 3.133899,3.1339 8.178601,3.1339 11.3125,0 l 52.687503,-52.6875 c 1.56744,-1.56744 2.34453,-3.61131 2.3418,-5.65625 h 0.002 v -2 h -0.002 c 0.003,-2.04494 -0.77436,-4.08881 -2.3418,-5.65625 l -52.6875,-52.6875 C 68.089301,176.0893 66.044953,175.30664 64,175.30664 Z"
         clip-path="none"
         style="display:inline;opacity:1;vector-effect:none;fill:#1c71d8;fill-opacity:1;stroke:none;stroke-width:6.51673;stroke-linecap:butt;stroke-linejoin:miter;stroke-miterlimit:4;stroke-dasharray:none;stroke-dashoffset:0;stroke-opacity:1;marker:none;marker-start:none;marker-mid:none;marker-end:none;paint-order:normal;enable-background:new" />
    </clipPath>
  </defs>
  <sodipodi:namedview
     inkscape:snap-page="true"
     stroke="#ef2929"
     fill="#f57900"
     id="base"
     pagecolor="#ffffff"
     bordercolor="#666666"
     borderopacity="0.25490196"
     inkscape:pageopacity="0.0"
     inkscape:pageshadow="2"
     inkscape:zoom="1.7788378"
     inkscape:cx="-48.687781"
     inkscape:cy="81.695384"
     inkscape:current-layer="layer1"
     showgrid="false"
     inkscape:grid-bbox="true"
     inkscape:document-units="px"
     inkscape:showpageshadow="false"
     inkscape:window-width="1920"
     inkscape:window-height="1016"
     inkscape:window-x="0"
     inkscape:window-y="0"
     width="400px"
     height="300px"
     inkscape:snap-nodes="true"
     inkscape:snap-bbox="false"
     objecttolerance="7"
     gridtolerance="12"
     guidetolerance="13"
     inkscape:window-maximized="1"
     inkscape:pagecheckerboard="false"
     showguides="false"
     inkscape:guide-bbox="true"
     inkscape:locked="false"
     inkscape:measure-start="0,0"
     inkscape:measure-end="0,0"
     inkscape:object-nodes="true"
     inkscape:bbox-nodes="true"
     inkscape:snap-global="true"
     inkscape:object-paths="true"
     inkscape:snap-intersection-paths="true"
     inkscape:snap-bbox-edge-midpoints="true"
     inkscape:snap-bbox-midpoints="true"
     showborder="true"
     inkscape:snap-center="true"
     inkscape:snap-object-midpoints="true"
     inkscape:snap-midpoints="true"
     inkscape:snap-smooth-nodes="true"
     inkscape:snap-text-baseline="true"
     borderlayer="true"
     inkscape:document-rotation="0">
    <inkscape:grid
       type="xygrid"
       id="grid5883"
       spacingx="2"
       spacingy="2"
       enabled="true"
       visible="true"
       empspacing="4"
       originx="8"
       originy="8" />
    <sodipodi:guide
       position="72,16"
       orientation="0,1"
       id="guide1073"
       inkscape:locked="false"
       inkscape:label=""
       inkscape:color="rgb(0,0,255)" />
    <sodipodi:guide
       position="20,72"
       orientation="1,0"
       id="guide1075"
       inkscape:locked="false"
       inkscape:label=""
       inkscape:color="rgb(0,0,255)" />
    <sodipodi:guide
       position="72,112"
       orientation="0,1"
       id="guide1099"
       inkscape:locked="false"
       inkscape:label=""
       inkscape:color="rgb(0,0,255)" />
    <sodipodi:guide
       position="72,136"
       orientation="0,1"
       id="guide993"
       inkscape:locked="false"
       inkscape:label=""
       inkscape:color="rgb(0,0,255)" />
    <sodipodi:guide
       position="112,72"
       orientation="1,0"
       id="guide995"
       inkscape:locked="false"
       inkscape:label=""
       inkscape:color="rgb(0,0,255)" />
    <sodipodi:guide
       position="8.0000001,72"
       orientation="1,0"
       id="guide867"
       inkscape:locked="false"
       inkscape:label=""
       inkscape:color="rgb(0,0,255)" />
    <sodipodi:guide
       position="128,72"
       orientation="1,0"
       id="guide869"
       inkscape:locked="false"
       inkscape:label=""
       inkscape:color="rgb(0,0,255)" />
    <sodipodi:guide
       position="72,124"
       orientation="0,1"
       id="guide871"
       inkscape:locked="false"
       inkscape:label=""
       inkscape:color="rgb(0,0,255)" />
    <inkscape:grid
       type="xygrid"
       id="grid873"
       spacingx="1"
       spacingy="1"
       empspacing="8"
       color="#000000"
       opacity="0.49019608"
       empcolor="#000000"
       empopacity="0.08627451"
       dotted="true"
       originx="8"
       originy="8" />
    <sodipodi:guide
       position="32,72"
       orientation="1,0"
       id="guide877"
       inkscape:locked="false"
       inkscape:label=""
       inkscape:color="rgb(0,0,255)" />
    <sodipodi:guide
       position="124,72"
       orientation="1,0"
       id="guide879"
       inkscape:locked="false"
       inkscape:label=""
       inkscape:color="rgb(0,0,255)" />
    <sodipodi:guide
       position="72,128"
       orientation="0,1"
       id="guide881"
       inkscape:locked="false"
       inkscape:label=""
       inkscape:color="rgb(0,0,255)" />
    <sodipodi:guide
       position="72,20"
       orientation="0,1"
       id="guide883"
       inkscape:locked="false"
       inkscape:label=""
       inkscape:color="rgb(0,0,255)" />
    <sodipodi:guide
       position="16,72"
       orientation="1,0"
       id="guide885"
       inkscape:locked="false"
       inkscape:label=""
       inkscape:color="rgb(0,0,255)" />
    <sodipodi:guide
       position="136,72"
       orientation="1,0"
       id="guide887"
       inkscape:locked="false"
       inkscape:label=""
       inkscape:color="rgb(0,0,255)" />
    <sodipodi:guide
       position="72,8"
       orientation="0,1"
       id="guide897"
       inkscape:locked="false"
       inkscape:label=""
       inkscape:color="rgb(0,0,255)" />
    <sodipodi:guide
       position="72,32"
       orientation="0,1"
       id="guide899"
       inkscape:locked="false"
       inkscape:label=""
       inkscape:color="rgb(0,0,255)" />
    <sodipodi:guide
       position="264,264"
       orientation="-0.70710678,0.70710678"
       id="guide950"
       inkscape:locked="false"
       inkscape:label=""
       inkscape:color="rgb(0,0,255)" />
    <sodipodi:guide
       position="72,72"
       orientation="0.70710678,0.70710678"
       id="guide952"
       inkscape:locked="false"
       inkscape:label=""
       inkscape:color="rgb(0,0,255)" />
  </sodipodi:namedview>
  <metadata
     id="metadata4">
    <rdf:RDF>
      <cc:Work
         rdf:about="">
        <dc:format>image/svg+xml</dc:format>
        <dc:type
           rdf:resource="http://purl.org/dc/dcmitype/StillImage" />
        <dc:creator>
          <cc:Agent>
            <dc:title>GNOME Design Team</dc:title>
          </cc:Agent>
        </dc:creator>
        <dc:source />
        <cc:license
           rdf:resource="http://creativecommons.org/licenses/by-sa/4.0/" />
        <dc:title>Adwaita Icon Template</dc:title>
        <dc:subject>
          <rdf:Bag />
        </dc:subject>
        <dc:date />
        <dc:rights>
          <cc:Agent>
            <dc:title />
          </cc:Agent>
        </dc:rights>
        <dc:publisher>
          <cc:Agent>
            <dc:title />
          </cc:Agent>
        </dc:publisher>
        <dc:identifier />
        <dc:relation />
        <dc:language />
        <dc:coverage />
        <dc:description />
        <dc:contributor>
          <cc:Agent>
            <dc:title />
          </cc:Agent>
        </dc:contributor>
      </cc:Work>
      <cc:License
         rdf:about="http://creativecommons.org/licenses/by-sa/4.0/">
        <cc:permits
           rdf:resource="http://creativecommons.org/ns#Reproduction" />
        <cc:permits
           rdf:resource="http://creativecommons.org/ns#Distribution" />
        <cc:requires
           rdf:resource="http://creativecommons.org/ns#Notice" />
        <cc:requires
           rdf:resource="http://creativecommons.org/ns#Attribution" />
        <cc:permits
           rdf:resource="http://creativecommons.org/ns#DerivativeWorks" />
        <cc:requires
           rdf:resource="http://creativecommons.org/ns#ShareAlike" />
      </cc:License>
    </rdf:RDF>
  </metadata>
  <g
     id="layer1"
     inkscape:label="App Icon"
     inkscape:groupmode="layer"
     style="display:inline"
     transform="translate(8,-156)">
    <g
       sodipodi:insensitive="true"
       inkscape:groupmode="layer"
       id="layer4"
       inkscape:label="template"
       style="display:inline">
      <rect
         inkscape:label="0"
         y="156"
         x="-8"
         height="128"
         width="128"
         id="hicolor"
         style="display:inline;overflow:visible;visibility:visible;fill:#f0f0f0;fill-opacity:0;fill-rule:nonzero;stroke:none;stroke-width:0.5;marker:none;enable-background:accumulate" />
      <rect
         style="display:inline;overflow:visible;visibility:visible;fill:#f0f0f0;fill-opacity:0;fill-rule:nonzero;stroke:none;stroke-width:0.5;marker:none;enable-background:accumulate"
         id="symbolic"
         width="16"
         height="16"
         x="160"
         y="172"
         inkscape:label="0" />
    </g>
    <g
       sodipodi:insensitive="true"
       inkscape:groupmode="layer"
       id="layer2"
       inkscape:label="baseplate"
       style="display:none">
      <g
         style="display:inline;fill:#000000;enable-background:new"
         transform="matrix(7.9911709,0,0,8.0036407,-167.7909,-4846.0776)"
         id="g12027"
         inkscape:export-xdpi="12"
         inkscape:export-ydpi="12" />
      <rect
         style="display:inline;overflow:visible;visibility:visible;fill:#f0f0f0;fill-opacity:1;fill-rule:nonzero;stroke:none;stroke-width:0.5;marker:none;enable-background:accumulate"
         id="128"
         width="128"
         height="128"
         x="-8"
         y="156"
         inkscape:label="0" />
      <g
         id="g883"
         style="fill:none;fill-opacity:0.25098;stroke:#a579b3;stroke-opacity:1"
         transform="translate(-24,24)" />
      <g
         id="g900"
         style="fill:none;fill-opacity:0.25098;stroke:#a579b3;stroke-opacity:1"
         transform="translate(-24,24)" />
      <rect
         inkscape:label=""
         y="172"
         x="160"
         height="16"
         width="16"
         id="16"
         style="display:inline;overflow:visible;visibility:visible;fill:#f0f0f0;fill-opacity:1;fill-rule:nonzero;stroke:none;stroke-width:0.5;marker:none;enable-background:accumulate" />
      <text
         xml:space="preserve"
         style="font-style:normal;font-variant:normal;font-weight:bold;font-stretch:normal;font-size:4px;line-height:125%;font-family:Cantarell;-inkscape-font-specification:'Cantarell, Bold';text-align:start;writing-mode:lr-tb;text-anchor:start;display:inline;fill:#000000;fill-opacity:1;stroke:none;stroke-width:0.332649;enable-background:new"
         x="-8"
         y="151"
         id="text863"
         inkscape:label="icon-name"><tspan
           style="font-size:4px;stroke-width:0.332649"
           sodipodi:role="line"
           id="tspan861"
           x="-8"
           y="151">Hicolor</tspan></text>
      <text
         inkscape:label="icon-name"
         id="text867"
         y="167"
         x="160"
         style="font-style:normal;font-variant:normal;font-weight:bold;font-stretch:normal;font-size:4px;line-height:125%;font-family:Cantarell;-inkscape-font-specification:'Cantarell, Bold';text-align:start;writing-mode:lr-tb;text-anchor:start;display:inline;fill:#000000;fill-opacity:1;stroke:none;stroke-width:0.332649;enable-background:new"
         xml:space="preserve"><tspan
           y="167"
           x="160"
           id="tspan865"
           sodipodi:role="line"
           style="font-size:4px;stroke-width:0.332649">Symbolic</tspan></text>
    </g>
    <g
       inkscape:groupmode="layer"
       id="layer9"
       inkscape:label="icons"
       style="display:inline" />
    <g
       inkscape:groupmode="layer"
       id="layer3"
       inkscape:label="grid"
       style="display:none"
       sodipodi:insensitive="true">
      <circle
         cx="64.000031"
         cy="236"
         r="59.504131"
         id="circle2892"
         style="display:inline;opacity:0.1;vector-effect:none;fill:none;fill-opacity:1;stroke:#000000;stroke-width:0.99;stroke-linecap:butt;stroke-linejoin:miter;stroke-miterlimit:4;stroke-dasharray:0.99, 0.99;stroke-dashoffset:0;stroke-opacity:1;marker:none;marker-start:none;marker-mid:none;marker-end:none;paint-order:normal;enable-background:new" />
      <rect
         ry="7.9292889"
         rx="8.701004"
         y="180.49496"
         x="20.495007"
         height="111.01005"
         width="87.009987"
         id="rect2894"
         style="display:inline;opacity:0.1;vector-effect:none;fill:none;fill-opacity:1;stroke:#000000;stroke-width:0.99;stroke-linecap:butt;stroke-linejoin:miter;stroke-miterlimit:4;stroke-dasharray:0.99, 0.99;stroke-dashoffset:0;stroke-opacity:1;marker:none;marker-start:none;marker-mid:none;marker-end:none;paint-order:normal;enable-background:new" />
      <rect
         ry="7.9238095"
         rx="7.9238095"
         y="184.49524"
         x="12.495266"
         height="103.00952"
         width="103.00952"
         id="rect2896"
         style="display:inline;opacity:0.1;vector-effect:none;fill:none;fill-opacity:1;stroke:#000000;stroke-width:0.99;stroke-linecap:butt;stroke-linejoin:miter;stroke-miterlimit:4;stroke-dasharray:0.99, 0.99;stroke-dashoffset:0;stroke-opacity:1;marker:none;marker-start:none;marker-mid:none;marker-end:none;paint-order:normal;enable-background:new" />
      <rect
         ry="8.701005"
         rx="7.9292889"
         y="200.49496"
         x="8.4950066"
         height="87.010048"
         width="111.01004"
         id="rect2898"
         style="display:inline;opacity:0.1;vector-effect:none;fill:none;fill-opacity:1;stroke:#000000;stroke-width:0.99;stroke-linecap:butt;stroke-linejoin:miter;stroke-miterlimit:4;stroke-dasharray:0.99, 0.99;stroke-dashoffset:0;stroke-opacity:1;marker:none;marker-start:none;marker-mid:none;marker-end:none;paint-order:normal;enable-background:new" />
      <path
         inkscape:connector-curvature="0"
         id="path2900"
         d="M 2.6203015e-5,288.99999 H 128.00003"
         style="display:inline;fill:none;stroke:#62a0ea;stroke-width:2;stroke-linecap:butt;stroke-linejoin:miter;stroke-miterlimit:4;stroke-dasharray:none;stroke-opacity:1;enable-background:new" />
    </g>
    <rect
       style="display:inline;vector-effect:none;fill:#4a86cf;fill-opacity:1;stroke:none;stroke-width:6.51673;stroke-linecap:butt;stroke-linejoin:miter;stroke-miterlimit:4;stroke-dasharray:none;stroke-dashoffset:0;stroke-opacity:1;marker:none;marker-start:none;marker-mid:none;marker-end:none;paint-order:normal;enable-background:new"
       id="rect18571"
       width="84.026009"
       height="84.026009"
       x="-727.90625"
       y="977.63373"
       rx="8.0000029"
       ry="8.0000029"
       transform="rotate(45)"
       clip-path="none" />
    <path
       style="display:inline;vector-effect:none;fill:#f9cf69;fill-opacity:1;stroke:none;stroke-width:8.74862;stroke-linecap:butt;stroke-linejoin:miter;stroke-miterlimit:4;stroke-dasharray:none;stroke-dashoffset:0;stroke-opacity:1;marker:none;marker-start:none;marker-mid:none;marker-end:none;paint-order:normal;enable-background:new"
       d="m -1236.0676,206.66206 76.0139,-76.01398 0.061,29.34493 -76.0139,76.014 z"
       id="rect1736"
       inkscape:connector-curvature="0"
       sodipodi:nodetypes="ccccc" />
    <g
       style="display:inline;enable-background:new"
       id="g916"
       transform="translate(-1110)">
      <rect
         style="display:inline;opacity:1;vector-effect:none;fill:#4a86cf;fill-opacity:1;stroke:none;stroke-width:6.51673;stroke-linecap:butt;stroke-linejoin:miter;stroke-miterlimit:4;stroke-dasharray:none;stroke-dashoffset:0;stroke-opacity:1;marker:none;marker-start:none;marker-mid:none;marker-end:none;paint-order:normal;enable-background:new"
         id="rect883"
         width="84.026009"
         height="84.026009"
         x="168.72789"
         y="81.000496"
         rx="8.0000029"
         ry="8.0000029"
         transform="rotate(45)"
         clip-path="none" />
      <g
         id="g901"
         clip-path="url(#clipPath1773)"
         transform="translate(200)">
        <path
           style="opacity:1;vector-effect:none;fill:#2ec27e;fill-opacity:1;stroke:none;stroke-width:8.74862;stroke-linecap:butt;stroke-linejoin:miter;stroke-miterlimit:4;stroke-dasharray:none;stroke-dashoffset:0;stroke-opacity:1;marker:none;marker-start:none;marker-mid:none;marker-end:none;paint-order:normal"
           d="m -168.06769,206.92375 77.275661,-77.27568 0.06171,29.83201 -77.275661,77.27569 z"
           id="path885"
           inkscape:connector-curvature="0"
           sodipodi:nodetypes="ccccc" />
        <path
           sodipodi:nodetypes="ccccc"
           inkscape:connector-curvature="0"
           id="path887"
           d="m -155.86851,224.46007 77.275658,-77.27568 0.06171,29.83201 -77.275658,77.27569 z"
           style="opacity:1;vector-effect:none;fill:#e66100;fill-opacity:1;stroke:none;stroke-width:8.74862;stroke-linecap:butt;stroke-linejoin:miter;stroke-miterlimit:4;stroke-dasharray:none;stroke-dashoffset:0;stroke-opacity:1;marker:none;marker-start:none;marker-mid:none;marker-end:none;paint-order:normal" />
        <path
           style="opacity:1;vector-effect:none;fill:#66a2eb;fill-opacity:1;stroke:none;stroke-width:8.74862;stroke-linecap:butt;stroke-linejoin:miter;stroke-miterlimit:4;stroke-dasharray:none;stroke-dashoffset:0;stroke-opacity:1;marker:none;marker-start:none;marker-mid:none;marker-end:none;paint-order:normal"
           d="m -123.33737,221.15612 77.275661,-77.27567 0.06171,29.832 -77.275661,77.2757 z"
           id="path889"
           inkscape:connector-curvature="0"
           sodipodi:nodetypes="ccccc" />
        <path
           sodipodi:nodetypes="ccccc"
           inkscape:connector-curvature="0"
           id="path891"
           d="m -133.50335,261.0576 77.275658,-77.27567 0.06171,29.832 -77.275658,77.2757 z"
           style="opacity:1;vector-effect:none;fill:#e01b24;fill-opacity:1;stroke:none;stroke-width:8.74862;stroke-linecap:butt;stroke-linejoin:miter;stroke-miterlimit:4;stroke-dasharray:none;stroke-dashoffset:0;stroke-opacity:1;marker:none;marker-start:none;marker-mid:none;marker-end:none;paint-order:normal" />
        <path
           sodipodi:nodetypes="ccccc"
           inkscape:connector-curvature="0"
           id="path893"
           d="m -242.63783,192.36216 77.27566,77.27568 0.0617,-29.83201 -77.27566,-77.27569 z"
           style="opacity:0.487;vector-effect:none;fill:#98c1f1;fill-opacity:1;stroke:none;stroke-width:8.74862;stroke-linecap:butt;stroke-linejoin:miter;stroke-miterlimit:4;stroke-dasharray:none;stroke-dashoffset:0;stroke-opacity:1;marker:none;marker-start:none;marker-mid:none;marker-end:none;paint-order:normal" />
        <path
           style="opacity:0.487;vector-effect:none;fill:#865e3c;fill-opacity:1;stroke:none;stroke-width:8.74862;stroke-linecap:butt;stroke-linejoin:miter;stroke-miterlimit:4;stroke-dasharray:none;stroke-dashoffset:0;stroke-opacity:1;marker:none;marker-start:none;marker-mid:none;marker-end:none;paint-order:normal"
           d="m -217.23067,187.89023 77.27566,77.27568 0.0617,-29.83201 -77.27566,-77.27569 z"
           id="path895"
           inkscape:connector-curvature="0"
           sodipodi:nodetypes="ccccc" />
        <path
           sodipodi:nodetypes="ccccc"
           inkscape:connector-curvature="0"
           id="path897"
           d="m -186,189.5 77.27566,77.27567 0.0617,-29.832 -77.27566,-77.2757 z"
           style="opacity:0.487;vector-effect:none;fill:#ff7800;fill-opacity:1;stroke:none;stroke-width:8.74862;stroke-linecap:butt;stroke-linejoin:miter;stroke-miterlimit:4;stroke-dasharray:none;stroke-dashoffset:0;stroke-opacity:1;marker:none;marker-start:none;marker-mid:none;marker-end:none;paint-order:normal" />
        <path
           style="opacity:0.487;vector-effect:none;fill:#26a269;fill-opacity:1;stroke:none;stroke-width:8.74862;stroke-linecap:butt;stroke-linejoin:miter;stroke-miterlimit:4;stroke-dasharray:none;stroke-dashoffset:0;stroke-opacity:1;marker:none;marker-start:none;marker-mid:none;marker-end:none;paint-order:normal"
           d="m -190,155.75 77.27566,77.27567 0.0617,-29.832 -77.27566,-77.2757 z"
           id="path899"
           inkscape:connector-curvature="0"
           sodipodi:nodetypes="ccccc" />
      </g>
      <path
         style="display:inline;opacity:0.312;vector-effect:none;fill:#1a5fb4;fill-opacity:1;stroke:none;stroke-width:6.51673;stroke-linecap:butt;stroke-linejoin:miter;stroke-miterlimit:4;stroke-dasharray:none;stroke-dashoffset:0;stroke-opacity:1;marker:none;marker-start:none;marker-mid:none;marker-end:none;paint-order:normal;enable-background:new"
         clip-path="none"
         d="m 6.1855469,62 c -0.6853037,2.649084 0.00531,5.573672 2.0878906,7.65625 L 56.375,117.75781 c 3.133898,3.1339 8.180555,3.1339 11.314453,0 L 115.79102,69.65625 c 2.08257,-2.082578 2.77319,-5.007166 2.08789,-7.65625 -0.34596,1.337303 -1.03657,2.604929 -2.08789,3.65625 l -48.101567,48.10156 c -3.133898,3.1339 -8.180555,3.1339 -11.314453,0 L 8.2734375,65.65625 C 7.2221167,64.604929 6.5314999,63.337303 6.1855469,62 Z"
         transform="translate(0,172)"
         id="path903"
         inkscape:connector-curvature="0" />
    </g>
    <g
       transform="translate(-8.0000002,-16.000007)"
       id="g1525">
      <path
         sodipodi:nodetypes="ccccccc"
         inkscape:connector-curvature="0"
         id="path1054"
         d="M 48,252.00001 H 32 v 16 2 l 16,16 8,-18 z"
         style="display:inline;vector-effect:none;fill:#bf9ae5;fill-opacity:1;stroke:none;stroke-width:8.74862;stroke-linecap:butt;stroke-linejoin:miter;stroke-miterlimit:4;stroke-dasharray:none;stroke-dashoffset:0;stroke-opacity:1;marker:none;marker-start:none;marker-mid:none;marker-end:none;paint-order:normal;enable-background:new" />
      <path
         sodipodi:nodetypes="ccccsscccc"
         inkscape:connector-curvature="0"
         id="rect930"
         d="m 80,252.00001 -24,8 -8,24 v 2 l 10.34375,10.34375 c 3.1339,3.1339 8.17861,3.1339 11.3125,0 l 26.35743,-26.35742 -0.002,-1.99805 L 94,254.00001 Z"
         clip-path="none"
         style="display:inline;vector-effect:none;fill:#50d0e6;fill-opacity:1;stroke:none;stroke-width:6.51673;stroke-linecap:butt;stroke-linejoin:miter;stroke-miterlimit:4;stroke-dasharray:none;stroke-dashoffset:0;stroke-opacity:1;marker:none;marker-start:none;marker-mid:none;marker-end:none;paint-order:normal;enable-background:new" />
      <path
         style="display:inline;vector-effect:none;fill:#21a57e;fill-opacity:1;stroke:none;stroke-width:8.74862;stroke-linecap:butt;stroke-linejoin:miter;stroke-miterlimit:4;stroke-dasharray:none;stroke-dashoffset:0;stroke-opacity:1;marker:none;marker-start:none;marker-mid:none;marker-end:none;paint-order:normal;enable-background:new"
         d="m 48,220.00001 4,-12 12,-4 8,16 -8,16 -14,-2 z"
         id="path998"
         inkscape:connector-curvature="0"
         sodipodi:nodetypes="ccccccc" />
      <path
         sodipodi:nodetypes="cccccc"
         inkscape:connector-curvature="0"
         id="path1010"
         d="M 80,252.00001 96.01235,267.98766 104,252.00001 l -8,-16 -12,4 z"
         style="display:inline;vector-effect:none;fill:#ffcd48;fill-opacity:1;stroke:none;stroke-width:8.74862;stroke-linecap:butt;stroke-linejoin:miter;stroke-miterlimit:4;stroke-dasharray:none;stroke-dashoffset:0;stroke-opacity:1;marker:none;marker-start:none;marker-mid:none;marker-end:none;paint-order:normal;enable-background:new" />
      <path
         style="display:inline;vector-effect:none;fill:#ffaa00;fill-opacity:1;stroke:none;stroke-width:8.74862;stroke-linecap:butt;stroke-linejoin:miter;stroke-miterlimit:4;stroke-dasharray:none;stroke-dashoffset:0;stroke-opacity:1;marker:none;marker-start:none;marker-mid:none;marker-end:none;paint-order:normal;enable-background:new"
         d="m 64,236.00001 8,-24 24,-8 8,20 -8,12 -16,16 H 64 Z"
         id="path1745"
         inkscape:connector-curvature="0"
         sodipodi:nodetypes="cccccccc" />
      <path
         style="display:inline;vector-effect:none;fill:#bee8f6;fill-opacity:1;stroke:none;stroke-width:8.74862;stroke-linecap:butt;stroke-linejoin:miter;stroke-miterlimit:4;stroke-dasharray:none;stroke-dashoffset:0;stroke-opacity:1;marker:none;marker-start:none;marker-mid:none;marker-end:none;paint-order:normal;enable-background:new"
         d="m 80,252.00001 -32,32 v -32 l 4,-12 12,-4 z"
         id="path984"
         inkscape:connector-curvature="0"
         sodipodi:nodetypes="cccccc" />
      <path
         style="display:inline;vector-effect:none;fill:#2ec299;fill-opacity:1;stroke:none;stroke-width:8.74862;stroke-linecap:butt;stroke-linejoin:miter;stroke-miterlimit:4;stroke-dasharray:none;stroke-dashoffset:0;stroke-opacity:1;marker:none;marker-start:none;marker-mid:none;marker-end:none;paint-order:normal;enable-background:new"
         d="m 64,204.00001 4,-13 12,-3 16,16 -32,32 z"
         id="path1741"
         inkscape:connector-curvature="0"
         sodipodi:nodetypes="cccccc" />
      <path
         sodipodi:nodetypes="cccccccscccccc"
         inkscape:connector-curvature="0"
         id="path980"
         d="M 32.03125,203.96876 18.63282,217.3672 5.34571,230.68751 c -1.35341,1.51718 -2.0338,3.41173 -2.03125,5.3125 h -0.002 v 2 h 0.002 c -0.003,2.04494 0.77436,4.08881 2.3418,5.65625 l 10.34375,10.34375 v -2 l 24,-8 8,-24 -4,-12 z"
         style="display:inline;vector-effect:none;fill:#6746d6;fill-opacity:1;stroke:none;stroke-width:8.74862;stroke-linecap:butt;stroke-linejoin:miter;stroke-miterlimit:4;stroke-dasharray:none;stroke-dashoffset:0;stroke-opacity:1;marker:none;marker-start:none;marker-mid:none;marker-end:none;paint-order:normal;enable-background:new" />
      <path
         sodipodi:nodetypes="ssccccss"
         inkscape:connector-curvature="0"
         id="path1743"
         d="m 64,175.30665 c -2.04495,0 -4.0893,0.78266 -5.65625,2.34961 L 32,204.00001 l 16,8 16,-8 15.98633,-16.01367 -10.33008,-10.33008 C 68.0893,176.08931 66.04495,175.30665 64,175.30665 Z"
         style="display:inline;vector-effect:none;fill:#f8e859;fill-opacity:1;stroke:none;stroke-width:8.74862;stroke-linecap:butt;stroke-linejoin:miter;stroke-miterlimit:4;stroke-dasharray:none;stroke-dashoffset:0;stroke-opacity:1;marker:none;marker-start:none;marker-mid:none;marker-end:none;paint-order:normal;enable-background:new" />
      <path
         id="path1747"
         d="m 96,204.00001 -0.0664,33.90039 16.08203,16.08399 10.32813,-10.32813 c 1.56744,-1.56744 2.34453,-3.61131 2.3418,-5.65625 h 0.002 v -2 h -0.002 c 0.003,-2.04494 -0.77436,-4.08881 -2.3418,-5.65625 z"
         style="display:inline;vector-effect:none;fill:#e7375f;fill-opacity:1;stroke:none;stroke-width:8.74862;stroke-linecap:butt;stroke-linejoin:miter;stroke-miterlimit:4;stroke-dasharray:none;stroke-dashoffset:0;stroke-opacity:1;marker:none;marker-start:none;marker-mid:none;marker-end:none;paint-order:normal;enable-background:new"
         inkscape:connector-curvature="0" />
      <path
         style="display:inline;opacity:0.2;vector-effect:none;fill:#ffffff;fill-opacity:1;stroke:none;stroke-width:8.74862;stroke-linecap:butt;stroke-linejoin:miter;stroke-miterlimit:4;stroke-dasharray:none;stroke-dashoffset:0;stroke-opacity:1;marker:none;marker-start:none;marker-mid:none;marker-end:none;paint-order:normal;enable-background:new"
         d="m 64,204.00001 16,16 16,-16 -16,-16 z"
         id="path1757"
         inkscape:connector-curvature="0"
         sodipodi:nodetypes="ccccc" />
      <path
         sodipodi:nodetypes="cccc"
         inkscape:connector-curvature="0"
         id="path990"
         d="m 32,204.00001 16,16 16,-16 z"
         style="display:inline;vector-effect:none;fill:#eec40a;fill-opacity:1;stroke:none;stroke-width:8.74862;stroke-linecap:butt;stroke-linejoin:miter;stroke-miterlimit:4;stroke-dasharray:none;stroke-dashoffset:0;stroke-opacity:1;marker:none;marker-start:none;marker-mid:none;marker-end:none;paint-order:normal;enable-background:new" />
      <path
         id="path1046"
         d="m 96,236.00001 0.0137,33.98633 15.98632,-15.98633 v -1.98242 z"
         style="display:inline;vector-effect:none;fill:#f87d9e;fill-opacity:1;stroke:none;stroke-width:8.74862;stroke-linecap:butt;stroke-linejoin:miter;stroke-miterlimit:4;stroke-dasharray:none;stroke-dashoffset:0;stroke-opacity:1;marker:none;marker-start:none;marker-mid:none;marker-end:none;paint-order:normal;enable-background:new"
         inkscape:connector-curvature="0" />
      <path
         sodipodi:nodetypes="cccccccc"
         inkscape:connector-curvature="0"
         id="path1753"
         d="M 32.02344,235.97657 16,252.00001 v 2 l 16,16 v -2 l 16,-16 -4,-12 z"
         style="display:inline;vector-effect:none;fill:#8d60d8;fill-opacity:1;stroke:none;stroke-width:8.74862;stroke-linecap:butt;stroke-linejoin:miter;stroke-miterlimit:4;stroke-dasharray:none;stroke-dashoffset:0;stroke-opacity:1;marker:none;marker-start:none;marker-mid:none;marker-end:none;paint-order:normal;enable-background:new" />
      <path
         sodipodi:nodetypes="ccccc"
         inkscape:connector-curvature="0"
         id="path1060"
         d="m 64,236.00001 -16,16 L 32.02319,235.97682 48,228.00001 Z"
         style="display:inline;vector-effect:none;fill:#5dc2f3;fill-opacity:1;stroke:none;stroke-width:8.74862;stroke-linecap:butt;stroke-linejoin:miter;stroke-miterlimit:4;stroke-dasharray:none;stroke-dashoffset:0;stroke-opacity:1;marker:none;marker-start:none;marker-mid:none;marker-end:none;paint-order:normal;enable-background:new" />
      <path
         style="display:inline;vector-effect:none;fill:#1c8dd3;fill-opacity:1;stroke:none;stroke-width:8.74862;stroke-linecap:butt;stroke-linejoin:miter;stroke-miterlimit:4;stroke-dasharray:none;stroke-dashoffset:0;stroke-opacity:1;marker:none;marker-start:none;marker-mid:none;marker-end:none;paint-order:normal;enable-background:new"
         d="m 64,236.00001 -16,-16 -16,16 z"
         id="path988"
         inkscape:connector-curvature="0"
         sodipodi:nodetypes="cccc" />
      <path
         id="path1035"
         d="m 3.3125,236.00001 v 2 h 0.002 c -0.003,2.04494 0.77436,4.08881 2.3418,5.65625 l 52.6875,52.6875 c 3.1339,3.1339 8.1786,3.1339 11.3125,0 l 52.6875,-52.6875 c 1.56744,-1.56744 2.34453,-3.61131 2.3418,-5.65625 h 0.002 v -2 h -0.002 c 0.003,2.04494 -0.77436,4.08881 -2.3418,5.65625 l -52.6875,52.6875 c -3.1339,3.1339 -8.1786,3.1339 -11.3125,0 L 5.6563,241.65626 c -1.56744,-1.56744 -2.34453,-3.61131 -2.34179,-5.65625 z"
         clip-path="none"
         style="display:inline;opacity:0.2;vector-effect:none;fill:#000000;fill-opacity:1;stroke:none;stroke-width:6.51673;stroke-linecap:butt;stroke-linejoin:miter;stroke-miterlimit:4;stroke-dasharray:none;stroke-dashoffset:0;stroke-opacity:1;marker:none;marker-start:none;marker-mid:none;marker-end:none;paint-order:normal;enable-background:new"
         inkscape:connector-curvature="0" />
    </g>
    <path
       inkscape:connector-curvature="0"
       style="display:inline;vector-effect:none;fill:#241f31;fill-opacity:1;stroke:none;stroke-width:6.51673;stroke-linecap:butt;stroke-linejoin:miter;stroke-miterlimit:4;stroke-dasharray:none;stroke-dashoffset:0;stroke-opacity:1;marker:none;marker-start:none;marker-mid:none;marker-end:none;paint-order:normal;enable-background:new"
       clip-path="none"
       d="m 168,172.00001 c -0.26956,0 -0.53953,0.1015 -0.74609,0.30469 l -6.94532,6.83203 c -0.20661,0.20325 -0.30895,0.46921 -0.30859,0.73437 v 0.25782 c -4e-4,0.26517 0.10198,0.53111 0.30859,0.73437 l 6.94532,6.83203 c 0.41311,0.4064 1.07905,0.4064 1.49218,0 l 6.94532,-6.83203 c 0.20663,-0.20326 0.30894,-0.4692 0.30859,-0.73437 v -0.25782 c 4e-4,-0.26516 -0.10196,-0.53112 -0.30859,-0.73437 l -6.94532,-6.83203 c -0.20657,-0.20319 -0.47652,-0.30469 -0.74609,-0.30469 z m 0,2 6,6 h -0.0156 l -5.95508,5.95508 v -5.95508 H 162 Z"
       id="rect930-3" />
    <path
       style="display:inline;opacity:0.3;vector-effect:none;fill:#241f31;fill-opacity:1;stroke:none;stroke-width:1;stroke-linecap:butt;stroke-linejoin:miter;stroke-miterlimit:4;stroke-dasharray:none;stroke-dashoffset:0;stroke-opacity:1;marker:none;marker-start:none;marker-mid:none;marker-end:none;paint-order:normal;enable-background:new"
       d="m 168,180.00001 v 6 l 6,-6 z"
       id="path925"
       inkscape:connector-curvature="0" />
    <g
       transform="translate(-440)"
       style="display:inline;enable-background:new"
       id="g1014">
      <path
         style="display:inline;opacity:1;vector-effect:none;fill:#1c71d8;fill-opacity:1;stroke:none;stroke-width:6.51673;stroke-linecap:butt;stroke-linejoin:miter;stroke-miterlimit:4;stroke-dasharray:none;stroke-dashoffset:0;stroke-opacity:1;marker:none;marker-start:none;marker-mid:none;marker-end:none;paint-order:normal;enable-background:new"
         clip-path="none"
         d="m -456,175.30664 c -2.04495,0 -4.0893,0.78266 -5.65625,2.34961 l -52.6875,52.6875 c -1.56744,1.56744 -2.34453,3.61131 -2.3418,5.65625 h -0.002 v 2 h 0.002 c -0.003,2.04494 0.77436,4.08881 2.3418,5.65625 l 52.6875,52.6875 c 3.1339,3.1339 8.1786,3.1339 11.3125,0 l 52.6875,-52.6875 c 1.56744,-1.56744 2.34453,-3.61131 2.3418,-5.65625 h 0.002 v -2 h -0.002 c 0.003,-2.04494 -0.77436,-4.08881 -2.3418,-5.65625 l -52.6875,-52.6875 c -1.56695,-1.56695 -3.6113,-2.34961 -5.65625,-2.34961 z"
         id="path906"
         inkscape:connector-curvature="0"
         sodipodi:nodetypes="sssccccssssccccsss" />
      <g
         transform="translate(-520)"
         id="g942"
         clip-path="url(#clipPath1031)">
        <path
           style="opacity:1;vector-effect:none;fill:#26a269;fill-opacity:1;stroke:none;stroke-width:8.74862;stroke-linecap:butt;stroke-linejoin:miter;stroke-miterlimit:4;stroke-dasharray:none;stroke-dashoffset:0;stroke-opacity:1;marker:none;marker-start:none;marker-mid:none;marker-end:none;paint-order:normal"
           d="m 48,220 16,-16 v 32 l -16,16 z"
           id="path908"
           inkscape:connector-curvature="0"
           sodipodi:nodetypes="ccccc" />
        <path
           style="opacity:1;vector-effect:none;fill:#813d9c;fill-opacity:1;stroke:none;stroke-width:8.74862;stroke-linecap:butt;stroke-linejoin:miter;stroke-miterlimit:4;stroke-dasharray:none;stroke-dashoffset:0;stroke-opacity:1;marker:none;marker-start:none;marker-mid:none;marker-end:none;paint-order:normal"
           d="m 16,252 v 16 l 16,16 V 268 L 48,252 32.023188,235.97681 Z"
           id="path910"
           inkscape:connector-curvature="0"
           sodipodi:nodetypes="ccccccc" />
        <path
           style="opacity:1;vector-effect:none;fill:#98c1f1;fill-opacity:1;stroke:none;stroke-width:8.74862;stroke-linecap:butt;stroke-linejoin:miter;stroke-miterlimit:4;stroke-dasharray:none;stroke-dashoffset:0;stroke-opacity:1;marker:none;marker-start:none;marker-mid:none;marker-end:none;paint-order:normal"
           d="M 80,252 48,284 V 252 L 79.892384,219.7583 Z"
           id="path912"
           inkscape:connector-curvature="0"
           sodipodi:nodetypes="ccccc" />
        <path
           style="opacity:1;vector-effect:none;fill:#2ec27e;fill-opacity:1;stroke:none;stroke-width:8.74862;stroke-linecap:butt;stroke-linejoin:miter;stroke-miterlimit:4;stroke-dasharray:none;stroke-dashoffset:0;stroke-opacity:1;marker:none;marker-start:none;marker-mid:none;marker-end:none;paint-order:normal"
           d="m 64,204 56,-56 v 32 l -56,56 z"
           id="path914"
           inkscape:connector-curvature="0"
           sodipodi:nodetypes="ccccc" />
        <path
           sodipodi:nodetypes="ccccccc"
           inkscape:connector-curvature="0"
           id="path916"
           d="m 48,220 -32,32 v 8 H 8 l -16.1319999,-15.80164 40.1484619,-40.248 z"
           style="opacity:1;vector-effect:none;fill:#613583;fill-opacity:1;stroke:none;stroke-width:8.74862;stroke-linecap:butt;stroke-linejoin:miter;stroke-miterlimit:4;stroke-dasharray:none;stroke-dashoffset:0;stroke-opacity:1;marker:none;marker-start:none;marker-mid:none;marker-end:none;paint-order:normal" />
        <path
           sodipodi:nodetypes="ccccc"
           inkscape:connector-curvature="0"
           id="path918"
           d="M 32,204 72,164 88.066,179.90081 48,220 Z"
           style="opacity:1;vector-effect:none;fill:#f5c211;fill-opacity:1;stroke:none;stroke-width:8.74862;stroke-linecap:butt;stroke-linejoin:miter;stroke-miterlimit:4;stroke-dasharray:none;stroke-dashoffset:0;stroke-opacity:1;marker:none;marker-start:none;marker-mid:none;marker-end:none;paint-order:normal" />
        <path
           sodipodi:nodetypes="ccccc"
           inkscape:connector-curvature="0"
           id="path920"
           d="m 128,236 -32,-32 -0.066,33.90081 32,32.00003 z"
           style="opacity:1;vector-effect:none;fill:#e01b24;fill-opacity:1;stroke:none;stroke-width:8.74862;stroke-linecap:butt;stroke-linejoin:miter;stroke-miterlimit:4;stroke-dasharray:none;stroke-dashoffset:0;stroke-opacity:1;marker:none;marker-start:none;marker-mid:none;marker-end:none;paint-order:normal" />
        <path
           style="opacity:1;vector-effect:none;fill:#ff7800;fill-opacity:1;stroke:none;stroke-width:8.74862;stroke-linecap:butt;stroke-linejoin:miter;stroke-miterlimit:4;stroke-dasharray:none;stroke-dashoffset:0;stroke-opacity:1;marker:none;marker-start:none;marker-mid:none;marker-end:none;paint-order:normal"
           d="m 64,236 32,-32 v 32 l -16,16 z"
           id="path922"
           inkscape:connector-curvature="0"
           sodipodi:nodetypes="ccccc" />
        <path
           style="opacity:0.2;vector-effect:none;fill:#ffffff;fill-opacity:1;stroke:none;stroke-width:8.74862;stroke-linecap:butt;stroke-linejoin:miter;stroke-miterlimit:4;stroke-dasharray:none;stroke-dashoffset:0;stroke-opacity:1;marker:none;marker-start:none;marker-mid:none;marker-end:none;paint-order:normal"
           d="M 64,204 80,220 96,204 80,188 Z"
           id="path924"
           inkscape:connector-curvature="0"
           sodipodi:nodetypes="ccccc" />
        <path
           style="opacity:1;vector-effect:none;fill:#dc8add;fill-opacity:1;stroke:none;stroke-width:8.74862;stroke-linecap:butt;stroke-linejoin:miter;stroke-miterlimit:4;stroke-dasharray:none;stroke-dashoffset:0;stroke-opacity:1;marker:none;marker-start:none;marker-mid:none;marker-end:none;paint-order:normal"
           d="M 32,204 0.066,235.99998 0,204.09917 15.950462,188.1487 Z"
           id="path926"
           inkscape:connector-curvature="0"
           sodipodi:nodetypes="ccccc" />
        <path
           sodipodi:nodetypes="cccc"
           inkscape:connector-curvature="0"
           id="path928"
           d="m 32,204 16,16 16,-16 z"
           style="opacity:1;vector-effect:none;fill:#e5a50a;fill-opacity:1;stroke:none;stroke-width:8.74862;stroke-linecap:butt;stroke-linejoin:miter;stroke-miterlimit:4;stroke-dasharray:none;stroke-dashoffset:0;stroke-opacity:1;marker:none;marker-start:none;marker-mid:none;marker-end:none;paint-order:normal" />
        <path
           sodipodi:nodetypes="cccc"
           inkscape:connector-curvature="0"
           id="path930"
           d="M 80,252 96.012347,267.98765 96,236 Z"
           style="opacity:1;vector-effect:none;fill:#ffa348;fill-opacity:1;stroke:none;stroke-width:8.74862;stroke-linecap:butt;stroke-linejoin:miter;stroke-miterlimit:4;stroke-dasharray:none;stroke-dashoffset:0;stroke-opacity:1;marker:none;marker-start:none;marker-mid:none;marker-end:none;paint-order:normal" />
        <path
           sodipodi:nodetypes="cccc"
           inkscape:connector-curvature="0"
           id="path932"
           d="M 48,252 64,236 48.01544,220.11719 Z"
           style="opacity:1;vector-effect:none;fill:#3584e4;fill-opacity:1;stroke:none;stroke-width:8.74862;stroke-linecap:butt;stroke-linejoin:miter;stroke-miterlimit:4;stroke-dasharray:none;stroke-dashoffset:0;stroke-opacity:1;marker:none;marker-start:none;marker-mid:none;marker-end:none;paint-order:normal" />
        <path
           style="opacity:1;vector-effect:none;fill:#f66151;fill-opacity:1;stroke:none;stroke-width:8.74862;stroke-linecap:butt;stroke-linejoin:miter;stroke-miterlimit:4;stroke-dasharray:none;stroke-dashoffset:0;stroke-opacity:1;marker:none;marker-start:none;marker-mid:none;marker-end:none;paint-order:normal"
           d="m 96,236 16,16.01768 V 260 l -15.98456,16 z"
           id="path934"
           inkscape:connector-curvature="0"
           sodipodi:nodetypes="ccccc" />
        <path
           sodipodi:nodetypes="ccccc"
           inkscape:connector-curvature="0"
           id="path936"
           d="m 48,252 -16,16 v 8 l 16,16 z"
           style="opacity:1;vector-effect:none;fill:#c061cb;fill-opacity:1;stroke:none;stroke-width:8.74862;stroke-linecap:butt;stroke-linejoin:miter;stroke-miterlimit:4;stroke-dasharray:none;stroke-dashoffset:0;stroke-opacity:1;marker:none;marker-start:none;marker-mid:none;marker-end:none;paint-order:normal" />
        <path
           style="opacity:1;vector-effect:none;fill:#1a5fb4;fill-opacity:1;stroke:none;stroke-width:8.74862;stroke-linecap:butt;stroke-linejoin:miter;stroke-miterlimit:4;stroke-dasharray:none;stroke-dashoffset:0;stroke-opacity:1;marker:none;marker-start:none;marker-mid:none;marker-end:none;paint-order:normal"
           d="M 64,236 48,220 32,236 Z"
           id="path938"
           inkscape:connector-curvature="0"
           sodipodi:nodetypes="cccc" />
        <path
           sodipodi:nodetypes="cccc"
           inkscape:connector-curvature="0"
           id="path940"
           d="M 64,236 48,252 32.023188,235.97681 Z"
           style="opacity:1;vector-effect:none;fill:#3584e4;fill-opacity:1;stroke:none;stroke-width:8.74862;stroke-linecap:butt;stroke-linejoin:miter;stroke-miterlimit:4;stroke-dasharray:none;stroke-dashoffset:0;stroke-opacity:1;marker:none;marker-start:none;marker-mid:none;marker-end:none;paint-order:normal" />
      </g>
      <path
         inkscape:connector-curvature="0"
         style="display:inline;opacity:0.2;vector-effect:none;fill:#000000;fill-opacity:1;stroke:none;stroke-width:6.51673;stroke-linecap:butt;stroke-linejoin:miter;stroke-miterlimit:4;stroke-dasharray:none;stroke-dashoffset:0;stroke-opacity:1;marker:none;marker-start:none;marker-mid:none;marker-end:none;paint-order:normal;enable-background:new"
         clip-path="none"
         d="m -516.6875,236 v 2 h 0.002 c -0.003,2.04494 0.77436,4.08881 2.3418,5.65625 l 52.6875,52.6875 c 3.1339,3.1339 8.1786,3.1339 11.3125,0 l 52.6875,-52.6875 c 1.56744,-1.56744 2.34453,-3.61131 2.3418,-5.65625 h 0.002 v -2 h -0.002 c 0.003,2.04494 -0.77436,4.08881 -2.3418,5.65625 l -52.6875,52.6875 c -3.1339,3.1339 -8.1786,3.1339 -11.3125,0 l -52.6875,-52.6875 c -1.56744,-1.56744 -2.34454,-3.61131 -2.3418,-5.65625 z"
         id="path944" />
    </g>
    <g
       style="display:inline;enable-background:new"
       id="g992"
       transform="translate(-419.99995)">
      <path
         style="opacity:1;vector-effect:none;fill:#c061cb;fill-opacity:1;stroke:none;stroke-width:8.74862;stroke-linecap:butt;stroke-linejoin:miter;stroke-miterlimit:4;stroke-dasharray:none;stroke-dashoffset:0;stroke-opacity:1;marker:none;marker-start:none;marker-mid:none;marker-end:none;paint-order:normal"
         d="m -322,252 h -16 v 16 2 l 16,16 8,-18 z"
         id="path941"
         inkscape:connector-curvature="0"
         sodipodi:nodetypes="ccccccc" />
      <path
         style="display:inline;opacity:1;vector-effect:none;fill:#1c71d8;fill-opacity:1;stroke:none;stroke-width:6.51673;stroke-linecap:butt;stroke-linejoin:miter;stroke-miterlimit:4;stroke-dasharray:none;stroke-dashoffset:0;stroke-opacity:1;marker:none;marker-start:none;marker-mid:none;marker-end:none;paint-order:normal;enable-background:new"
         clip-path="none"
         d="m -290,252 -24,8 -8,24 v 2 l 10.34375,10.34375 c 3.1339,3.1339 8.1786,3.1339 11.3125,0 l 26.35742,-26.35742 -0.002,-1.99805 L -276,254 Z"
         id="path943"
         inkscape:connector-curvature="0"
         sodipodi:nodetypes="ccccsscccc" />
      <path
         sodipodi:nodetypes="ccccccc"
         inkscape:connector-curvature="0"
         id="path945"
         d="m -322,220 4,-12 12,-4 8,16 -8,16 -14,-2 z"
         style="opacity:1;vector-effect:none;fill:#26a269;fill-opacity:1;stroke:none;stroke-width:8.74862;stroke-linecap:butt;stroke-linejoin:miter;stroke-miterlimit:4;stroke-dasharray:none;stroke-dashoffset:0;stroke-opacity:1;marker:none;marker-start:none;marker-mid:none;marker-end:none;paint-order:normal" />
      <path
         style="opacity:1;vector-effect:none;fill:#ffa348;fill-opacity:1;stroke:none;stroke-width:8.74862;stroke-linecap:butt;stroke-linejoin:miter;stroke-miterlimit:4;stroke-dasharray:none;stroke-dashoffset:0;stroke-opacity:1;marker:none;marker-start:none;marker-mid:none;marker-end:none;paint-order:normal"
         d="m -290,252 16.01235,15.98765 L -266,252 l -8,-16 -12,4 z"
         id="path947"
         inkscape:connector-curvature="0"
         sodipodi:nodetypes="cccccc" />
      <path
         sodipodi:nodetypes="cccccccc"
         inkscape:connector-curvature="0"
         id="path949"
         d="m -306,236 8,-24 24,-8 8,20 -8,12 -16,16 h -16 z"
         style="opacity:1;vector-effect:none;fill:#ff7800;fill-opacity:1;stroke:none;stroke-width:8.74862;stroke-linecap:butt;stroke-linejoin:miter;stroke-miterlimit:4;stroke-dasharray:none;stroke-dashoffset:0;stroke-opacity:1;marker:none;marker-start:none;marker-mid:none;marker-end:none;paint-order:normal" />
      <path
         sodipodi:nodetypes="cccccc"
         inkscape:connector-curvature="0"
         id="path951"
         d="m -290,252 -32,32 v -32 l 4,-12 12,-4 z"
         style="opacity:1;vector-effect:none;fill:#98c1f1;fill-opacity:1;stroke:none;stroke-width:8.74862;stroke-linecap:butt;stroke-linejoin:miter;stroke-miterlimit:4;stroke-dasharray:none;stroke-dashoffset:0;stroke-opacity:1;marker:none;marker-start:none;marker-mid:none;marker-end:none;paint-order:normal" />
      <path
         sodipodi:nodetypes="cccccc"
         inkscape:connector-curvature="0"
         id="path953"
         d="m -306,204 4,-13 12,-3 16,16 -32,32 z"
         style="opacity:1;vector-effect:none;fill:#2ec27e;fill-opacity:1;stroke:none;stroke-width:8.74862;stroke-linecap:butt;stroke-linejoin:miter;stroke-miterlimit:4;stroke-dasharray:none;stroke-dashoffset:0;stroke-opacity:1;marker:none;marker-start:none;marker-mid:none;marker-end:none;paint-order:normal" />
      <path
         style="opacity:1;vector-effect:none;fill:#613583;fill-opacity:1;stroke:none;stroke-width:8.74862;stroke-linecap:butt;stroke-linejoin:miter;stroke-miterlimit:4;stroke-dasharray:none;stroke-dashoffset:0;stroke-opacity:1;marker:none;marker-start:none;marker-mid:none;marker-end:none;paint-order:normal"
         d="m -337.96875,203.96875 -13.39844,13.39844 -13.28711,13.32031 c -1.35341,1.51718 -2.03379,3.41173 -2.03125,5.3125 h -0.002 v 2 h 0.002 c -0.003,2.04494 0.77436,4.08881 2.3418,5.65625 L -354,254 v -2 l 24,-8 8,-24 -4,-12 z"
         id="path955"
         inkscape:connector-curvature="0"
         sodipodi:nodetypes="cccccccscccccc" />
      <path
         style="opacity:1;vector-effect:none;fill:#f5c211;fill-opacity:1;stroke:none;stroke-width:8.74862;stroke-linecap:butt;stroke-linejoin:miter;stroke-miterlimit:4;stroke-dasharray:none;stroke-dashoffset:0;stroke-opacity:1;marker:none;marker-start:none;marker-mid:none;marker-end:none;paint-order:normal"
         d="m -306,175.30664 c -2.04495,0 -4.0893,0.78266 -5.65625,2.34961 L -338,204 l 16,8 16,-8 15.98633,-16.01367 -10.33008,-10.33008 c -1.56695,-1.56695 -3.6113,-2.34961 -5.65625,-2.34961 z"
         id="path957"
         inkscape:connector-curvature="0"
         sodipodi:nodetypes="ssccccss" />
      <path
         inkscape:connector-curvature="0"
         style="opacity:1;vector-effect:none;fill:#e01b24;fill-opacity:1;stroke:none;stroke-width:8.74862;stroke-linecap:butt;stroke-linejoin:miter;stroke-miterlimit:4;stroke-dasharray:none;stroke-dashoffset:0;stroke-opacity:1;marker:none;marker-start:none;marker-mid:none;marker-end:none;paint-order:normal"
         d="m -274,204 -0.0664,33.90039 16.08203,16.08398 10.32813,-10.32812 c 1.56744,-1.56744 2.34453,-3.61131 2.3418,-5.65625 h 0.002 v -2 h -0.002 c 0.003,-2.04494 -0.77436,-4.08881 -2.3418,-5.65625 z"
         id="path959" />
      <path
         sodipodi:nodetypes="ccccc"
         inkscape:connector-curvature="0"
         id="path961"
         d="m -306,204 16,16 16,-16 -16,-16 z"
         style="opacity:0.2;vector-effect:none;fill:#ffffff;fill-opacity:1;stroke:none;stroke-width:8.74862;stroke-linecap:butt;stroke-linejoin:miter;stroke-miterlimit:4;stroke-dasharray:none;stroke-dashoffset:0;stroke-opacity:1;marker:none;marker-start:none;marker-mid:none;marker-end:none;paint-order:normal" />
      <path
         style="opacity:1;vector-effect:none;fill:#e5a50a;fill-opacity:1;stroke:none;stroke-width:8.74862;stroke-linecap:butt;stroke-linejoin:miter;stroke-miterlimit:4;stroke-dasharray:none;stroke-dashoffset:0;stroke-opacity:1;marker:none;marker-start:none;marker-mid:none;marker-end:none;paint-order:normal"
         d="m -338,204 16,16 16,-16 z"
         id="path963"
         inkscape:connector-curvature="0"
         sodipodi:nodetypes="cccc" />
      <path
         inkscape:connector-curvature="0"
         style="opacity:1;vector-effect:none;fill:#f66151;fill-opacity:1;stroke:none;stroke-width:8.74862;stroke-linecap:butt;stroke-linejoin:miter;stroke-miterlimit:4;stroke-dasharray:none;stroke-dashoffset:0;stroke-opacity:1;marker:none;marker-start:none;marker-mid:none;marker-end:none;paint-order:normal"
         d="m -274,236 0.0137,33.98633 L -258,254 v -1.98242 z"
         id="path965" />
      <path
         style="opacity:1;vector-effect:none;fill:#813d9c;fill-opacity:1;stroke:none;stroke-width:8.74862;stroke-linecap:butt;stroke-linejoin:miter;stroke-miterlimit:4;stroke-dasharray:none;stroke-dashoffset:0;stroke-opacity:1;marker:none;marker-start:none;marker-mid:none;marker-end:none;paint-order:normal"
         d="M -337.97656,235.97656 -354,252 v 2 l 16,16 v -2 l 16,-16 -4,-12 z"
         id="path967"
         inkscape:connector-curvature="0"
         sodipodi:nodetypes="cccccccc" />
      <path
         style="opacity:1;vector-effect:none;fill:#3584e4;fill-opacity:1;stroke:none;stroke-width:8.74862;stroke-linecap:butt;stroke-linejoin:miter;stroke-miterlimit:4;stroke-dasharray:none;stroke-dashoffset:0;stroke-opacity:1;marker:none;marker-start:none;marker-mid:none;marker-end:none;paint-order:normal"
         d="m -306,236 -16,16 -15.97681,-16.02319 L -322,228 Z"
         id="path969"
         inkscape:connector-curvature="0"
         sodipodi:nodetypes="ccccc" />
      <path
         sodipodi:nodetypes="cccc"
         inkscape:connector-curvature="0"
         id="path971"
         d="m -306,236 -16,-16 -16,16 z"
         style="opacity:1;vector-effect:none;fill:#1a5fb4;fill-opacity:1;stroke:none;stroke-width:8.74862;stroke-linecap:butt;stroke-linejoin:miter;stroke-miterlimit:4;stroke-dasharray:none;stroke-dashoffset:0;stroke-opacity:1;marker:none;marker-start:none;marker-mid:none;marker-end:none;paint-order:normal" />
      <path
         inkscape:connector-curvature="0"
         style="display:inline;opacity:0.2;vector-effect:none;fill:#000000;fill-opacity:1;stroke:none;stroke-width:6.51673;stroke-linecap:butt;stroke-linejoin:miter;stroke-miterlimit:4;stroke-dasharray:none;stroke-dashoffset:0;stroke-opacity:1;marker:none;marker-start:none;marker-mid:none;marker-end:none;paint-order:normal;enable-background:new"
         clip-path="none"
         d="m -366.6875,236 v 2 h 0.002 c -0.003,2.04494 0.77436,4.08881 2.3418,5.65625 l 52.6875,52.6875 c 3.1339,3.1339 8.1786,3.1339 11.3125,0 l 52.6875,-52.6875 c 1.56744,-1.56744 2.34453,-3.61131 2.3418,-5.65625 h 0.002 v -2 h -0.002 c 0.003,2.04494 -0.77436,4.08881 -2.3418,5.65625 l -52.6875,52.6875 c -3.1339,3.1339 -8.1786,3.1339 -11.3125,0 l -52.6875,-52.6875 c -1.56744,-1.56744 -2.34454,-3.61131 -2.3418,-5.65625 z"
         id="path973" />
    </g>
    <g
       transform="translate(-640)"
       id="g1561">
      <path
         style="display:inline;vector-effect:none;fill:#9461cb;fill-opacity:1;stroke:none;stroke-width:8.74862;stroke-linecap:butt;stroke-linejoin:miter;stroke-miterlimit:4;stroke-dasharray:none;stroke-dashoffset:0;stroke-opacity:1;marker:none;marker-start:none;marker-mid:none;marker-end:none;paint-order:normal;enable-background:new"
         d="M 48,252.00001 H 32 v 16 2 l 16,16 8,-18 z"
         id="path1527"
         inkscape:connector-curvature="0"
         sodipodi:nodetypes="ccccccc" />
      <path
         style="display:inline;vector-effect:none;fill:#40a9e5;fill-opacity:1;stroke:none;stroke-width:6.51673;stroke-linecap:butt;stroke-linejoin:miter;stroke-miterlimit:4;stroke-dasharray:none;stroke-dashoffset:0;stroke-opacity:1;marker:none;marker-start:none;marker-mid:none;marker-end:none;paint-order:normal;enable-background:new"
         clip-path="none"
         d="m 80,252.00001 -24,8 -8,24 v 2 l 10.34375,10.34375 c 3.1339,3.1339 8.17861,3.1339 11.3125,0 l 26.35743,-26.35742 -0.002,-1.99805 L 94,254.00001 Z"
         id="path1529"
         inkscape:connector-curvature="0"
         sodipodi:nodetypes="ccccsscccc" />
      <path
         sodipodi:nodetypes="ccccccc"
         inkscape:connector-curvature="0"
         id="path1531"
         d="m 48,220.00001 4,-12 12,-4 8,16 -8,16 -14,-2 z"
         style="display:inline;vector-effect:none;fill:#26a269;fill-opacity:1;stroke:none;stroke-width:8.74862;stroke-linecap:butt;stroke-linejoin:miter;stroke-miterlimit:4;stroke-dasharray:none;stroke-dashoffset:0;stroke-opacity:1;marker:none;marker-start:none;marker-mid:none;marker-end:none;paint-order:normal;enable-background:new" />
      <path
         style="display:inline;vector-effect:none;fill:#ffcd48;fill-opacity:1;stroke:none;stroke-width:8.74862;stroke-linecap:butt;stroke-linejoin:miter;stroke-miterlimit:4;stroke-dasharray:none;stroke-dashoffset:0;stroke-opacity:1;marker:none;marker-start:none;marker-mid:none;marker-end:none;paint-order:normal;enable-background:new"
         d="M 80,252.00001 96.01235,267.98766 104,252.00001 l -8,-16 -12,4 z"
         id="path1533"
         inkscape:connector-curvature="0"
         sodipodi:nodetypes="cccccc" />
      <path
         sodipodi:nodetypes="cccccccc"
         inkscape:connector-curvature="0"
         id="path1535"
         d="m 64,236.00001 8,-24 24,-8 8,20 -8,12 -16,16 H 64 Z"
         style="display:inline;vector-effect:none;fill:#ffaa00;fill-opacity:1;stroke:none;stroke-width:8.74862;stroke-linecap:butt;stroke-linejoin:miter;stroke-miterlimit:4;stroke-dasharray:none;stroke-dashoffset:0;stroke-opacity:1;marker:none;marker-start:none;marker-mid:none;marker-end:none;paint-order:normal;enable-background:new" />
      <path
         sodipodi:nodetypes="cccccc"
         inkscape:connector-curvature="0"
         id="path1537"
         d="m 80,252.00001 -32,32 v -32 l 4,-12 12,-4 z"
         style="display:inline;vector-effect:none;fill:#98dcf1;fill-opacity:1;stroke:none;stroke-width:8.74862;stroke-linecap:butt;stroke-linejoin:miter;stroke-miterlimit:4;stroke-dasharray:none;stroke-dashoffset:0;stroke-opacity:1;marker:none;marker-start:none;marker-mid:none;marker-end:none;paint-order:normal;enable-background:new" />
      <path
         sodipodi:nodetypes="cccccc"
         inkscape:connector-curvature="0"
         id="path1539"
         d="m 64,204.00001 4,-13 12,-3 16,16 -32,32 z"
         style="display:inline;vector-effect:none;fill:#2ec27e;fill-opacity:1;stroke:none;stroke-width:8.74862;stroke-linecap:butt;stroke-linejoin:miter;stroke-miterlimit:4;stroke-dasharray:none;stroke-dashoffset:0;stroke-opacity:1;marker:none;marker-start:none;marker-mid:none;marker-end:none;paint-order:normal;enable-background:new" />
      <path
         style="display:inline;vector-effect:none;fill:#453583;fill-opacity:1;stroke:none;stroke-width:8.74862;stroke-linecap:butt;stroke-linejoin:miter;stroke-miterlimit:4;stroke-dasharray:none;stroke-dashoffset:0;stroke-opacity:1;marker:none;marker-start:none;marker-mid:none;marker-end:none;paint-order:normal;enable-background:new"
         d="M 32.03125,203.96876 18.63282,217.3672 5.34571,230.68751 c -1.35341,1.51718 -2.0338,3.41173 -2.03125,5.3125 h -0.002 v 2 h 0.002 c -0.003,2.04494 0.77436,4.08881 2.3418,5.65625 l 10.34375,10.34375 v -2 l 24,-8 8,-24 -4,-12 z"
         id="path1541"
         inkscape:connector-curvature="0"
         sodipodi:nodetypes="cccccccscccccc" />
      <path
         style="display:inline;vector-effect:none;fill:#f1da0a;fill-opacity:1;stroke:none;stroke-width:8.74862;stroke-linecap:butt;stroke-linejoin:miter;stroke-miterlimit:4;stroke-dasharray:none;stroke-dashoffset:0;stroke-opacity:1;marker:none;marker-start:none;marker-mid:none;marker-end:none;paint-order:normal;enable-background:new"
         d="m 64,175.30665 c -2.04495,0 -4.0893,0.78266 -5.65625,2.34961 L 32,204.00001 l 16,8 16,-8 15.98633,-16.01367 -10.33008,-10.33008 C 68.0893,176.08931 66.04495,175.30665 64,175.30665 Z"
         id="path1543"
         inkscape:connector-curvature="0"
         sodipodi:nodetypes="ssccccss" />
      <path
         inkscape:connector-curvature="0"
         style="display:inline;vector-effect:none;fill:#e01b48;fill-opacity:1;stroke:none;stroke-width:8.74862;stroke-linecap:butt;stroke-linejoin:miter;stroke-miterlimit:4;stroke-dasharray:none;stroke-dashoffset:0;stroke-opacity:1;marker:none;marker-start:none;marker-mid:none;marker-end:none;paint-order:normal;enable-background:new"
         d="m 96,204.00001 -0.0664,33.90039 16.08203,16.08399 10.32813,-10.32813 c 1.56744,-1.56744 2.34453,-3.61131 2.3418,-5.65625 h 0.002 v -2 h -0.002 c 0.003,-2.04494 -0.77436,-4.08881 -2.3418,-5.65625 z"
         id="path1545" />
      <path
         sodipodi:nodetypes="ccccc"
         inkscape:connector-curvature="0"
         id="path1547"
         d="m 64,204.00001 16,16 16,-16 -16,-16 z"
         style="display:inline;opacity:0.2;vector-effect:none;fill:#ffffff;fill-opacity:1;stroke:none;stroke-width:8.74862;stroke-linecap:butt;stroke-linejoin:miter;stroke-miterlimit:4;stroke-dasharray:none;stroke-dashoffset:0;stroke-opacity:1;marker:none;marker-start:none;marker-mid:none;marker-end:none;paint-order:normal;enable-background:new" />
      <path
         style="display:inline;vector-effect:none;fill:#e5bd0a;fill-opacity:1;stroke:none;stroke-width:8.74862;stroke-linecap:butt;stroke-linejoin:miter;stroke-miterlimit:4;stroke-dasharray:none;stroke-dashoffset:0;stroke-opacity:1;marker:none;marker-start:none;marker-mid:none;marker-end:none;paint-order:normal;enable-background:new"
         d="m 32,204.00001 16,16 16,-16 z"
         id="path1549"
         inkscape:connector-curvature="0"
         sodipodi:nodetypes="cccc" />
      <path
         inkscape:connector-curvature="0"
         style="display:inline;vector-effect:none;fill:#f6517d;fill-opacity:1;stroke:none;stroke-width:8.74862;stroke-linecap:butt;stroke-linejoin:miter;stroke-miterlimit:4;stroke-dasharray:none;stroke-dashoffset:0;stroke-opacity:1;marker:none;marker-start:none;marker-mid:none;marker-end:none;paint-order:normal;enable-background:new"
         d="m 96,236.00001 0.0137,33.98633 15.98632,-15.98633 v -1.98242 z"
         id="path1551" />
      <path
         style="display:inline;vector-effect:none;fill:#613d9c;fill-opacity:1;stroke:none;stroke-width:8.74862;stroke-linecap:butt;stroke-linejoin:miter;stroke-miterlimit:4;stroke-dasharray:none;stroke-dashoffset:0;stroke-opacity:1;marker:none;marker-start:none;marker-mid:none;marker-end:none;paint-order:normal;enable-background:new"
         d="M 32.02344,235.97657 16,252.00001 v 2 l 16,16 v -2 l 16,-16 -4,-12 z"
         id="path1553"
         inkscape:connector-curvature="0"
         sodipodi:nodetypes="cccccccc" />
      <path
         style="display:inline;vector-effect:none;fill:#35aae4;fill-opacity:1;stroke:none;stroke-width:8.74862;stroke-linecap:butt;stroke-linejoin:miter;stroke-miterlimit:4;stroke-dasharray:none;stroke-dashoffset:0;stroke-opacity:1;marker:none;marker-start:none;marker-mid:none;marker-end:none;paint-order:normal;enable-background:new"
         d="m 64,236.00001 -16,16 L 32.02319,235.97682 48,228.00001 Z"
         id="path1555"
         inkscape:connector-curvature="0"
         sodipodi:nodetypes="ccccc" />
      <path
         sodipodi:nodetypes="cccc"
         inkscape:connector-curvature="0"
         id="path1557"
         d="m 64,236.00001 -16,-16 -16,16 z"
         style="display:inline;vector-effect:none;fill:#1a79b4;fill-opacity:1;stroke:none;stroke-width:8.74862;stroke-linecap:butt;stroke-linejoin:miter;stroke-miterlimit:4;stroke-dasharray:none;stroke-dashoffset:0;stroke-opacity:1;marker:none;marker-start:none;marker-mid:none;marker-end:none;paint-order:normal;enable-background:new" />
      <path
         inkscape:connector-curvature="0"
         style="display:inline;opacity:0.2;vector-effect:none;fill:#000000;fill-opacity:1;stroke:none;stroke-width:6.51673;stroke-linecap:butt;stroke-linejoin:miter;stroke-miterlimit:4;stroke-dasharray:none;stroke-dashoffset:0;stroke-opacity:1;marker:none;marker-start:none;marker-mid:none;marker-end:none;paint-order:normal;enable-background:new"
         clip-path="none"
         d="m 3.3125,236.00001 v 2 h 0.002 c -0.003,2.04494 0.77436,4.08881 2.3418,5.65625 l 52.6875,52.6875 c 3.1339,3.1339 8.1786,3.1339 11.3125,0 l 52.6875,-52.6875 c 1.56744,-1.56744 2.34453,-3.61131 2.3418,-5.65625 h 0.002 v -2 h -0.002 c 0.003,2.04494 -0.77436,4.08881 -2.3418,5.65625 l -52.6875,52.6875 c -3.1339,3.1339 -8.1786,3.1339 -11.3125,0 L 5.6563,241.65626 c -1.56744,-1.56744 -2.34453,-3.61131 -2.34179,-5.65625 z"
         id="path1559" />
    </g>
    <g
       id="g1049"
       transform="translate(-490)">
      <g
         id="g1029">
        <path
           sodipodi:nodetypes="ccccccc"
           inkscape:connector-curvature="0"
           id="path995"
           d="M 48,252.00001 H 32 v 16 2 l 16,16 8,-18 z"
           style="display:inline;vector-effect:none;fill:#a877dc;fill-opacity:1;stroke:none;stroke-width:8.74862;stroke-linecap:butt;stroke-linejoin:miter;stroke-miterlimit:4;stroke-dasharray:none;stroke-dashoffset:0;stroke-opacity:1;marker:none;marker-start:none;marker-mid:none;marker-end:none;paint-order:normal;enable-background:new" />
        <path
           sodipodi:nodetypes="ccccsscccc"
           inkscape:connector-curvature="0"
           id="path997"
           d="m 80,252.00001 -24,8 -8,24 v 2 l 10.34375,10.34375 c 3.1339,3.1339 8.17861,3.1339 11.3125,0 l 26.35743,-26.35742 -0.002,-1.99805 L 94,254.00001 Z"
           clip-path="none"
           style="display:inline;vector-effect:none;fill:#50d0e6;fill-opacity:1;stroke:none;stroke-width:6.51673;stroke-linecap:butt;stroke-linejoin:miter;stroke-miterlimit:4;stroke-dasharray:none;stroke-dashoffset:0;stroke-opacity:1;marker:none;marker-start:none;marker-mid:none;marker-end:none;paint-order:normal;enable-background:new" />
        <path
           style="display:inline;vector-effect:none;fill:#26a27e;fill-opacity:1;stroke:none;stroke-width:8.74862;stroke-linecap:butt;stroke-linejoin:miter;stroke-miterlimit:4;stroke-dasharray:none;stroke-dashoffset:0;stroke-opacity:1;marker:none;marker-start:none;marker-mid:none;marker-end:none;paint-order:normal;enable-background:new"
           d="m 48,220.00001 4,-12 12,-4 8,16 -8,16 -14,-2 z"
           id="path999"
           inkscape:connector-curvature="0"
           sodipodi:nodetypes="ccccccc" />
        <path
           sodipodi:nodetypes="cccccc"
           inkscape:connector-curvature="0"
           id="path1001"
           d="M 80,252.00001 96.01235,267.98766 104,252.00001 l -8,-16 -12,4 z"
           style="display:inline;vector-effect:none;fill:#ffcd48;fill-opacity:1;stroke:none;stroke-width:8.74862;stroke-linecap:butt;stroke-linejoin:miter;stroke-miterlimit:4;stroke-dasharray:none;stroke-dashoffset:0;stroke-opacity:1;marker:none;marker-start:none;marker-mid:none;marker-end:none;paint-order:normal;enable-background:new" />
        <path
           style="display:inline;vector-effect:none;fill:#ffaa00;fill-opacity:1;stroke:none;stroke-width:8.74862;stroke-linecap:butt;stroke-linejoin:miter;stroke-miterlimit:4;stroke-dasharray:none;stroke-dashoffset:0;stroke-opacity:1;marker:none;marker-start:none;marker-mid:none;marker-end:none;paint-order:normal;enable-background:new"
           d="m 64,236.00001 8,-24 24,-8 8,20 -8,12 -16,16 H 64 Z"
           id="path1003"
           inkscape:connector-curvature="0"
           sodipodi:nodetypes="cccccccc" />
        <path
           style="display:inline;vector-effect:none;fill:#b7e6f5;fill-opacity:1;stroke:none;stroke-width:8.74862;stroke-linecap:butt;stroke-linejoin:miter;stroke-miterlimit:4;stroke-dasharray:none;stroke-dashoffset:0;stroke-opacity:1;marker:none;marker-start:none;marker-mid:none;marker-end:none;paint-order:normal;enable-background:new"
           d="m 80,252.00001 -32,32 v -32 l 4,-12 12,-4 z"
           id="path1005"
           inkscape:connector-curvature="0"
           sodipodi:nodetypes="cccccc" />
        <path
           style="display:inline;vector-effect:none;fill:#2ec299;fill-opacity:1;stroke:none;stroke-width:8.74862;stroke-linecap:butt;stroke-linejoin:miter;stroke-miterlimit:4;stroke-dasharray:none;stroke-dashoffset:0;stroke-opacity:1;marker:none;marker-start:none;marker-mid:none;marker-end:none;paint-order:normal;enable-background:new"
           d="m 64,204.00001 4,-13 12,-3 16,16 -32,32 z"
           id="path1007"
           inkscape:connector-curvature="0"
           sodipodi:nodetypes="cccccc" />
        <path
           sodipodi:nodetypes="cccccccscccccc"
           inkscape:connector-curvature="0"
           id="path1009"
           d="M 32.03125,203.96876 18.63282,217.3672 5.34571,230.68751 c -1.35341,1.51718 -2.0338,3.41173 -2.03125,5.3125 h -0.002 v 2 h 0.002 c -0.003,2.04494 0.77436,4.08881 2.3418,5.65625 l 10.34375,10.34375 v -2 l 24,-8 8,-24 -4,-12 z"
           style="display:inline;vector-effect:none;fill:#4828b4;fill-opacity:1;stroke:none;stroke-width:8.74862;stroke-linecap:butt;stroke-linejoin:miter;stroke-miterlimit:4;stroke-dasharray:none;stroke-dashoffset:0;stroke-opacity:1;marker:none;marker-start:none;marker-mid:none;marker-end:none;paint-order:normal;enable-background:new" />
        <path
           sodipodi:nodetypes="ssccccss"
           inkscape:connector-curvature="0"
           id="path1011"
           d="m 64,175.30665 c -2.04495,0 -4.0893,0.78266 -5.65625,2.34961 L 32,204.00001 l 16,8 16,-8 15.98633,-16.01367 -10.33008,-10.33008 C 68.0893,176.08931 66.04495,175.30665 64,175.30665 Z"
           style="display:inline;vector-effect:none;fill:#f1da0a;fill-opacity:1;stroke:none;stroke-width:8.74862;stroke-linecap:butt;stroke-linejoin:miter;stroke-miterlimit:4;stroke-dasharray:none;stroke-dashoffset:0;stroke-opacity:1;marker:none;marker-start:none;marker-mid:none;marker-end:none;paint-order:normal;enable-background:new" />
        <path
           id="path1013"
           d="m 96,204.00001 -0.0664,33.90039 16.08203,16.08399 10.32813,-10.32813 c 1.56744,-1.56744 2.34453,-3.61131 2.3418,-5.65625 h 0.002 v -2 h -0.002 c 0.003,-2.04494 -0.77436,-4.08881 -2.3418,-5.65625 z"
           style="display:inline;vector-effect:none;fill:#e01b48;fill-opacity:1;stroke:none;stroke-width:8.74862;stroke-linecap:butt;stroke-linejoin:miter;stroke-miterlimit:4;stroke-dasharray:none;stroke-dashoffset:0;stroke-opacity:1;marker:none;marker-start:none;marker-mid:none;marker-end:none;paint-order:normal;enable-background:new"
           inkscape:connector-curvature="0" />
        <path
           style="display:inline;opacity:0.2;vector-effect:none;fill:#ffffff;fill-opacity:1;stroke:none;stroke-width:8.74862;stroke-linecap:butt;stroke-linejoin:miter;stroke-miterlimit:4;stroke-dasharray:none;stroke-dashoffset:0;stroke-opacity:1;marker:none;marker-start:none;marker-mid:none;marker-end:none;paint-order:normal;enable-background:new"
           d="m 64,204.00001 16,16 16,-16 -16,-16 z"
           id="path1015"
           inkscape:connector-curvature="0"
           sodipodi:nodetypes="ccccc" />
        <path
           sodipodi:nodetypes="cccc"
           inkscape:connector-curvature="0"
           id="path1017"
           d="m 32,204.00001 16,16 16,-16 z"
           style="display:inline;vector-effect:none;fill:#e5bd0a;fill-opacity:1;stroke:none;stroke-width:8.74862;stroke-linecap:butt;stroke-linejoin:miter;stroke-miterlimit:4;stroke-dasharray:none;stroke-dashoffset:0;stroke-opacity:1;marker:none;marker-start:none;marker-mid:none;marker-end:none;paint-order:normal;enable-background:new" />
        <path
           id="path1019"
           d="m 96,236.00001 0.0137,33.98633 15.98632,-15.98633 v -1.98242 z"
           style="display:inline;vector-effect:none;fill:#f6517d;fill-opacity:1;stroke:none;stroke-width:8.74862;stroke-linecap:butt;stroke-linejoin:miter;stroke-miterlimit:4;stroke-dasharray:none;stroke-dashoffset:0;stroke-opacity:1;marker:none;marker-start:none;marker-mid:none;marker-end:none;paint-order:normal;enable-background:new"
           inkscape:connector-curvature="0" />
        <path
           sodipodi:nodetypes="cccccccc"
           inkscape:connector-curvature="0"
           id="path1021"
           d="M 32.02344,235.97657 16,252.00001 v 2 l 16,16 v -2 l 16,-16 -4,-12 z"
           style="display:inline;vector-effect:none;fill:#753ed0;fill-opacity:1;stroke:none;stroke-width:8.74862;stroke-linecap:butt;stroke-linejoin:miter;stroke-miterlimit:4;stroke-dasharray:none;stroke-dashoffset:0;stroke-opacity:1;marker:none;marker-start:none;marker-mid:none;marker-end:none;paint-order:normal;enable-background:new" />
        <path
           sodipodi:nodetypes="ccccc"
           inkscape:connector-curvature="0"
           id="path1023"
           d="m 64,236.00001 -16,16 L 32.02319,235.97682 48,228.00001 Z"
           style="display:inline;vector-effect:none;fill:#41b7f1;fill-opacity:1;stroke:none;stroke-width:8.74862;stroke-linecap:butt;stroke-linejoin:miter;stroke-miterlimit:4;stroke-dasharray:none;stroke-dashoffset:0;stroke-opacity:1;marker:none;marker-start:none;marker-mid:none;marker-end:none;paint-order:normal;enable-background:new" />
        <path
           style="display:inline;vector-effect:none;fill:#0675ba;fill-opacity:1;stroke:none;stroke-width:8.74862;stroke-linecap:butt;stroke-linejoin:miter;stroke-miterlimit:4;stroke-dasharray:none;stroke-dashoffset:0;stroke-opacity:1;marker:none;marker-start:none;marker-mid:none;marker-end:none;paint-order:normal;enable-background:new"
           d="m 64,236.00001 -16,-16 -16,16 z"
           id="path1025"
           inkscape:connector-curvature="0"
           sodipodi:nodetypes="cccc" />
        <path
           id="path1027"
           d="m 3.3125,236.00001 v 2 h 0.002 c -0.003,2.04494 0.77436,4.08881 2.3418,5.65625 l 52.6875,52.6875 c 3.1339,3.1339 8.1786,3.1339 11.3125,0 l 52.6875,-52.6875 c 1.56744,-1.56744 2.34453,-3.61131 2.3418,-5.65625 h 0.002 v -2 h -0.002 c 0.003,2.04494 -0.77436,4.08881 -2.3418,5.65625 l -52.6875,52.6875 c -3.1339,3.1339 -8.1786,3.1339 -11.3125,0 L 5.6563,241.65626 c -1.56744,-1.56744 -2.34453,-3.61131 -2.34179,-5.65625 z"
           clip-path="none"
           style="display:inline;opacity:0.2;vector-effect:none;fill:#000000;fill-opacity:1;stroke:none;stroke-width:6.51673;stroke-linecap:butt;stroke-linejoin:miter;stroke-miterlimit:4;stroke-dasharray:none;stroke-dashoffset:0;stroke-opacity:1;marker:none;marker-start:none;marker-mid:none;marker-end:none;paint-order:normal;enable-background:new"
           inkscape:connector-curvature="0" />
      </g>
    </g>
    <g
       id="g1085"
       transform="translate(-340)">
      <path
         style="display:inline;vector-effect:none;fill:#bf9ae5;fill-opacity:1;stroke:none;stroke-width:8.74862;stroke-linecap:butt;stroke-linejoin:miter;stroke-miterlimit:4;stroke-dasharray:none;stroke-dashoffset:0;stroke-opacity:1;marker:none;marker-start:none;marker-mid:none;marker-end:none;paint-order:normal;enable-background:new"
         d="M 48,252.00001 H 32 v 16 2 l 16,16 8,-18 z"
         id="path1051"
         inkscape:connector-curvature="0"
         sodipodi:nodetypes="ccccccc" />
      <path
         style="display:inline;vector-effect:none;fill:#50d0e6;fill-opacity:1;stroke:none;stroke-width:6.51673;stroke-linecap:butt;stroke-linejoin:miter;stroke-miterlimit:4;stroke-dasharray:none;stroke-dashoffset:0;stroke-opacity:1;marker:none;marker-start:none;marker-mid:none;marker-end:none;paint-order:normal;enable-background:new"
         clip-path="none"
         d="m 80,252.00001 -24,8 -8,24 v 2 l 10.34375,10.34375 c 3.1339,3.1339 8.17861,3.1339 11.3125,0 l 26.35743,-26.35742 -0.002,-1.99805 L 94,254.00001 Z"
         id="path1053"
         inkscape:connector-curvature="0"
         sodipodi:nodetypes="ccccsscccc" />
      <path
         sodipodi:nodetypes="ccccccc"
         inkscape:connector-curvature="0"
         id="path1055"
         d="m 48,220.00001 4,-12 12,-4 8,16 -8,16 -14,-2 z"
         style="display:inline;vector-effect:none;fill:#21a57e;fill-opacity:1;stroke:none;stroke-width:8.74862;stroke-linecap:butt;stroke-linejoin:miter;stroke-miterlimit:4;stroke-dasharray:none;stroke-dashoffset:0;stroke-opacity:1;marker:none;marker-start:none;marker-mid:none;marker-end:none;paint-order:normal;enable-background:new" />
      <path
         style="display:inline;vector-effect:none;fill:#ffcd48;fill-opacity:1;stroke:none;stroke-width:8.74862;stroke-linecap:butt;stroke-linejoin:miter;stroke-miterlimit:4;stroke-dasharray:none;stroke-dashoffset:0;stroke-opacity:1;marker:none;marker-start:none;marker-mid:none;marker-end:none;paint-order:normal;enable-background:new"
         d="M 80,252.00001 96.01235,267.98766 104,252.00001 l -8,-16 -12,4 z"
         id="path1057"
         inkscape:connector-curvature="0"
         sodipodi:nodetypes="cccccc" />
      <path
         sodipodi:nodetypes="cccccccc"
         inkscape:connector-curvature="0"
         id="path1059"
         d="m 64,236.00001 8,-24 24,-8 8,20 -8,12 -16,16 H 64 Z"
         style="display:inline;vector-effect:none;fill:#ffaa00;fill-opacity:1;stroke:none;stroke-width:8.74862;stroke-linecap:butt;stroke-linejoin:miter;stroke-miterlimit:4;stroke-dasharray:none;stroke-dashoffset:0;stroke-opacity:1;marker:none;marker-start:none;marker-mid:none;marker-end:none;paint-order:normal;enable-background:new" />
      <path
         sodipodi:nodetypes="cccccc"
         inkscape:connector-curvature="0"
         id="path1061"
         d="m 80,252.00001 -32,32 v -32 l 4,-12 12,-4 z"
         style="display:inline;vector-effect:none;fill:#b7e6f5;fill-opacity:1;stroke:none;stroke-width:8.74862;stroke-linecap:butt;stroke-linejoin:miter;stroke-miterlimit:4;stroke-dasharray:none;stroke-dashoffset:0;stroke-opacity:1;marker:none;marker-start:none;marker-mid:none;marker-end:none;paint-order:normal;enable-background:new" />
      <path
         sodipodi:nodetypes="cccccc"
         inkscape:connector-curvature="0"
         id="path1063"
         d="m 64,204.00001 4,-13 12,-3 16,16 -32,32 z"
         style="display:inline;vector-effect:none;fill:#2ec299;fill-opacity:1;stroke:none;stroke-width:8.74862;stroke-linecap:butt;stroke-linejoin:miter;stroke-miterlimit:4;stroke-dasharray:none;stroke-dashoffset:0;stroke-opacity:1;marker:none;marker-start:none;marker-mid:none;marker-end:none;paint-order:normal;enable-background:new" />
      <path
         style="display:inline;vector-effect:none;fill:#6746d6;fill-opacity:1;stroke:none;stroke-width:8.74862;stroke-linecap:butt;stroke-linejoin:miter;stroke-miterlimit:4;stroke-dasharray:none;stroke-dashoffset:0;stroke-opacity:1;marker:none;marker-start:none;marker-mid:none;marker-end:none;paint-order:normal;enable-background:new"
         d="M 32.03125,203.96876 18.63282,217.3672 5.34571,230.68751 c -1.35341,1.51718 -2.0338,3.41173 -2.03125,5.3125 h -0.002 v 2 h 0.002 c -0.003,2.04494 0.77436,4.08881 2.3418,5.65625 l 10.34375,10.34375 v -2 l 24,-8 8,-24 -4,-12 z"
         id="path1065"
         inkscape:connector-curvature="0"
         sodipodi:nodetypes="cccccccscccccc" />
      <path
         style="display:inline;vector-effect:none;fill:#f8e859;fill-opacity:1;stroke:none;stroke-width:8.74862;stroke-linecap:butt;stroke-linejoin:miter;stroke-miterlimit:4;stroke-dasharray:none;stroke-dashoffset:0;stroke-opacity:1;marker:none;marker-start:none;marker-mid:none;marker-end:none;paint-order:normal;enable-background:new"
         d="m 64,175.30665 c -2.04495,0 -4.0893,0.78266 -5.65625,2.34961 L 32,204.00001 l 16,8 16,-8 15.98633,-16.01367 -10.33008,-10.33008 C 68.0893,176.08931 66.04495,175.30665 64,175.30665 Z"
         id="path1067"
         inkscape:connector-curvature="0"
         sodipodi:nodetypes="ssccccss" />
      <path
         inkscape:connector-curvature="0"
         style="display:inline;vector-effect:none;fill:#e7375f;fill-opacity:1;stroke:none;stroke-width:8.74862;stroke-linecap:butt;stroke-linejoin:miter;stroke-miterlimit:4;stroke-dasharray:none;stroke-dashoffset:0;stroke-opacity:1;marker:none;marker-start:none;marker-mid:none;marker-end:none;paint-order:normal;enable-background:new"
         d="m 96,204.00001 -0.0664,33.90039 16.08203,16.08399 10.32813,-10.32813 c 1.56744,-1.56744 2.34453,-3.61131 2.3418,-5.65625 h 0.002 v -2 h -0.002 c 0.003,-2.04494 -0.77436,-4.08881 -2.3418,-5.65625 z"
         id="path1069" />
      <path
         sodipodi:nodetypes="ccccc"
         inkscape:connector-curvature="0"
         id="path1071"
         d="m 64,204.00001 16,16 16,-16 -16,-16 z"
         style="display:inline;opacity:0.2;vector-effect:none;fill:#ffffff;fill-opacity:1;stroke:none;stroke-width:8.74862;stroke-linecap:butt;stroke-linejoin:miter;stroke-miterlimit:4;stroke-dasharray:none;stroke-dashoffset:0;stroke-opacity:1;marker:none;marker-start:none;marker-mid:none;marker-end:none;paint-order:normal;enable-background:new" />
      <path
         style="display:inline;vector-effect:none;fill:#eec40a;fill-opacity:1;stroke:none;stroke-width:8.74862;stroke-linecap:butt;stroke-linejoin:miter;stroke-miterlimit:4;stroke-dasharray:none;stroke-dashoffset:0;stroke-opacity:1;marker:none;marker-start:none;marker-mid:none;marker-end:none;paint-order:normal;enable-background:new"
         d="m 32,204.00001 16,16 16,-16 z"
         id="path1073"
         inkscape:connector-curvature="0"
         sodipodi:nodetypes="cccc" />
      <path
         inkscape:connector-curvature="0"
         style="display:inline;vector-effect:none;fill:#f87d9e;fill-opacity:1;stroke:none;stroke-width:8.74862;stroke-linecap:butt;stroke-linejoin:miter;stroke-miterlimit:4;stroke-dasharray:none;stroke-dashoffset:0;stroke-opacity:1;marker:none;marker-start:none;marker-mid:none;marker-end:none;paint-order:normal;enable-background:new"
         d="m 96,236.00001 0.0137,33.98633 15.98632,-15.98633 v -1.98242 z"
         id="path1075" />
      <path
         style="display:inline;vector-effect:none;fill:#8d60d8;fill-opacity:1;stroke:none;stroke-width:8.74862;stroke-linecap:butt;stroke-linejoin:miter;stroke-miterlimit:4;stroke-dasharray:none;stroke-dashoffset:0;stroke-opacity:1;marker:none;marker-start:none;marker-mid:none;marker-end:none;paint-order:normal;enable-background:new"
         d="M 32.02344,235.97657 16,252.00001 v 2 l 16,16 v -2 l 16,-16 -4,-12 z"
         id="path1077"
         inkscape:connector-curvature="0"
         sodipodi:nodetypes="cccccccc" />
      <path
         style="display:inline;vector-effect:none;fill:#5dc2f3;fill-opacity:1;stroke:none;stroke-width:8.74862;stroke-linecap:butt;stroke-linejoin:miter;stroke-miterlimit:4;stroke-dasharray:none;stroke-dashoffset:0;stroke-opacity:1;marker:none;marker-start:none;marker-mid:none;marker-end:none;paint-order:normal;enable-background:new"
         d="m 64,236.00001 -16,16 L 32.02319,235.97682 48,228.00001 Z"
         id="path1079"
         inkscape:connector-curvature="0"
         sodipodi:nodetypes="ccccc" />
      <path
         sodipodi:nodetypes="cccc"
         inkscape:connector-curvature="0"
         id="path1081"
         d="m 64,236.00001 -16,-16 -16,16 z"
         style="display:inline;vector-effect:none;fill:#1c8dd3;fill-opacity:1;stroke:none;stroke-width:8.74862;stroke-linecap:butt;stroke-linejoin:miter;stroke-miterlimit:4;stroke-dasharray:none;stroke-dashoffset:0;stroke-opacity:1;marker:none;marker-start:none;marker-mid:none;marker-end:none;paint-order:normal;enable-background:new" />
      <path
         inkscape:connector-curvature="0"
         style="display:inline;opacity:0.2;vector-effect:none;fill:#000000;fill-opacity:1;stroke:none;stroke-width:6.51673;stroke-linecap:butt;stroke-linejoin:miter;stroke-miterlimit:4;stroke-dasharray:none;stroke-dashoffset:0;stroke-opacity:1;marker:none;marker-start:none;marker-mid:none;marker-end:none;paint-order:normal;enable-background:new"
         clip-path="none"
         d="m 3.3125,236.00001 v 2 h 0.002 c -0.003,2.04494 0.77436,4.08881 2.3418,5.65625 l 52.6875,52.6875 c 3.1339,3.1339 8.1786,3.1339 11.3125,0 l 52.6875,-52.6875 c 1.56744,-1.56744 2.34453,-3.61131 2.3418,-5.65625 h 0.002 v -2 h -0.002 c 0.003,2.04494 -0.77436,4.08881 -2.3418,5.65625 l -52.6875,52.6875 c -3.1339,3.1339 -8.1786,3.1339 -11.3125,0 L 5.6563,241.65626 c -1.56744,-1.56744 -2.34453,-3.61131 -2.34179,-5.65625 z"
         id="path1083" />
    </g>
  </g>
</svg>
