<?xml version="1.0" encoding="UTF-8" standalone="no"?>
<!-- Created with Inkscape (http://www.inkscape.org/) -->

<svg
   inkscape:export-ydpi="96"
   inkscape:export-xdpi="96"
   inkscape:export-filename="Template.png"
   width="192"
   height="152"
   id="svg11300"
   sodipodi:version="0.32"
   inkscape:version="1.3.2 (091e20ef0f, 2023-11-25)"
   sodipodi:docname="eek.notanapp.CaptivePortal.Source.svg"
   inkscape:output_extension="org.inkscape.output.svg.inkscape"
   version="1.0"
   style="display:inline;enable-background:new"
   viewBox="0 0 192 152"
   xmlns:inkscape="http://www.inkscape.org/namespaces/inkscape"
   xmlns:sodipodi="http://sodipodi.sourceforge.net/DTD/sodipodi-0.dtd"
   xmlns:xlink="http://www.w3.org/1999/xlink"
   xmlns="http://www.w3.org/2000/svg"
   xmlns:svg="http://www.w3.org/2000/svg"
   xmlns:rdf="http://www.w3.org/1999/02/22-rdf-syntax-ns#"
   xmlns:cc="http://creativecommons.org/ns#"
   xmlns:dc="http://purl.org/dc/elements/1.1/">
  <title
     id="title4162">Adwaita Icon Template</title>
  <defs
     id="defs3">
    <linearGradient
       id="linearGradient34"
       inkscape:collect="always">
      <stop
         style="stop-color:#bb5e00;stop-opacity:1;"
         offset="0"
         id="stop34" />
      <stop
         style="stop-color:#ffa954;stop-opacity:1;"
         offset="0.0530386"
         id="stop36" />
      <stop
         style="stop-color:#eb7400;stop-opacity:1;"
         offset="0.11771846"
         id="stop37" />
      <stop
         style="stop-color:#9a4c00;stop-opacity:1;"
         offset="0.25692961"
         id="stop42" />
      <stop
         style="stop-color:#ff9d40;stop-opacity:1;"
         offset="0.59296435"
         id="stop38" />
      <stop
         style="stop-color:#d36900;stop-opacity:1;"
         offset="0.87488514"
         id="stop39" />
      <stop
         style="stop-color:#ffc080;stop-opacity:1;"
         offset="0.93456346"
         id="stop41" />
      <stop
         style="stop-color:#ae5700;stop-opacity:1;"
         offset="1"
         id="stop35" />
    </linearGradient>
    <linearGradient
       id="linearGradient20"
       inkscape:collect="always">
      <stop
         style="stop-color:#e66100;stop-opacity:1;"
         offset="0"
         id="stop21" />
      <stop
         style="stop-color:#e66100;stop-opacity:1;"
         offset="0.06504966"
         id="stop23" />
      <stop
         style="stop-color:#e66100;stop-opacity:1;"
         offset="0.1149848"
         id="stop24" />
      <stop
         style="stop-color:#e66100;stop-opacity:1;"
         offset="0.18568565"
         id="stop25" />
      <stop
         style="stop-color:#e66100;stop-opacity:1;"
         offset="0.2428553"
         id="stop26" />
      <stop
         style="stop-color:#e66100;stop-opacity:1;"
         offset="0.31723431"
         id="stop27" />
      <stop
         style="stop-color:#e66100;stop-opacity:1;"
         offset="0.44832012"
         id="stop29" />
      <stop
         style="stop-color:#ffb780;stop-opacity:1;"
         offset="0.50244492"
         id="stop28" />
      <stop
         style="stop-color:#e66100;stop-opacity:1;"
         offset="0.56326836"
         id="stop30" />
      <stop
         style="stop-color:#e66100;stop-opacity:1;"
         offset="0.71916348"
         id="stop31" />
      <stop
         style="stop-color:#e66100;stop-opacity:1;"
         offset="0.79627061"
         id="stop32" />
      <stop
         style="stop-color:#e66100;stop-opacity:1;"
         offset="0.85700881"
         id="stop33" />
      <stop
         style="stop-color:#e66100;stop-opacity:1;"
         offset="1"
         id="stop22" />
    </linearGradient>
    <linearGradient
       id="linearGradient13"
       inkscape:collect="always">
      <stop
         style="stop-color:#b6b6b9;stop-opacity:1;"
         offset="0"
         id="stop13" />
      <stop
         style="stop-color:#77767b;stop-opacity:1;"
         offset="0.08803879"
         id="stop20" />
      <stop
         style="stop-color:#77767b;stop-opacity:1;"
         offset="0.40454084"
         id="stop19" />
      <stop
         style="stop-color:#aaaaad;stop-opacity:1;"
         offset="0.49999976"
         id="stop18" />
      <stop
         style="stop-color:#5c5b5f;stop-opacity:1;"
         offset="0.60591316"
         id="stop17" />
      <stop
         style="stop-color:#616064;stop-opacity:1;"
         offset="0.89728618"
         id="stop16" />
      <stop
         style="stop-color:#c8c8c9;stop-opacity:1;"
         offset="0.9647997"
         id="stop15" />
      <stop
         style="stop-color:#77767b;stop-opacity:1;"
         offset="1"
         id="stop14" />
    </linearGradient>
    <inkscape:path-effect
       effect="fillet_chamfer"
       id="path-effect11"
       is_visible="true"
       lpeversion="1"
       nodesatellites_param="F,0,1,1,0,25.657965,0,1 @ F,0,1,1,0,25.657965,0,1 @ F,0,1,1,0,25.657965,0,1 @ F,0,1,1,0,25.657965,0,1 @ F,0,0,1,0,25.657965,0,1 @ F,0,1,1,0,25.657965,0,1"
       radius="0"
       unit="px"
       method="auto"
       mode="F"
       chamfer_steps="1"
       flexible="false"
       use_knot_distance="true"
       apply_no_radius="true"
       apply_with_radius="true"
       only_selected="false"
       hide_knots="false" />
    <inkscape:path-effect
       effect="fillet_chamfer"
       id="path-effect9"
       is_visible="true"
       lpeversion="1"
       nodesatellites_param="F,0,1,1,0,25.657965,0,1 @ F,0,1,1,0,25.657965,0,1 @ F,0,1,1,0,25.657965,0,1 @ F,0,1,1,0,25.657965,0,1 @ F,0,0,1,0,25.657965,0,1 @ F,0,1,1,0,25.657965,0,1"
       radius="0"
       unit="px"
       method="auto"
       mode="F"
       chamfer_steps="1"
       flexible="false"
       use_knot_distance="true"
       apply_no_radius="true"
       apply_with_radius="true"
       only_selected="false"
       hide_knots="false" />
    <linearGradient
       y2="236"
       x2="96"
       y1="236"
       x1="32"
       gradientTransform="translate(604.81684,170.58641)"
       gradientUnits="userSpaceOnUse"
       id="linearGradient1099"
       xlink:href="#linearGradient1036" />
    <linearGradient
       id="linearGradient1036">
      <stop
         id="stop1032"
         offset="0"
         style="stop-color:#d5d3cf;stop-opacity:1;" />
      <stop
         id="stop1034"
         offset="1"
         style="stop-color:#f6f5f4;stop-opacity:1" />
    </linearGradient>
    <radialGradient
       r="32"
       fy="-76"
       fx="-244"
       cy="-76"
       cx="-244"
       gradientTransform="matrix(0.88333331,0,0,0.88333331,-460.35018,463.11973)"
       gradientUnits="userSpaceOnUse"
       id="radialGradient1103"
       xlink:href="#linearGradient1069" />
    <linearGradient
       id="linearGradient1069">
      <stop
         id="stop1065"
         offset="0"
         style="stop-color:#d5d3cf;stop-opacity:1" />
      <stop
         id="stop1067-1"
         offset="1"
         style="stop-color:#949390;stop-opacity:1" />
    </linearGradient>
    <linearGradient
       gradientUnits="userSpaceOnUse"
       y2="232"
       x2="64"
       y1="262.5"
       x1="64"
       id="linearGradient1027"
       xlink:href="#linearGradient1025"
       gradientTransform="translate(-470.5864,432.81685)" />
    <linearGradient
       id="linearGradient1025">
      <stop
         id="stop1021"
         offset="0"
         style="stop-color:#9a9996;stop-opacity:1" />
      <stop
         id="stop1023"
         offset="1"
         style="stop-color:#77767b;stop-opacity:1" />
    </linearGradient>
    <inkscape:path-effect
       effect="spiro"
       id="path-effect35304-9"
       is_visible="true" />
    <clipPath
       clipPathUnits="userSpaceOnUse"
       id="clipPath1609-7">
      <path
         sodipodi:nodetypes="cccccc"
         inkscape:connector-curvature="0"
         id="path1611-5"
         d="m 252,116 28,-28 v -8 h -36 v 36 z"
         style="fill:#e74747;stroke:none;stroke-width:0.25px;stroke-linecap:butt;stroke-linejoin:miter;stroke-opacity:1" />
    </clipPath>
    <linearGradient
       id="linearGradient1697">
      <stop
         id="stop1685"
         offset="0"
         style="stop-color:#deddda;stop-opacity:1" />
      <stop
         style="stop-color:#eeeeec;stop-opacity:1"
         offset="0.04545455"
         id="stop1687" />
      <stop
         id="stop1689"
         offset="0.09090909"
         style="stop-color:#deddda;stop-opacity:1" />
      <stop
         style="stop-color:#deddda;stop-opacity:1"
         offset="0.90909094"
         id="stop1691" />
      <stop
         id="stop1693"
         offset="0.95454544"
         style="stop-color:#eeeeec;stop-opacity:1" />
      <stop
         id="stop1695"
         offset="1"
         style="stop-color:#c0bfbc;stop-opacity:1" />
    </linearGradient>
    <clipPath
       clipPathUnits="userSpaceOnUse"
       id="clipPath1289">
      <path
         style="display:inline;opacity:1;vector-effect:none;fill:none;fill-opacity:1;stroke:#000000;stroke-width:4;stroke-linecap:round;stroke-linejoin:round;stroke-miterlimit:4;stroke-dasharray:none;stroke-dashoffset:0;stroke-opacity:1;marker:none;marker-start:none;marker-mid:none;marker-end:none;paint-order:normal;enable-background:new"
         d="m 64,-148 h 64 l 64,-64 64,64 h 192 c 17.728,0 32,14.272 32,32 v 288 c 0,17.728 -14.272,32 -32,32 H 256 l -64,-64 -64,64 H 64 C 46.272,204 32,189.728 32,172 v -288 c 0,-17.728 14.408898,-34.19889 32,-32 z"
         id="path1291"
         inkscape:connector-curvature="0"
         sodipodi:nodetypes="scccsssscccssss" />
    </clipPath>
    <linearGradient
       id="paint3_linear-2-6-5"
       x2="1"
       gradientUnits="userSpaceOnUse"
       gradientTransform="matrix(0,6,-12,0,-64,209.99687)">
      <stop
         stop-color="#C01C27"
         id="stop91-0-7-4" />
      <stop
         offset="1"
         stop-color="#E01B24"
         id="stop93-2-5-7" />
    </linearGradient>
    <clipPath
       clipPathUnits="userSpaceOnUse"
       id="clipPath1609">
      <path
         sodipodi:nodetypes="cccccc"
         inkscape:connector-curvature="0"
         id="path1611"
         d="m 252,116 28,-28 v -8 h -36 v 36 z"
         style="fill:#e74747;stroke:none;stroke-width:0.25px;stroke-linecap:butt;stroke-linejoin:miter;stroke-opacity:1" />
    </clipPath>
    <linearGradient
       inkscape:collect="always"
       xlink:href="#linearGradient13"
       id="linearGradient14"
       x1="-129.1637"
       y1="64.190842"
       x2="129.99307"
       y2="124.63248"
       gradientUnits="userSpaceOnUse" />
    <linearGradient
       inkscape:collect="always"
       xlink:href="#linearGradient20"
       id="linearGradient22"
       x1="24"
       y1="244"
       x2="104.18214"
       y2="244"
       gradientUnits="userSpaceOnUse" />
    <linearGradient
       inkscape:collect="always"
       xlink:href="#linearGradient34"
       id="linearGradient35"
       x1="25.382807"
       y1="226.15038"
       x2="104"
       y2="228"
       gradientUnits="userSpaceOnUse" />
    <linearGradient
       inkscape:collect="always"
       xlink:href="#linearGradient34"
       id="linearGradient42"
       gradientUnits="userSpaceOnUse"
       x1="38.373528"
       y1="228"
       x2="89.688972"
       y2="228" />
  </defs>
  <sodipodi:namedview
     stroke="#ef2929"
     fill="#f57900"
     id="base"
     pagecolor="#ffffff"
     bordercolor="#666666"
     borderopacity="0.25490196"
     inkscape:pageopacity="0.0"
     inkscape:pageshadow="2"
     inkscape:zoom="2.8284271"
     inkscape:cx="-16.018274"
     inkscape:cy="11.797527"
     inkscape:current-layer="layer9"
     showgrid="true"
     inkscape:grid-bbox="true"
     inkscape:document-units="px"
     inkscape:showpageshadow="false"
     inkscape:window-width="1920"
     inkscape:window-height="1016"
     inkscape:window-x="0"
     inkscape:window-y="27"
     width="400px"
     height="300px"
     inkscape:snap-nodes="true"
     inkscape:snap-bbox="true"
     objecttolerance="7"
     gridtolerance="12"
     guidetolerance="13"
     inkscape:window-maximized="1"
     inkscape:pagecheckerboard="false"
     showguides="false"
     inkscape:guide-bbox="true"
     inkscape:locked="false"
     inkscape:measure-start="0,0"
     inkscape:measure-end="0,0"
     inkscape:object-nodes="true"
     inkscape:bbox-nodes="true"
     inkscape:snap-global="true"
     inkscape:object-paths="true"
     inkscape:snap-intersection-paths="true"
     inkscape:snap-bbox-edge-midpoints="true"
     inkscape:snap-bbox-midpoints="true"
     showborder="true"
     inkscape:snap-center="true"
     inkscape:snap-object-midpoints="true"
     inkscape:snap-midpoints="true"
     inkscape:snap-smooth-nodes="true"
     inkscape:snap-text-baseline="true"
     borderlayer="true"
     inkscape:deskcolor="#d1d1d1">
    <inkscape:grid
       type="xygrid"
       id="grid5883"
       spacingx="2"
       spacingy="2"
       enabled="true"
       visible="true"
       empspacing="4"
       originx="8"
       originy="8"
       units="px" />
    <sodipodi:guide
       position="72,16"
       orientation="0,1"
       id="guide1073"
       inkscape:locked="false"
       inkscape:label=""
       inkscape:color="rgb(0,0,255)" />
    <sodipodi:guide
       position="20,72"
       orientation="1,0"
       id="guide1075"
       inkscape:locked="false"
       inkscape:label=""
       inkscape:color="rgb(0,0,255)" />
    <sodipodi:guide
       position="72,112"
       orientation="0,1"
       id="guide1099"
       inkscape:locked="false"
       inkscape:label=""
       inkscape:color="rgb(0,0,255)" />
    <sodipodi:guide
       position="72,136"
       orientation="0,1"
       id="guide993"
       inkscape:locked="false"
       inkscape:label=""
       inkscape:color="rgb(0,0,255)" />
    <sodipodi:guide
       position="112,72"
       orientation="1,0"
       id="guide995"
       inkscape:locked="false"
       inkscape:label=""
       inkscape:color="rgb(0,0,255)" />
    <sodipodi:guide
       position="8.0000001,72"
       orientation="1,0"
       id="guide867"
       inkscape:locked="false"
       inkscape:label=""
       inkscape:color="rgb(0,0,255)" />
    <sodipodi:guide
       position="128,72"
       orientation="1,0"
       id="guide869"
       inkscape:locked="false"
       inkscape:label=""
       inkscape:color="rgb(0,0,255)" />
    <sodipodi:guide
       position="72,124"
       orientation="0,1"
       id="guide871"
       inkscape:locked="false"
       inkscape:label=""
       inkscape:color="rgb(0,0,255)" />
    <inkscape:grid
       type="xygrid"
       id="grid873"
       spacingx="1"
       spacingy="1"
       empspacing="8"
       color="#000000"
       opacity="0.49019608"
       empcolor="#000000"
       empopacity="0.08627451"
       dotted="true"
       originx="8"
       originy="8"
       units="px"
       visible="true" />
    <sodipodi:guide
       position="32,72"
       orientation="1,0"
       id="guide877"
       inkscape:locked="false"
       inkscape:label=""
       inkscape:color="rgb(0,0,255)" />
    <sodipodi:guide
       position="124,72"
       orientation="1,0"
       id="guide879"
       inkscape:locked="false"
       inkscape:label=""
       inkscape:color="rgb(0,0,255)" />
    <sodipodi:guide
       position="72,128"
       orientation="0,1"
       id="guide881"
       inkscape:locked="false"
       inkscape:label=""
       inkscape:color="rgb(0,0,255)" />
    <sodipodi:guide
       position="72,20"
       orientation="0,1"
       id="guide883"
       inkscape:locked="false"
       inkscape:label=""
       inkscape:color="rgb(0,0,255)" />
    <sodipodi:guide
       position="16,72"
       orientation="1,0"
       id="guide885"
       inkscape:locked="false"
       inkscape:label=""
       inkscape:color="rgb(0,0,255)" />
    <sodipodi:guide
       position="136,72"
       orientation="1,0"
       id="guide887"
       inkscape:locked="false"
       inkscape:label=""
       inkscape:color="rgb(0,0,255)" />
    <sodipodi:guide
       position="72,8"
       orientation="0,1"
       id="guide897"
       inkscape:locked="false"
       inkscape:label=""
       inkscape:color="rgb(0,0,255)" />
    <sodipodi:guide
       position="72,32"
       orientation="0,1"
       id="guide899"
       inkscape:locked="false"
       inkscape:label=""
       inkscape:color="rgb(0,0,255)" />
    <sodipodi:guide
       position="264,264"
       orientation="-0.70710678,0.70710678"
       id="guide950"
       inkscape:locked="false"
       inkscape:label=""
       inkscape:color="rgb(0,0,255)" />
    <sodipodi:guide
       position="72,72"
       orientation="0.70710678,0.70710678"
       id="guide952"
       inkscape:locked="false"
       inkscape:label=""
       inkscape:color="rgb(0,0,255)" />
  </sodipodi:namedview>
  <metadata
     id="metadata4">
    <rdf:RDF>
      <cc:Work
         rdf:about="">
        <dc:format>image/svg+xml</dc:format>
        <dc:type
           rdf:resource="http://purl.org/dc/dcmitype/StillImage" />
        <dc:creator>
          <cc:Agent>
            <dc:title>GNOME Design Team</dc:title>
          </cc:Agent>
        </dc:creator>
        <dc:source />
        <cc:license
           rdf:resource="http://creativecommons.org/licenses/by-sa/4.0/" />
        <dc:title>Adwaita Icon Template</dc:title>
        <dc:subject>
          <rdf:Bag />
        </dc:subject>
        <dc:date />
        <dc:rights>
          <cc:Agent>
            <dc:title />
          </cc:Agent>
        </dc:rights>
        <dc:publisher>
          <cc:Agent>
            <dc:title />
          </cc:Agent>
        </dc:publisher>
        <dc:identifier />
        <dc:relation />
        <dc:language />
        <dc:coverage />
        <dc:description />
        <dc:contributor>
          <cc:Agent>
            <dc:title />
          </cc:Agent>
        </dc:contributor>
      </cc:Work>
      <cc:License
         rdf:about="http://creativecommons.org/licenses/by-sa/4.0/">
        <cc:permits
           rdf:resource="http://creativecommons.org/ns#Reproduction" />
        <cc:permits
           rdf:resource="http://creativecommons.org/ns#Distribution" />
        <cc:requires
           rdf:resource="http://creativecommons.org/ns#Notice" />
        <cc:requires
           rdf:resource="http://creativecommons.org/ns#Attribution" />
        <cc:permits
           rdf:resource="http://creativecommons.org/ns#DerivativeWorks" />
        <cc:requires
           rdf:resource="http://creativecommons.org/ns#ShareAlike" />
      </cc:License>
    </rdf:RDF>
  </metadata>
  <g
     id="layer1"
     inkscape:label="App Icon"
     inkscape:groupmode="layer"
     style="display:inline"
     transform="translate(8,-156)">
    <g
       inkscape:groupmode="layer"
       id="layer4"
       inkscape:label="template"
       style="display:inline"
       sodipodi:insensitive="true">
      <rect
         inkscape:label="0"
         y="172"
         x="9.2651362e-08"
         height="128"
         width="128"
         id="hicolor"
         style="display:inline;overflow:visible;visibility:visible;fill:#f0f0f0;fill-opacity:0;fill-rule:nonzero;stroke:none;stroke-width:0.5;marker:none;enable-background:accumulate" />
      <rect
         style="display:inline;overflow:visible;visibility:visible;fill:#f0f0f0;fill-opacity:0;fill-rule:nonzero;stroke:none;stroke-width:0.5;marker:none;enable-background:accumulate"
         id="symbolic"
         width="16"
         height="16"
         x="160"
         y="172"
         inkscape:label="0" />
    </g>
    <g
       inkscape:groupmode="layer"
       id="layer2"
       inkscape:label="baseplate"
       style="display:inline"
       sodipodi:insensitive="true">
      <g
         id="g1481"
         transform="translate(0,168)">
        <g
           id="g1430"
           transform="translate(-502.58934,-158.75232)">
          <rect
             inkscape:label="512x512"
             y="330.75232"
             x="4.5893426"
             height="128"
             width="128"
             id="rect1418"
             style="display:inline;overflow:visible;visibility:visible;fill:#f0f0f0;fill-opacity:1;fill-rule:nonzero;stroke:none;stroke-width:0.5;marker:none;enable-background:accumulate" />
          <circle
             style="display:inline;opacity:0.1;vector-effect:none;fill:none;fill-opacity:1;stroke:#000000;stroke-width:0.99000001;stroke-linecap:butt;stroke-linejoin:miter;stroke-miterlimit:4;stroke-dasharray:0.99000001, 0.99000001;stroke-dashoffset:0;stroke-opacity:1;marker:none;marker-start:none;marker-mid:none;marker-end:none;paint-order:normal;enable-background:new"
             id="circle1420"
             r="59.504131"
             cy="394.75232"
             cx="68.589371" />
          <rect
             style="display:inline;opacity:0.1;vector-effect:none;fill:none;fill-opacity:1;stroke:#000000;stroke-width:0.99000001;stroke-linecap:butt;stroke-linejoin:miter;stroke-miterlimit:4;stroke-dasharray:0.99000001, 0.99000001;stroke-dashoffset:0;stroke-opacity:1;marker:none;marker-start:none;marker-mid:none;marker-end:none;paint-order:normal;enable-background:new"
             id="rect1422"
             width="87.009987"
             height="111.01005"
             x="25.084349"
             y="339.24728"
             rx="8.701004"
             ry="7.9292889" />
          <rect
             style="display:inline;opacity:0.1;vector-effect:none;fill:none;fill-opacity:1;stroke:#000000;stroke-width:0.99000001;stroke-linecap:butt;stroke-linejoin:miter;stroke-miterlimit:4;stroke-dasharray:0.99000001, 0.99000001;stroke-dashoffset:0;stroke-opacity:1;marker:none;marker-start:none;marker-mid:none;marker-end:none;paint-order:normal;enable-background:new"
             id="rect1424"
             width="103.00952"
             height="103.00952"
             x="17.084608"
             y="343.24756"
             rx="7.9238095"
             ry="7.9238095" />
          <rect
             style="display:inline;opacity:0.1;vector-effect:none;fill:none;fill-opacity:1;stroke:#000000;stroke-width:0.99000001;stroke-linecap:butt;stroke-linejoin:miter;stroke-miterlimit:4;stroke-dasharray:0.99000001, 0.99000001;stroke-dashoffset:0;stroke-opacity:1;marker:none;marker-start:none;marker-mid:none;marker-end:none;paint-order:normal;enable-background:new"
             id="rect1426"
             width="111.01004"
             height="87.010048"
             x="13.08435"
             y="359.24728"
             rx="7.9292889"
             ry="8.701005" />
          <path
             style="display:inline;fill:none;stroke:#62a0ea;stroke-width:2;stroke-linecap:butt;stroke-linejoin:miter;stroke-miterlimit:4;stroke-dasharray:none;stroke-opacity:1;enable-background:new"
             d="M 4.5893689,447.7523 H 132.58937"
             id="path1428"
             inkscape:connector-curvature="0" />
        </g>
        <g
           transform="translate(-358.58936,-158.75232)"
           id="g1444">
          <rect
             style="display:inline;overflow:visible;visibility:visible;fill:#f0f0f0;fill-opacity:1;fill-rule:nonzero;stroke:none;stroke-width:0.5;marker:none;enable-background:accumulate"
             id="rect1432"
             width="128"
             height="128"
             x="4.5893426"
             y="330.75232"
             inkscape:label="512x512" />
          <circle
             cx="68.589371"
             cy="394.75232"
             r="59.504131"
             id="circle1434"
             style="display:inline;opacity:0.1;vector-effect:none;fill:none;fill-opacity:1;stroke:#000000;stroke-width:0.99000001;stroke-linecap:butt;stroke-linejoin:miter;stroke-miterlimit:4;stroke-dasharray:0.99000001, 0.99000001;stroke-dashoffset:0;stroke-opacity:1;marker:none;marker-start:none;marker-mid:none;marker-end:none;paint-order:normal;enable-background:new" />
          <rect
             ry="7.9292889"
             rx="8.701004"
             y="339.24728"
             x="25.084349"
             height="111.01005"
             width="87.009987"
             id="rect1436"
             style="display:inline;opacity:0.1;vector-effect:none;fill:none;fill-opacity:1;stroke:#000000;stroke-width:0.99000001;stroke-linecap:butt;stroke-linejoin:miter;stroke-miterlimit:4;stroke-dasharray:0.99000001, 0.99000001;stroke-dashoffset:0;stroke-opacity:1;marker:none;marker-start:none;marker-mid:none;marker-end:none;paint-order:normal;enable-background:new" />
          <rect
             ry="7.9238095"
             rx="7.9238095"
             y="343.24756"
             x="17.084608"
             height="103.00952"
             width="103.00952"
             id="rect1438"
             style="display:inline;opacity:0.1;vector-effect:none;fill:none;fill-opacity:1;stroke:#000000;stroke-width:0.99000001;stroke-linecap:butt;stroke-linejoin:miter;stroke-miterlimit:4;stroke-dasharray:0.99000001, 0.99000001;stroke-dashoffset:0;stroke-opacity:1;marker:none;marker-start:none;marker-mid:none;marker-end:none;paint-order:normal;enable-background:new" />
          <rect
             ry="8.701005"
             rx="7.9292889"
             y="359.24728"
             x="13.08435"
             height="87.010048"
             width="111.01004"
             id="rect1440"
             style="display:inline;opacity:0.1;vector-effect:none;fill:none;fill-opacity:1;stroke:#000000;stroke-width:0.99000001;stroke-linecap:butt;stroke-linejoin:miter;stroke-miterlimit:4;stroke-dasharray:0.99000001, 0.99000001;stroke-dashoffset:0;stroke-opacity:1;marker:none;marker-start:none;marker-mid:none;marker-end:none;paint-order:normal;enable-background:new" />
          <path
             inkscape:connector-curvature="0"
             id="path1442"
             d="M 4.5893689,447.7523 H 132.58937"
             style="display:inline;fill:none;stroke:#62a0ea;stroke-width:2;stroke-linecap:butt;stroke-linejoin:miter;stroke-miterlimit:4;stroke-dasharray:none;stroke-opacity:1;enable-background:new" />
        </g>
        <g
           id="g1458"
           transform="translate(-214.58936,-158.75232)">
          <rect
             inkscape:label="512x512"
             y="330.75232"
             x="4.5893426"
             height="128"
             width="128"
             id="rect1446"
             style="display:inline;overflow:visible;visibility:visible;fill:#f0f0f0;fill-opacity:1;fill-rule:nonzero;stroke:none;stroke-width:0.5;marker:none;enable-background:accumulate" />
          <circle
             style="display:inline;opacity:0.1;vector-effect:none;fill:none;fill-opacity:1;stroke:#000000;stroke-width:0.99000001;stroke-linecap:butt;stroke-linejoin:miter;stroke-miterlimit:4;stroke-dasharray:0.99000001, 0.99000001;stroke-dashoffset:0;stroke-opacity:1;marker:none;marker-start:none;marker-mid:none;marker-end:none;paint-order:normal;enable-background:new"
             id="circle1448"
             r="59.504131"
             cy="394.75232"
             cx="68.589371" />
          <rect
             style="display:inline;opacity:0.1;vector-effect:none;fill:none;fill-opacity:1;stroke:#000000;stroke-width:0.99000001;stroke-linecap:butt;stroke-linejoin:miter;stroke-miterlimit:4;stroke-dasharray:0.99000001, 0.99000001;stroke-dashoffset:0;stroke-opacity:1;marker:none;marker-start:none;marker-mid:none;marker-end:none;paint-order:normal;enable-background:new"
             id="rect1450"
             width="87.009987"
             height="111.01005"
             x="25.084349"
             y="339.24728"
             rx="8.701004"
             ry="7.9292889" />
          <rect
             style="display:inline;opacity:0.1;vector-effect:none;fill:none;fill-opacity:1;stroke:#000000;stroke-width:0.99000001;stroke-linecap:butt;stroke-linejoin:miter;stroke-miterlimit:4;stroke-dasharray:0.99000001, 0.99000001;stroke-dashoffset:0;stroke-opacity:1;marker:none;marker-start:none;marker-mid:none;marker-end:none;paint-order:normal;enable-background:new"
             id="rect1452"
             width="103.00952"
             height="103.00952"
             x="17.084608"
             y="343.24756"
             rx="7.9238095"
             ry="7.9238095" />
          <rect
             style="display:inline;opacity:0.1;vector-effect:none;fill:none;fill-opacity:1;stroke:#000000;stroke-width:0.99000001;stroke-linecap:butt;stroke-linejoin:miter;stroke-miterlimit:4;stroke-dasharray:0.99000001, 0.99000001;stroke-dashoffset:0;stroke-opacity:1;marker:none;marker-start:none;marker-mid:none;marker-end:none;paint-order:normal;enable-background:new"
             id="rect1454"
             width="111.01004"
             height="87.010048"
             x="13.08435"
             y="359.24728"
             rx="7.9292889"
             ry="8.701005" />
          <path
             style="display:inline;fill:none;stroke:#62a0ea;stroke-width:2;stroke-linecap:butt;stroke-linejoin:miter;stroke-miterlimit:4;stroke-dasharray:none;stroke-opacity:1;enable-background:new"
             d="M 4.5893689,447.7523 H 132.58937"
             id="path1456"
             inkscape:connector-curvature="0" />
        </g>
      </g>
      <g
         style="display:inline;fill:#000000;enable-background:new"
         transform="matrix(7.9911709,0,0,8.0036407,-167.7909,-4846.0776)"
         id="g12027"
         inkscape:export-xdpi="12"
         inkscape:export-ydpi="12" />
      <rect
         style="display:inline;overflow:visible;visibility:visible;fill:#f0f0f0;fill-opacity:1;fill-rule:nonzero;stroke:none;stroke-width:0.5;marker:none;enable-background:accumulate"
         id="128"
         width="128"
         height="128"
         x="9.2651362e-08"
         y="172"
         inkscape:label="0" />
      <g
         id="g883"
         style="fill:none;fill-opacity:0.25098039;stroke:#a579b3;stroke-opacity:1"
         transform="translate(-24,24)" />
      <g
         id="g900"
         style="fill:none;fill-opacity:0.25098039;stroke:#a579b3;stroke-opacity:1"
         transform="translate(-24,24)" />
      <rect
         inkscape:label=""
         y="172"
         x="160"
         height="16"
         width="16"
         id="16"
         style="display:inline;overflow:visible;visibility:visible;fill:#f0f0f0;fill-opacity:1;fill-rule:nonzero;stroke:none;stroke-width:0.5;marker:none;enable-background:accumulate" />
      <text
         xml:space="preserve"
         style="font-style:normal;font-variant:normal;font-weight:bold;font-stretch:normal;font-size:4px;line-height:125%;font-family:Cantarell;-inkscape-font-specification:'Cantarell, Bold';text-align:start;writing-mode:lr-tb;text-anchor:start;display:inline;fill:#000000;fill-opacity:1;stroke:none;stroke-width:0.332649;enable-background:new"
         x="0"
         y="167"
         id="text863"
         inkscape:label="icon-name"><tspan
           style="font-size:4px;stroke-width:0.332649"
           sodipodi:role="line"
           id="tspan861"
           x="0"
           y="167">Hicolor</tspan></text>
      <text
         inkscape:label="icon-name"
         id="text867"
         y="167"
         x="160"
         style="font-style:normal;font-variant:normal;font-weight:bold;font-stretch:normal;font-size:4px;line-height:125%;font-family:Cantarell;-inkscape-font-specification:'Cantarell, Bold';text-align:start;writing-mode:lr-tb;text-anchor:start;display:inline;fill:#000000;fill-opacity:1;stroke:none;stroke-width:0.332649;enable-background:new"
         xml:space="preserve"><tspan
           y="167"
           x="160"
           id="tspan865"
           sodipodi:role="line"
           style="font-size:4px;stroke-width:0.332649">Symbolic</tspan></text>
      <g
         id="g1318"
         transform="translate(-502.58934,-158.75232)">
        <rect
           inkscape:label="512x512"
           y="330.75232"
           x="4.5893426"
           height="128"
           width="128"
           id="rect13805-6"
           style="display:inline;overflow:visible;visibility:visible;fill:#f0f0f0;fill-opacity:1;fill-rule:nonzero;stroke:none;stroke-width:0.5;marker:none;enable-background:accumulate" />
        <circle
           style="display:inline;opacity:0.1;vector-effect:none;fill:none;fill-opacity:1;stroke:#000000;stroke-width:0.99000001;stroke-linecap:butt;stroke-linejoin:miter;stroke-miterlimit:4;stroke-dasharray:0.99000001, 0.99000001;stroke-dashoffset:0;stroke-opacity:1;marker:none;marker-start:none;marker-mid:none;marker-end:none;paint-order:normal;enable-background:new"
           id="circle2892-2"
           r="59.504131"
           cy="394.75232"
           cx="68.589371" />
        <rect
           style="display:inline;opacity:0.1;vector-effect:none;fill:none;fill-opacity:1;stroke:#000000;stroke-width:0.99000001;stroke-linecap:butt;stroke-linejoin:miter;stroke-miterlimit:4;stroke-dasharray:0.99000001, 0.99000001;stroke-dashoffset:0;stroke-opacity:1;marker:none;marker-start:none;marker-mid:none;marker-end:none;paint-order:normal;enable-background:new"
           id="rect2894-9"
           width="87.009987"
           height="111.01005"
           x="25.084349"
           y="339.24728"
           rx="8.701004"
           ry="7.9292889" />
        <rect
           style="display:inline;opacity:0.1;vector-effect:none;fill:none;fill-opacity:1;stroke:#000000;stroke-width:0.99000001;stroke-linecap:butt;stroke-linejoin:miter;stroke-miterlimit:4;stroke-dasharray:0.99000001, 0.99000001;stroke-dashoffset:0;stroke-opacity:1;marker:none;marker-start:none;marker-mid:none;marker-end:none;paint-order:normal;enable-background:new"
           id="rect2896-1"
           width="103.00952"
           height="103.00952"
           x="17.084608"
           y="343.24756"
           rx="7.9238095"
           ry="7.9238095" />
        <rect
           style="display:inline;opacity:0.1;vector-effect:none;fill:none;fill-opacity:1;stroke:#000000;stroke-width:0.99000001;stroke-linecap:butt;stroke-linejoin:miter;stroke-miterlimit:4;stroke-dasharray:0.99000001, 0.99000001;stroke-dashoffset:0;stroke-opacity:1;marker:none;marker-start:none;marker-mid:none;marker-end:none;paint-order:normal;enable-background:new"
           id="rect2898-2"
           width="111.01004"
           height="87.010048"
           x="13.08435"
           y="359.24728"
           rx="7.9292889"
           ry="8.701005" />
        <path
           style="display:inline;fill:none;stroke:#62a0ea;stroke-width:2;stroke-linecap:butt;stroke-linejoin:miter;stroke-miterlimit:4;stroke-dasharray:none;stroke-opacity:1;enable-background:new"
           d="M 4.5893689,447.7523 H 132.58937"
           id="path2900-7"
           inkscape:connector-curvature="0" />
      </g>
      <g
         transform="translate(-358.58936,-158.75232)"
         id="g1332">
        <rect
           style="display:inline;overflow:visible;visibility:visible;fill:#f0f0f0;fill-opacity:1;fill-rule:nonzero;stroke:none;stroke-width:0.5;marker:none;enable-background:accumulate"
           id="rect1320"
           width="128"
           height="128"
           x="4.5893426"
           y="330.75232"
           inkscape:label="512x512" />
        <circle
           cx="68.589371"
           cy="394.75232"
           r="59.504131"
           id="circle1322"
           style="display:inline;opacity:0.1;vector-effect:none;fill:none;fill-opacity:1;stroke:#000000;stroke-width:0.99000001;stroke-linecap:butt;stroke-linejoin:miter;stroke-miterlimit:4;stroke-dasharray:0.99000001, 0.99000001;stroke-dashoffset:0;stroke-opacity:1;marker:none;marker-start:none;marker-mid:none;marker-end:none;paint-order:normal;enable-background:new" />
        <rect
           ry="7.9292889"
           rx="8.701004"
           y="339.24728"
           x="25.084349"
           height="111.01005"
           width="87.009987"
           id="rect1324"
           style="display:inline;opacity:0.1;vector-effect:none;fill:none;fill-opacity:1;stroke:#000000;stroke-width:0.99000001;stroke-linecap:butt;stroke-linejoin:miter;stroke-miterlimit:4;stroke-dasharray:0.99000001, 0.99000001;stroke-dashoffset:0;stroke-opacity:1;marker:none;marker-start:none;marker-mid:none;marker-end:none;paint-order:normal;enable-background:new" />
        <rect
           ry="7.9238095"
           rx="7.9238095"
           y="343.24756"
           x="17.084608"
           height="103.00952"
           width="103.00952"
           id="rect1326"
           style="display:inline;opacity:0.1;vector-effect:none;fill:none;fill-opacity:1;stroke:#000000;stroke-width:0.99000001;stroke-linecap:butt;stroke-linejoin:miter;stroke-miterlimit:4;stroke-dasharray:0.99000001, 0.99000001;stroke-dashoffset:0;stroke-opacity:1;marker:none;marker-start:none;marker-mid:none;marker-end:none;paint-order:normal;enable-background:new" />
        <rect
           ry="8.701005"
           rx="7.9292889"
           y="359.24728"
           x="13.08435"
           height="87.010048"
           width="111.01004"
           id="rect1328"
           style="display:inline;opacity:0.1;vector-effect:none;fill:none;fill-opacity:1;stroke:#000000;stroke-width:0.99000001;stroke-linecap:butt;stroke-linejoin:miter;stroke-miterlimit:4;stroke-dasharray:0.99000001, 0.99000001;stroke-dashoffset:0;stroke-opacity:1;marker:none;marker-start:none;marker-mid:none;marker-end:none;paint-order:normal;enable-background:new" />
        <path
           inkscape:connector-curvature="0"
           id="path1330"
           d="M 4.5893689,447.7523 H 132.58937"
           style="display:inline;fill:none;stroke:#62a0ea;stroke-width:2;stroke-linecap:butt;stroke-linejoin:miter;stroke-miterlimit:4;stroke-dasharray:none;stroke-opacity:1;enable-background:new" />
      </g>
      <g
         id="g1346"
         transform="translate(-214.58936,-158.75232)">
        <rect
           inkscape:label="512x512"
           y="330.75232"
           x="4.5893426"
           height="128"
           width="128"
           id="rect1334"
           style="display:inline;overflow:visible;visibility:visible;fill:#f0f0f0;fill-opacity:1;fill-rule:nonzero;stroke:none;stroke-width:0.5;marker:none;enable-background:accumulate" />
        <circle
           style="display:inline;opacity:0.1;vector-effect:none;fill:none;fill-opacity:1;stroke:#000000;stroke-width:0.99000001;stroke-linecap:butt;stroke-linejoin:miter;stroke-miterlimit:4;stroke-dasharray:0.99000001, 0.99000001;stroke-dashoffset:0;stroke-opacity:1;marker:none;marker-start:none;marker-mid:none;marker-end:none;paint-order:normal;enable-background:new"
           id="circle1336"
           r="59.504131"
           cy="394.75232"
           cx="68.589371" />
        <rect
           style="display:inline;opacity:0.1;vector-effect:none;fill:none;fill-opacity:1;stroke:#000000;stroke-width:0.99000001;stroke-linecap:butt;stroke-linejoin:miter;stroke-miterlimit:4;stroke-dasharray:0.99000001, 0.99000001;stroke-dashoffset:0;stroke-opacity:1;marker:none;marker-start:none;marker-mid:none;marker-end:none;paint-order:normal;enable-background:new"
           id="rect1338"
           width="87.009987"
           height="111.01005"
           x="25.084349"
           y="339.24728"
           rx="8.701004"
           ry="7.9292889" />
        <rect
           style="display:inline;opacity:0.1;vector-effect:none;fill:none;fill-opacity:1;stroke:#000000;stroke-width:0.99000001;stroke-linecap:butt;stroke-linejoin:miter;stroke-miterlimit:4;stroke-dasharray:0.99000001, 0.99000001;stroke-dashoffset:0;stroke-opacity:1;marker:none;marker-start:none;marker-mid:none;marker-end:none;paint-order:normal;enable-background:new"
           id="rect1340"
           width="103.00952"
           height="103.00952"
           x="17.084608"
           y="343.24756"
           rx="7.9238095"
           ry="7.9238095" />
        <rect
           style="display:inline;opacity:0.1;vector-effect:none;fill:none;fill-opacity:1;stroke:#000000;stroke-width:0.99000001;stroke-linecap:butt;stroke-linejoin:miter;stroke-miterlimit:4;stroke-dasharray:0.99000001, 0.99000001;stroke-dashoffset:0;stroke-opacity:1;marker:none;marker-start:none;marker-mid:none;marker-end:none;paint-order:normal;enable-background:new"
           id="rect1342"
           width="111.01004"
           height="87.010048"
           x="13.08435"
           y="359.24728"
           rx="7.9292889"
           ry="8.701005" />
        <path
           style="display:inline;fill:none;stroke:#62a0ea;stroke-width:2;stroke-linecap:butt;stroke-linejoin:miter;stroke-miterlimit:4;stroke-dasharray:none;stroke-opacity:1;enable-background:new"
           d="M 4.5893689,447.7523 H 132.58937"
           id="path1344"
           inkscape:connector-curvature="0" />
      </g>
      <g
         transform="translate(0,312)"
         id="g1525">
        <g
           transform="translate(-502.58934,-158.75232)"
           id="g1495">
          <rect
             style="display:inline;overflow:visible;visibility:visible;fill:#f0f0f0;fill-opacity:1;fill-rule:nonzero;stroke:none;stroke-width:0.5;marker:none;enable-background:accumulate"
             id="rect1483"
             width="128"
             height="128"
             x="4.5893426"
             y="330.75232"
             inkscape:label="512x512" />
          <circle
             cx="68.589371"
             cy="394.75232"
             r="59.504131"
             id="circle1485"
             style="display:inline;opacity:0.1;vector-effect:none;fill:none;fill-opacity:1;stroke:#000000;stroke-width:0.99000001;stroke-linecap:butt;stroke-linejoin:miter;stroke-miterlimit:4;stroke-dasharray:0.99000001, 0.99000001;stroke-dashoffset:0;stroke-opacity:1;marker:none;marker-start:none;marker-mid:none;marker-end:none;paint-order:normal;enable-background:new" />
          <rect
             ry="7.9292889"
             rx="8.701004"
             y="339.24728"
             x="25.084349"
             height="111.01005"
             width="87.009987"
             id="rect1487"
             style="display:inline;opacity:0.1;vector-effect:none;fill:none;fill-opacity:1;stroke:#000000;stroke-width:0.99000001;stroke-linecap:butt;stroke-linejoin:miter;stroke-miterlimit:4;stroke-dasharray:0.99000001, 0.99000001;stroke-dashoffset:0;stroke-opacity:1;marker:none;marker-start:none;marker-mid:none;marker-end:none;paint-order:normal;enable-background:new" />
          <rect
             ry="7.9238095"
             rx="7.9238095"
             y="343.24756"
             x="17.084608"
             height="103.00952"
             width="103.00952"
             id="rect1489"
             style="display:inline;opacity:0.1;vector-effect:none;fill:none;fill-opacity:1;stroke:#000000;stroke-width:0.99000001;stroke-linecap:butt;stroke-linejoin:miter;stroke-miterlimit:4;stroke-dasharray:0.99000001, 0.99000001;stroke-dashoffset:0;stroke-opacity:1;marker:none;marker-start:none;marker-mid:none;marker-end:none;paint-order:normal;enable-background:new" />
          <rect
             ry="8.701005"
             rx="7.9292889"
             y="359.24728"
             x="13.08435"
             height="87.010048"
             width="111.01004"
             id="rect1491"
             style="display:inline;opacity:0.1;vector-effect:none;fill:none;fill-opacity:1;stroke:#000000;stroke-width:0.99000001;stroke-linecap:butt;stroke-linejoin:miter;stroke-miterlimit:4;stroke-dasharray:0.99000001, 0.99000001;stroke-dashoffset:0;stroke-opacity:1;marker:none;marker-start:none;marker-mid:none;marker-end:none;paint-order:normal;enable-background:new" />
          <path
             inkscape:connector-curvature="0"
             id="path1493"
             d="M 4.5893689,447.7523 H 132.58937"
             style="display:inline;fill:none;stroke:#62a0ea;stroke-width:2;stroke-linecap:butt;stroke-linejoin:miter;stroke-miterlimit:4;stroke-dasharray:none;stroke-opacity:1;enable-background:new" />
        </g>
        <g
           id="g1509"
           transform="translate(-358.58936,-158.75232)">
          <rect
             inkscape:label="512x512"
             y="330.75232"
             x="4.5893426"
             height="128"
             width="128"
             id="rect1497"
             style="display:inline;overflow:visible;visibility:visible;fill:#f0f0f0;fill-opacity:1;fill-rule:nonzero;stroke:none;stroke-width:0.5;marker:none;enable-background:accumulate" />
          <circle
             style="display:inline;opacity:0.1;vector-effect:none;fill:none;fill-opacity:1;stroke:#000000;stroke-width:0.99000001;stroke-linecap:butt;stroke-linejoin:miter;stroke-miterlimit:4;stroke-dasharray:0.99000001, 0.99000001;stroke-dashoffset:0;stroke-opacity:1;marker:none;marker-start:none;marker-mid:none;marker-end:none;paint-order:normal;enable-background:new"
             id="circle1499"
             r="59.504131"
             cy="394.75232"
             cx="68.589371" />
          <rect
             style="display:inline;opacity:0.1;vector-effect:none;fill:none;fill-opacity:1;stroke:#000000;stroke-width:0.99000001;stroke-linecap:butt;stroke-linejoin:miter;stroke-miterlimit:4;stroke-dasharray:0.99000001, 0.99000001;stroke-dashoffset:0;stroke-opacity:1;marker:none;marker-start:none;marker-mid:none;marker-end:none;paint-order:normal;enable-background:new"
             id="rect1501"
             width="87.009987"
             height="111.01005"
             x="25.084349"
             y="339.24728"
             rx="8.701004"
             ry="7.9292889" />
          <rect
             style="display:inline;opacity:0.1;vector-effect:none;fill:none;fill-opacity:1;stroke:#000000;stroke-width:0.99000001;stroke-linecap:butt;stroke-linejoin:miter;stroke-miterlimit:4;stroke-dasharray:0.99000001, 0.99000001;stroke-dashoffset:0;stroke-opacity:1;marker:none;marker-start:none;marker-mid:none;marker-end:none;paint-order:normal;enable-background:new"
             id="rect1503"
             width="103.00952"
             height="103.00952"
             x="17.084608"
             y="343.24756"
             rx="7.9238095"
             ry="7.9238095" />
          <rect
             style="display:inline;opacity:0.1;vector-effect:none;fill:none;fill-opacity:1;stroke:#000000;stroke-width:0.99000001;stroke-linecap:butt;stroke-linejoin:miter;stroke-miterlimit:4;stroke-dasharray:0.99000001, 0.99000001;stroke-dashoffset:0;stroke-opacity:1;marker:none;marker-start:none;marker-mid:none;marker-end:none;paint-order:normal;enable-background:new"
             id="rect1505"
             width="111.01004"
             height="87.010048"
             x="13.08435"
             y="359.24728"
             rx="7.9292889"
             ry="8.701005" />
          <path
             style="display:inline;fill:none;stroke:#62a0ea;stroke-width:2;stroke-linecap:butt;stroke-linejoin:miter;stroke-miterlimit:4;stroke-dasharray:none;stroke-opacity:1;enable-background:new"
             d="M 4.5893689,447.7523 H 132.58937"
             id="path1507"
             inkscape:connector-curvature="0" />
        </g>
        <g
           transform="translate(-214.58936,-158.75232)"
           id="g1523">
          <rect
             style="display:inline;overflow:visible;visibility:visible;fill:#f0f0f0;fill-opacity:1;fill-rule:nonzero;stroke:none;stroke-width:0.5;marker:none;enable-background:accumulate"
             id="rect1511"
             width="128"
             height="128"
             x="4.5893426"
             y="330.75232"
             inkscape:label="512x512" />
          <circle
             cx="68.589371"
             cy="394.75232"
             r="59.504131"
             id="circle1513"
             style="display:inline;opacity:0.1;vector-effect:none;fill:none;fill-opacity:1;stroke:#000000;stroke-width:0.99000001;stroke-linecap:butt;stroke-linejoin:miter;stroke-miterlimit:4;stroke-dasharray:0.99000001, 0.99000001;stroke-dashoffset:0;stroke-opacity:1;marker:none;marker-start:none;marker-mid:none;marker-end:none;paint-order:normal;enable-background:new" />
          <rect
             ry="7.9292889"
             rx="8.701004"
             y="339.24728"
             x="25.084349"
             height="111.01005"
             width="87.009987"
             id="rect1515"
             style="display:inline;opacity:0.1;vector-effect:none;fill:none;fill-opacity:1;stroke:#000000;stroke-width:0.99000001;stroke-linecap:butt;stroke-linejoin:miter;stroke-miterlimit:4;stroke-dasharray:0.99000001, 0.99000001;stroke-dashoffset:0;stroke-opacity:1;marker:none;marker-start:none;marker-mid:none;marker-end:none;paint-order:normal;enable-background:new" />
          <rect
             ry="7.9238095"
             rx="7.9238095"
             y="343.24756"
             x="17.084608"
             height="103.00952"
             width="103.00952"
             id="rect1517"
             style="display:inline;opacity:0.1;vector-effect:none;fill:none;fill-opacity:1;stroke:#000000;stroke-width:0.99000001;stroke-linecap:butt;stroke-linejoin:miter;stroke-miterlimit:4;stroke-dasharray:0.99000001, 0.99000001;stroke-dashoffset:0;stroke-opacity:1;marker:none;marker-start:none;marker-mid:none;marker-end:none;paint-order:normal;enable-background:new" />
          <rect
             ry="8.701005"
             rx="7.9292889"
             y="359.24728"
             x="13.08435"
             height="87.010048"
             width="111.01004"
             id="rect1519"
             style="display:inline;opacity:0.1;vector-effect:none;fill:none;fill-opacity:1;stroke:#000000;stroke-width:0.99000001;stroke-linecap:butt;stroke-linejoin:miter;stroke-miterlimit:4;stroke-dasharray:0.99000001, 0.99000001;stroke-dashoffset:0;stroke-opacity:1;marker:none;marker-start:none;marker-mid:none;marker-end:none;paint-order:normal;enable-background:new" />
          <path
             inkscape:connector-curvature="0"
             id="path1521"
             d="M 4.5893689,447.7523 H 132.58937"
             style="display:inline;fill:none;stroke:#62a0ea;stroke-width:2;stroke-linecap:butt;stroke-linejoin:miter;stroke-miterlimit:4;stroke-dasharray:none;stroke-opacity:1;enable-background:new" />
        </g>
      </g>
    </g>
    <g
       inkscape:groupmode="layer"
       id="layer9"
       inkscape:label="icons"
       style="display:inline">
      <path
         id="path6"
         style="fill:url(#linearGradient14);stroke-linecap:round;stroke-linejoin:round;paint-order:stroke fill markers;fill-opacity:1"
         transform="matrix(0.4098764,-0.09559311,0.09559311,0.4098764,54.804951,229.34253)"
         d="M 106.36072,128.20773 8.2373625,158.0166 A 44.541366,44.541366 13.045767 0 1 -35.080926,147.97933 L -108.96611,79.104928 a 44.552283,44.552283 72.92771 0 1 -13.05502,-42.50916 l 20.88646,-91.447033 a 44.529963,44.529963 132.816 0 1 30.219186,-32.615479 l 96.476087,-29.926436 a 44.536853,44.536853 12.712871 0 1 43.37478,9.78517 l 75.419467,69.496167 a 44.256747,44.256747 72.762516 0 1 13.1556,42.4006471 L 136.62398,95.735841 a 44.230176,44.230176 132.9837 0 1 -30.26326,32.471889 z"
         inkscape:path-effect="#path-effect9"
         inkscape:original-d="M 130.91084,120.74966 -16.312756,165.47467 -127.73428,61.609587 -95.421523,-79.865084 50.066642,-124.99484 163.22359,-20.725015 Z"
         sodipodi:nodetypes="ccccccc" />
      <path
         id="path9"
         style="fill:#f6f5f4;stroke-linecap:round;stroke-linejoin:round;paint-order:stroke fill markers"
         transform="matrix(0.4098764,-0.09559311,0.09559311,0.4098764,54.804951,225.34253)"
         d="M 106.36072,128.20773 8.2373625,158.0166 A 44.541366,44.541366 13.045767 0 1 -35.080926,147.97933 L -108.96611,79.104928 a 44.552283,44.552283 72.92771 0 1 -13.05502,-42.50916 l 20.88646,-91.447033 a 44.529963,44.529963 132.816 0 1 30.219186,-32.615479 l 96.476087,-29.926436 a 44.536853,44.536853 12.712871 0 1 43.37478,9.78517 l 75.419467,69.496167 a 44.256747,44.256747 72.762516 0 1 13.1556,42.4006471 L 136.62398,95.735841 a 44.230176,44.230176 132.9837 0 1 -30.26326,32.471889 z"
         inkscape:path-effect="#path-effect11"
         inkscape:original-d="M 130.91084,120.74966 -16.312756,165.47467 -127.73428,61.609587 -95.421523,-79.865084 50.066642,-124.99484 163.22359,-20.725015 Z"
         sodipodi:nodetypes="ccccccc" />
      <path
         style="color:#000000;fill:url(#linearGradient22);stroke-linecap:round;stroke-linejoin:bevel;-inkscape-stroke:none;fill-opacity:1"
         d="m 64.197263,246.06445 a 8.9674854,8.9674854 0 0 0 -8.966793,8.96679 8.9674854,8.9674854 0 0 0 8.966793,8.96876 8.9674854,8.9674854 0 0 0 8.968751,-8.96875 8.9674854,8.9674854 0 0 0 -8.968751,-8.9668 z"
         id="path34" />
      <path
         style="color:#000000;fill:url(#linearGradient42);stroke-linecap:round;stroke-linejoin:bevel;-inkscape-stroke:none;fill-opacity:1;font-variation-settings:normal;opacity:1;vector-effect:none;stroke-width:1;stroke-miterlimit:4;stroke-dasharray:none;stroke-dashoffset:0;stroke-opacity:1;stop-color:#000000;stop-opacity:1"
         d="m 64.031248,225.42187 c -8.753593,0 -17.5072,3.32361 -24.156245,9.97266 a 5.1243,5.1243 0 0 0 -7e-6,7.24805 5.1243,5.1243 0 0 0 7.248057,0 c 9.381609,-9.38161 24.43674,-9.38357 33.818357,-0.002 a 5.1243,5.1243 0 0 0 7.246091,0.002 5.1243,5.1243 0 0 0 0,-7.24805 c -6.649052,-6.64905 -15.402659,-9.97266 -24.156253,-9.97266 z"
         id="path33" />
      <path
         style="color:#000000;fill:url(#linearGradient35);stroke-linecap:round;stroke-linejoin:bevel;-inkscape-stroke:none;fill-opacity:1"
         d="m 64.031252,204.92383 c -13.998901,-1e-5 -27.99709,5.32716 -38.648438,15.97851 a 5.1243,5.1243 0 0 0 -7e-6,7.24805 5.1243,5.1243 0 0 0 7.246105,-0.002 c 17.386214,-17.38622 45.418463,-17.38622 62.804685,0 a 5.1243,5.1243 0 0 0 7.248043,0 5.1243,5.1243 0 0 0 0,-7.2461 C 92.030288,210.25099 78.030145,204.92382 64.031252,204.92383 Z"
         id="path13" />
      <path
         id="circle1166"
         style="color:#000000;fill:#ffa348;stroke-linecap:round;stroke-linejoin:bevel;-inkscape-stroke:none"
         d="m 64.031252,202.92382 c -13.998901,0 -27.99709,5.32717 -38.648438,15.97851 a 5.1243,5.1243 0 0 0 -7e-6,7.24805 5.1243,5.1243 0 0 0 7.246105,-0.002 c 17.386214,-17.38621 45.418463,-17.38622 62.804685,0 a 5.1243,5.1243 0 0 0 7.248043,0 5.1243,5.1243 0 0 0 0,-7.24609 C 92.030288,208.25099 78.030145,202.92382 64.031252,202.92382 Z m -4e-6,20.49804 c -8.753593,1e-5 -17.5072,3.32362 -24.156245,9.97266 a 5.1243,5.1243 0 0 0 -7e-6,7.24805 5.1243,5.1243 0 0 0 7.248057,0 c 9.381609,-9.38161 24.43674,-9.38357 33.818357,-0.002 a 5.1243,5.1243 0 0 0 7.246091,0.002 5.1243,5.1243 0 0 0 0,-7.24804 c -6.649052,-6.64905 -15.402659,-9.97266 -24.156253,-9.97267 z m 0.166015,20.64259 a 8.9674854,8.9674854 0 0 0 -8.966793,8.96679 8.9674854,8.9674854 0 0 0 8.966793,8.96876 8.9674854,8.9674854 0 0 0 8.968751,-8.96875 8.9674854,8.9674854 0 0 0 -8.968751,-8.9668 z" />
      <path
         id="path11"
         style="display:inline;vector-effect:none;fill:none;fill-opacity:1;stroke:#e66100;stroke-width:10.2486;stroke-linecap:round;stroke-linejoin:bevel;stroke-miterlimit:4;stroke-dasharray:none;stroke-dashoffset:0;stroke-opacity:1;enable-background:new"
         sodipodi:type="arc"
         sodipodi:cx="34.350258"
         sodipodi:cy="401.58517"
         sodipodi:rx="29.037579"
         sodipodi:ry="29.037579"
         sodipodi:start="4.712389"
         sodipodi:end="0"
         sodipodi:open="true"
         d="m 34.350258,372.5476 a 29.037579,29.037579 0 0 1 29.037578,29.03757"
         sodipodi:arc-type="arc"
         transform="rotate(-45)" />
      <path
         d="m 34.350258,352.05048 a 49.534695,49.534695 0 0 1 49.534695,49.53469"
         sodipodi:open="true"
         sodipodi:end="0"
         sodipodi:start="4.712389"
         sodipodi:ry="49.534695"
         sodipodi:rx="49.534695"
         sodipodi:cy="401.58517"
         sodipodi:cx="34.350258"
         sodipodi:type="arc"
         style="display:inline;vector-effect:none;fill:none;fill-opacity:1;stroke:#e66100;stroke-width:10.2486;stroke-linecap:round;stroke-linejoin:bevel;stroke-miterlimit:4;stroke-dasharray:none;stroke-dashoffset:0;stroke-opacity:1;enable-background:new"
         id="path12"
         sodipodi:arc-type="arc"
         transform="rotate(-45)" />
      <circle
         r="8.9674854"
         cy="255.15501"
         cx="308.41888"
         id="circle12"
         style="display:inline;vector-effect:none;fill:#e66100;fill-opacity:1;stroke:none;stroke-width:25.6215;stroke-linecap:butt;stroke-linejoin:bevel;stroke-miterlimit:4;stroke-dasharray:none;stroke-dashoffset:0;stroke-opacity:1;enable-background:new" />
      <path
         style="color:#000000;fill:#5e5c64;stroke-linecap:round;stroke-linejoin:bevel;-inkscape-stroke:none"
         d="m -11.851563,242.65234 a 1.01908,1.01908 0 0 0 -1.017578,1.01758 1.01908,1.01908 0 0 0 1.017578,1.01953 c 2.6384441,0 4.7558599,2.11742 4.7558599,4.75586 a 1.01908,1.01908 0 0 0 1.0195312,1.01953 1.01908,1.01908 0 0 0 1.0195313,-1.01953 c 0,-3.73994 -3.0549759,-6.79297 -6.7949224,-6.79297 z"
         id="path42"
         transform="rotate(-45)" />
      <path
         style="color:#000000;fill:#5e5c64;stroke-linecap:round;stroke-linejoin:bevel;-inkscape-stroke:none"
         d="m -11.851563,238.57617 a 1.01908,1.01908 0 0 0 -1.017578,1.01758 1.01908,1.01908 0 0 0 1.017578,1.01953 c 4.889636,0 8.8320318,3.9424 8.8320317,8.83203 A 1.01908,1.01908 0 0 0 -2,250.46484 a 1.01908,1.01908 0 0 0 1.01953125,-1.01953 c 0,-5.99114 -4.87995585,-10.86914 -10.87109425,-10.86914 z"
         id="path43"
         transform="rotate(-45)" />
      <circle
         cy="184"
         cx="168"
         id="circle43"
         style="display:inline;vector-effect:none;fill:#5e5c64;fill-opacity:1;stroke:none;stroke-width:5.71427;stroke-linecap:butt;stroke-linejoin:bevel;stroke-miterlimit:4;stroke-dasharray:none;stroke-dashoffset:0;stroke-opacity:1;enable-background:new"
         r="2" />
    </g>
    <g
       inkscape:groupmode="layer"
       id="layer3"
       inkscape:label="grid"
       style="display:inline"
       sodipodi:insensitive="true">
      <circle
         cx="64.000031"
         cy="236"
         r="59.504131"
         id="circle2892"
         style="display:inline;opacity:0.1;vector-effect:none;fill:none;fill-opacity:1;stroke:#000000;stroke-width:0.99000001;stroke-linecap:butt;stroke-linejoin:miter;stroke-miterlimit:4;stroke-dasharray:0.99000001, 0.99000001;stroke-dashoffset:0;stroke-opacity:1;marker:none;marker-start:none;marker-mid:none;marker-end:none;paint-order:normal;enable-background:new" />
      <rect
         ry="7.9292889"
         rx="8.701004"
         y="180.49496"
         x="20.495007"
         height="111.01005"
         width="87.009987"
         id="rect2894"
         style="display:inline;opacity:0.1;vector-effect:none;fill:none;fill-opacity:1;stroke:#000000;stroke-width:0.99000001;stroke-linecap:butt;stroke-linejoin:miter;stroke-miterlimit:4;stroke-dasharray:0.99000001, 0.99000001;stroke-dashoffset:0;stroke-opacity:1;marker:none;marker-start:none;marker-mid:none;marker-end:none;paint-order:normal;enable-background:new" />
      <rect
         ry="7.9238095"
         rx="7.9238095"
         y="184.49524"
         x="12.495266"
         height="103.00952"
         width="103.00952"
         id="rect2896"
         style="display:inline;opacity:0.1;vector-effect:none;fill:none;fill-opacity:1;stroke:#000000;stroke-width:0.99000001;stroke-linecap:butt;stroke-linejoin:miter;stroke-miterlimit:4;stroke-dasharray:0.99000001, 0.99000001;stroke-dashoffset:0;stroke-opacity:1;marker:none;marker-start:none;marker-mid:none;marker-end:none;paint-order:normal;enable-background:new" />
      <rect
         ry="8.701005"
         rx="7.9292889"
         y="200.49496"
         x="8.4950066"
         height="87.010048"
         width="111.01004"
         id="rect2898"
         style="display:inline;opacity:0.1;vector-effect:none;fill:none;fill-opacity:1;stroke:#000000;stroke-width:0.99000001;stroke-linecap:butt;stroke-linejoin:miter;stroke-miterlimit:4;stroke-dasharray:0.99000001, 0.99000001;stroke-dashoffset:0;stroke-opacity:1;marker:none;marker-start:none;marker-mid:none;marker-end:none;paint-order:normal;enable-background:new" />
      <path
         inkscape:connector-curvature="0"
         id="path2900"
         d="M 2.6203015e-5,288.99999 H 128.00003"
         style="display:inline;fill:none;stroke:#62a0ea;stroke-width:2;stroke-linecap:butt;stroke-linejoin:miter;stroke-miterlimit:4;stroke-dasharray:none;stroke-opacity:1;enable-background:new" />
    </g>
  </g>
</svg>
