<?xml version="1.0" encoding="UTF-8" standalone="no"?>
<!-- Created with Inkscape (http://www.inkscape.org/) -->

<svg
   xmlns:dc="http://purl.org/dc/elements/1.1/"
   xmlns:cc="http://creativecommons.org/ns#"
   xmlns:rdf="http://www.w3.org/1999/02/22-rdf-syntax-ns#"
   xmlns:svg="http://www.w3.org/2000/svg"
   xmlns="http://www.w3.org/2000/svg"
   xmlns:xlink="http://www.w3.org/1999/xlink"
   xmlns:sodipodi="http://sodipodi.sourceforge.net/DTD/sodipodi-0.dtd"
   xmlns:inkscape="http://www.inkscape.org/namespaces/inkscape"
   inkscape:export-ydpi="96"
   inkscape:export-xdpi="96"
   inkscape:export-filename="Template.png"
   width="128"
   height="128"
   id="svg11300"
   sodipodi:version="0.32"
   inkscape:version="0.92.4 (5da689c313, 2019-01-14)"
   sodipodi:docname="org.gnome.NetworkDisplays.svg"
   inkscape:output_extension="org.inkscape.output.svg.inkscape"
   version="1.0"
   style="display:inline;enable-background:new"
   viewBox="0 0 128 128"
   enable-background="new">
  <title
     id="title4162">Adwaita Icon Template</title>
  <defs
     id="defs3">
    <linearGradient
       inkscape:collect="always"
       id="linearGradient1246">
      <stop
         style="stop-color:#c0bfbc;stop-opacity:1"
         offset="0"
         id="stop1242" />
      <stop
         style="stop-color:#77767b;stop-opacity:1"
         offset="1"
         id="stop1244" />
    </linearGradient>
    <linearGradient
       inkscape:collect="always"
       id="linearGradient1008">
      <stop
         style="stop-color:#dc8add;stop-opacity:1"
         offset="0"
         id="stop1004" />
      <stop
         style="stop-color:#1c71d8;stop-opacity:1"
         offset="1"
         id="stop1006" />
    </linearGradient>
    <linearGradient
       id="linearGradient4899"
       inkscape:collect="always">
      <stop
         id="stop4895"
         offset="0"
         style="stop-color:#c061cb;stop-opacity:1" />
      <stop
         id="stop4897"
         offset="1"
         style="stop-color:#1c71d8;stop-opacity:1" />
    </linearGradient>
    <linearGradient
       inkscape:collect="always"
       id="linearGradient4887">
      <stop
         style="stop-color:#a347ba;stop-opacity:1"
         offset="0"
         id="stop4883" />
      <stop
         style="stop-color:#c061cb;stop-opacity:0.12598425"
         offset="1"
         id="stop4885" />
    </linearGradient>
    <linearGradient
       id="linearGradient4723"
       inkscape:collect="always">
      <stop
         id="stop4719"
         offset="0"
         style="stop-color:#2ec27e;stop-opacity:1" />
      <stop
         id="stop4721"
         offset="1"
         style="stop-color:#1c71d8;stop-opacity:1" />
    </linearGradient>
    <linearGradient
       inkscape:collect="always"
       id="linearGradient4711">
      <stop
         style="stop-color:#33d17a;stop-opacity:1"
         offset="0"
         id="stop4707" />
      <stop
         style="stop-color:#2dc0af;stop-opacity:0.13779527"
         offset="1"
         id="stop4709" />
    </linearGradient>
    <linearGradient
       y2="236"
       x2="96"
       y1="236"
       x1="32"
       gradientTransform="translate(604.81684,170.58641)"
       gradientUnits="userSpaceOnUse"
       id="linearGradient1099"
       xlink:href="#linearGradient1036" />
    <linearGradient
       id="linearGradient1036">
      <stop
         id="stop1032"
         offset="0"
         style="stop-color:#d5d3cf;stop-opacity:1;" />
      <stop
         id="stop1034"
         offset="1"
         style="stop-color:#f6f5f4;stop-opacity:1" />
    </linearGradient>
    <radialGradient
       r="32"
       fy="-76"
       fx="-244"
       cy="-76"
       cx="-244"
       gradientTransform="matrix(0.88333331,0,0,0.88333331,-460.35018,463.11973)"
       gradientUnits="userSpaceOnUse"
       id="radialGradient1103"
       xlink:href="#linearGradient1069" />
    <linearGradient
       id="linearGradient1069">
      <stop
         id="stop1065"
         offset="0"
         style="stop-color:#d5d3cf;stop-opacity:1" />
      <stop
         id="stop1067-1"
         offset="1"
         style="stop-color:#949390;stop-opacity:1" />
    </linearGradient>
    <linearGradient
       gradientUnits="userSpaceOnUse"
       y2="232"
       x2="64"
       y1="262.5"
       x1="64"
       id="linearGradient1027"
       xlink:href="#linearGradient1025"
       gradientTransform="translate(-470.5864,432.81685)" />
    <linearGradient
       id="linearGradient1025">
      <stop
         id="stop1021"
         offset="0"
         style="stop-color:#9a9996;stop-opacity:1" />
      <stop
         id="stop1023"
         offset="1"
         style="stop-color:#77767b;stop-opacity:1" />
    </linearGradient>
    <inkscape:path-effect
       effect="spiro"
       id="path-effect35304-9"
       is_visible="true" />
    <clipPath
       clipPathUnits="userSpaceOnUse"
       id="clipPath1609-7">
      <path
         sodipodi:nodetypes="cccccc"
         inkscape:connector-curvature="0"
         id="path1611-5"
         d="m 252,116 28,-28 v -8 h -36 v 36 z"
         style="fill:#e74747;stroke:none;stroke-width:0.25px;stroke-linecap:butt;stroke-linejoin:miter;stroke-opacity:1" />
    </clipPath>
    <filter
       inkscape:collect="always"
       style="color-interpolation-filters:sRGB"
       id="filter2667">
      <feBlend
         inkscape:collect="always"
         mode="multiply"
         in2="BackgroundImage"
         id="feBlend2669" />
    </filter>
    <radialGradient
       inkscape:collect="always"
       xlink:href="#linearGradient4887"
       id="radialGradient1020"
       gradientUnits="userSpaceOnUse"
       gradientTransform="matrix(0.28412699,0,0,0.58637858,-6.586177,131.736)"
       cx="340.17206"
       cy="275.12399"
       fx="340.17206"
       fy="275.12399"
       r="225" />
    <radialGradient
       inkscape:collect="always"
       xlink:href="#linearGradient1008"
       id="radialGradient1018"
       gradientUnits="userSpaceOnUse"
       gradientTransform="matrix(0.24888885,0,0,0.37442716,5.4518574,248.7292)"
       cx="100.2743"
       cy="-60.347862"
       fx="100.2743"
       fy="-60.347862"
       r="225" />
    <linearGradient
       inkscape:collect="always"
       xlink:href="#linearGradient1078"
       id="linearGradient1064"
       gradientUnits="userSpaceOnUse"
       gradientTransform="matrix(0.25,0,0,0.25,-14.14897,400.34849)"
       x1="88.595886"
       y1="-449.39401"
       x2="536.59589"
       y2="-449.39401" />
    <linearGradient
       id="linearGradient1078"
       inkscape:collect="always">
      <stop
         id="stop1066"
         offset="0"
         style="stop-color:#77767b;stop-opacity:1" />
      <stop
         style="stop-color:#c0bfbc;stop-opacity:1"
         offset="0.03571429"
         id="stop1068" />
      <stop
         id="stop1070"
         offset="0.07136531"
         style="stop-color:#9a9996;stop-opacity:1" />
      <stop
         style="stop-color:#9a9996;stop-opacity:1"
         offset="0.9285714"
         id="stop1072" />
      <stop
         id="stop1074"
         offset="0.96428573"
         style="stop-color:#c0bfbc;stop-opacity:1" />
      <stop
         id="stop1076"
         offset="1"
         style="stop-color:#77767b;stop-opacity:1" />
    </linearGradient>
    <radialGradient
       inkscape:collect="always"
       xlink:href="#linearGradient4711"
       id="radialGradient4731"
       gradientUnits="userSpaceOnUse"
       gradientTransform="matrix(0.28412699,0,0,0.58637858,-6.5861773,131.736)"
       cx="207.02663"
       cy="77.961334"
       fx="207.02663"
       fy="77.961334"
       r="225" />
    <linearGradient
       inkscape:collect="always"
       xlink:href="#linearGradient1078"
       id="linearGradient4749"
       gradientUnits="userSpaceOnUse"
       gradientTransform="matrix(0.25,0,0,0.25,-134.14897,400.34849)"
       x1="88.595886"
       y1="-449.39401"
       x2="536.59589"
       y2="-449.39401" />
    <radialGradient
       inkscape:collect="always"
       xlink:href="#linearGradient4723"
       id="radialGradient4751"
       gradientUnits="userSpaceOnUse"
       gradientTransform="matrix(0.21428571,0,0,0.32237036,-110.85714,245.58768)"
       cx="106.66667"
       cy="-60.347851"
       fx="106.66667"
       fy="-60.347851"
       r="225" />
    <radialGradient
       inkscape:collect="always"
       xlink:href="#linearGradient4711"
       id="radialGradient4753"
       gradientUnits="userSpaceOnUse"
       gradientTransform="matrix(0.28412699,0,0,0.58637858,-126.58618,131.736)"
       cx="340.17206"
       cy="275.12399"
       fx="340.17206"
       fy="275.12399"
       r="225" />
    <linearGradient
       inkscape:collect="always"
       xlink:href="#linearGradient1078"
       id="linearGradient998"
       gradientUnits="userSpaceOnUse"
       gradientTransform="matrix(0.25,0,0,0.25,-14.14897,400.34849)"
       x1="88.595886"
       y1="-449.39401"
       x2="536.59589"
       y2="-449.39401" />
    <radialGradient
       inkscape:collect="always"
       xlink:href="#linearGradient4899"
       id="radialGradient1000"
       gradientUnits="userSpaceOnUse"
       gradientTransform="matrix(0.24888885,0,0,0.37442716,5.4518574,248.7292)"
       cx="100.2743"
       cy="-60.347862"
       fx="100.2743"
       fy="-60.347862"
       r="225" />
    <radialGradient
       inkscape:collect="always"
       xlink:href="#linearGradient4887"
       id="radialGradient1002"
       gradientUnits="userSpaceOnUse"
       gradientTransform="matrix(0.28412699,0,0,0.58637858,-6.586177,131.736)"
       cx="340.17206"
       cy="275.12399"
       fx="340.17206"
       fy="275.12399"
       r="225" />
    <linearGradient
       id="linearGradient3723"
       inkscape:collect="always">
      <stop
         id="stop3719"
         offset="0"
         style="stop-color:#f6f5f4;stop-opacity:1" />
      <stop
         id="stop3721"
         offset="1"
         style="stop-color:#deddda;stop-opacity:1" />
    </linearGradient>
    <linearGradient
       inkscape:collect="always"
       xlink:href="#linearGradient1246"
       id="linearGradient1192"
       gradientUnits="userSpaceOnUse"
       gradientTransform="translate(10,-1.4e-5)"
       x1="42"
       y1="290"
       x2="42"
       y2="274" />
    <linearGradient
       inkscape:collect="always"
       xlink:href="#linearGradient3723"
       id="linearGradient1194"
       gradientUnits="userSpaceOnUse"
       gradientTransform="translate(20,3.999986)"
       x1="66"
       y1="284"
       x2="66"
       y2="288" />
    <linearGradient
       inkscape:collect="always"
       xlink:href="#linearGradient1078"
       id="linearGradient1226"
       gradientUnits="userSpaceOnUse"
       gradientTransform="matrix(0.25,0,0,0.25,-14.14897,400.34849)"
       x1="88.595886"
       y1="-449.39401"
       x2="536.59589"
       y2="-449.39401" />
    <radialGradient
       inkscape:collect="always"
       xlink:href="#linearGradient1008"
       id="radialGradient1228"
       gradientUnits="userSpaceOnUse"
       gradientTransform="matrix(0.24888885,0,0,0.37442716,5.4518574,248.7292)"
       cx="100.2743"
       cy="-60.347862"
       fx="100.2743"
       fy="-60.347862"
       r="225" />
    <radialGradient
       inkscape:collect="always"
       xlink:href="#linearGradient4887"
       id="radialGradient1230"
       gradientUnits="userSpaceOnUse"
       gradientTransform="matrix(0.28412699,0,0,0.58637858,-6.586177,131.736)"
       cx="340.17206"
       cy="275.12399"
       fx="340.17206"
       fy="275.12399"
       r="225" />
  </defs>
  <sodipodi:namedview
     stroke="#ef2929"
     fill="#f57900"
     id="base"
     pagecolor="#ffffff"
     bordercolor="#666666"
     borderopacity="0.25490196"
     inkscape:pageopacity="0.0"
     inkscape:pageshadow="2"
     inkscape:zoom="4"
     inkscape:cx="-2.2566984"
     inkscape:cy="42.488464"
     inkscape:current-layer="layer9"
     showgrid="true"
     inkscape:grid-bbox="true"
     inkscape:document-units="px"
     inkscape:showpageshadow="false"
     inkscape:window-width="1920"
     inkscape:window-height="1016"
     inkscape:window-x="1600"
     inkscape:window-y="27"
     width="400px"
     height="300px"
     inkscape:snap-nodes="true"
     inkscape:snap-bbox="true"
     objecttolerance="7"
     gridtolerance="12"
     guidetolerance="13"
     inkscape:window-maximized="1"
     inkscape:pagecheckerboard="false"
     showguides="false"
     inkscape:guide-bbox="true"
     inkscape:locked="false"
     inkscape:measure-start="0,0"
     inkscape:measure-end="0,0"
     inkscape:object-nodes="true"
     inkscape:bbox-nodes="true"
     inkscape:snap-global="true"
     inkscape:object-paths="true"
     inkscape:snap-intersection-paths="true"
     inkscape:snap-bbox-edge-midpoints="true"
     inkscape:snap-bbox-midpoints="true"
     showborder="false"
     inkscape:snap-center="true"
     inkscape:snap-object-midpoints="true"
     inkscape:snap-midpoints="true"
     inkscape:snap-smooth-nodes="true"
     inkscape:snap-text-baseline="true">
    <inkscape:grid
       type="xygrid"
       id="grid5883"
       spacingx="2"
       spacingy="2"
       enabled="true"
       visible="true"
       empspacing="4"
       originx="0"
       originy="0" />
    <sodipodi:guide
       position="64,8"
       orientation="0,1"
       id="guide1073"
       inkscape:locked="false"
       inkscape:label=""
       inkscape:color="rgb(0,0,255)" />
    <sodipodi:guide
       position="12,64"
       orientation="1,0"
       id="guide1075"
       inkscape:locked="false"
       inkscape:label=""
       inkscape:color="rgb(0,0,255)" />
    <sodipodi:guide
       position="64,104"
       orientation="0,1"
       id="guide1099"
       inkscape:locked="false"
       inkscape:label=""
       inkscape:color="rgb(0,0,255)" />
    <sodipodi:guide
       position="64,128"
       orientation="0,1"
       id="guide993"
       inkscape:locked="false"
       inkscape:label=""
       inkscape:color="rgb(0,0,255)" />
    <sodipodi:guide
       position="104,64"
       orientation="1,0"
       id="guide995"
       inkscape:locked="false"
       inkscape:label=""
       inkscape:color="rgb(0,0,255)" />
    <sodipodi:guide
       position="9.2651362e-08,64"
       orientation="1,0"
       id="guide867"
       inkscape:locked="false"
       inkscape:label=""
       inkscape:color="rgb(0,0,255)" />
    <sodipodi:guide
       position="120,64"
       orientation="1,0"
       id="guide869"
       inkscape:locked="false"
       inkscape:label=""
       inkscape:color="rgb(0,0,255)" />
    <sodipodi:guide
       position="64,116"
       orientation="0,1"
       id="guide871"
       inkscape:locked="false"
       inkscape:label=""
       inkscape:color="rgb(0,0,255)" />
    <inkscape:grid
       type="xygrid"
       id="grid873"
       spacingx="1"
       spacingy="1"
       empspacing="8"
       color="#000000"
       opacity="0.49019608"
       empcolor="#000000"
       empopacity="0.08627451"
       dotted="true" />
    <sodipodi:guide
       position="24,64"
       orientation="1,0"
       id="guide877"
       inkscape:locked="false"
       inkscape:label=""
       inkscape:color="rgb(0,0,255)" />
    <sodipodi:guide
       position="116,64"
       orientation="1,0"
       id="guide879"
       inkscape:locked="false"
       inkscape:label=""
       inkscape:color="rgb(0,0,255)" />
    <sodipodi:guide
       position="64,120"
       orientation="0,1"
       id="guide881"
       inkscape:locked="false"
       inkscape:label=""
       inkscape:color="rgb(0,0,255)" />
    <sodipodi:guide
       position="64,12"
       orientation="0,1"
       id="guide883"
       inkscape:locked="false"
       inkscape:label=""
       inkscape:color="rgb(0,0,255)" />
    <sodipodi:guide
       position="8,64"
       orientation="1,0"
       id="guide885"
       inkscape:locked="false"
       inkscape:label=""
       inkscape:color="rgb(0,0,255)" />
    <sodipodi:guide
       position="128,64"
       orientation="1,0"
       id="guide887"
       inkscape:locked="false"
       inkscape:label=""
       inkscape:color="rgb(0,0,255)" />
    <sodipodi:guide
       position="64,0"
       orientation="0,1"
       id="guide897"
       inkscape:locked="false"
       inkscape:label=""
       inkscape:color="rgb(0,0,255)" />
    <sodipodi:guide
       position="64,24"
       orientation="0,1"
       id="guide899"
       inkscape:locked="false"
       inkscape:label=""
       inkscape:color="rgb(0,0,255)" />
    <sodipodi:guide
       position="256,256"
       orientation="-0.70710678,0.70710678"
       id="guide950"
       inkscape:locked="false"
       inkscape:label=""
       inkscape:color="rgb(0,0,255)" />
    <sodipodi:guide
       position="64,64"
       orientation="0.70710678,0.70710678"
       id="guide952"
       inkscape:locked="false"
       inkscape:label=""
       inkscape:color="rgb(0,0,255)" />
  </sodipodi:namedview>
  <metadata
     id="metadata4">
    <rdf:RDF>
      <cc:Work
         rdf:about="">
        <dc:format>image/svg+xml</dc:format>
        <dc:type
           rdf:resource="http://purl.org/dc/dcmitype/StillImage" />
        <dc:creator>
          <cc:Agent>
            <dc:title>GNOME Design Team</dc:title>
          </cc:Agent>
        </dc:creator>
        <dc:source />
        <cc:license
           rdf:resource="http://creativecommons.org/licenses/by-sa/4.0/" />
        <dc:title>Adwaita Icon Template</dc:title>
        <dc:subject>
          <rdf:Bag />
        </dc:subject>
        <dc:date />
        <dc:rights>
          <cc:Agent>
            <dc:title />
          </cc:Agent>
        </dc:rights>
        <dc:publisher>
          <cc:Agent>
            <dc:title />
          </cc:Agent>
        </dc:publisher>
        <dc:identifier />
        <dc:relation />
        <dc:language />
        <dc:coverage />
        <dc:description />
        <dc:contributor>
          <cc:Agent>
            <dc:title />
          </cc:Agent>
        </dc:contributor>
      </cc:Work>
      <cc:License
         rdf:about="http://creativecommons.org/licenses/by-sa/4.0/">
        <cc:permits
           rdf:resource="http://creativecommons.org/ns#Reproduction" />
        <cc:permits
           rdf:resource="http://creativecommons.org/ns#Distribution" />
        <cc:requires
           rdf:resource="http://creativecommons.org/ns#Notice" />
        <cc:requires
           rdf:resource="http://creativecommons.org/ns#Attribution" />
        <cc:permits
           rdf:resource="http://creativecommons.org/ns#DerivativeWorks" />
        <cc:requires
           rdf:resource="http://creativecommons.org/ns#ShareAlike" />
      </cc:License>
    </rdf:RDF>
  </metadata>
  <g
     id="layer1"
     inkscape:label="App Icon"
     inkscape:groupmode="layer"
     style="display:inline"
     transform="translate(0,-172)">
    <g
       inkscape:groupmode="layer"
       id="layer2"
       inkscape:label="baseplate"
       style="display:none"
       sodipodi:insensitive="true">
      <g
         style="display:inline;fill:#000000;enable-background:new"
         transform="matrix(7.9911709,0,0,8.0036407,-167.7909,-4846.0776)"
         id="g12027"
         inkscape:export-xdpi="12"
         inkscape:export-ydpi="12" />
      <rect
         style="display:inline;overflow:visible;visibility:visible;fill:#f0f0f0;fill-opacity:1;fill-rule:nonzero;stroke:none;stroke-width:0.5;marker:none;enable-background:accumulate"
         id="rect13805"
         width="128"
         height="128"
         x="9.2651362e-08"
         y="172"
         inkscape:label="512x512" />
      <g
         id="g883"
         style="fill:none;fill-opacity:0.25098039;stroke:#a579b3;stroke-opacity:1"
         transform="translate(-24,24)" />
      <g
         id="g900"
         style="fill:none;fill-opacity:0.25098039;stroke:#a579b3;stroke-opacity:1"
         transform="translate(-24,24)" />
      <rect
         inkscape:label="512x512"
         y="172"
         x="160"
         height="16"
         width="16"
         id="rect859"
         style="display:inline;overflow:visible;visibility:visible;fill:#f0f0f0;fill-opacity:1;fill-rule:nonzero;stroke:none;stroke-width:0.5;marker:none;enable-background:accumulate" />
      <text
         xml:space="preserve"
         style="font-style:normal;font-variant:normal;font-weight:bold;font-stretch:normal;font-size:4px;line-height:125%;font-family:Cantarell;-inkscape-font-specification:'Cantarell, Bold';text-align:start;writing-mode:lr-tb;text-anchor:start;display:inline;fill:#000000;fill-opacity:1;stroke:none;stroke-width:0.33264872;enable-background:new"
         x="0"
         y="164"
         id="text863"
         inkscape:label="icon-name"><tspan
           style="font-size:4px;stroke-width:0.33264872"
           sodipodi:role="line"
           id="tspan861"
           x="0"
           y="164">Hicolor</tspan></text>
      <text
         inkscape:label="icon-name"
         id="text867"
         y="164"
         x="160"
         style="font-style:normal;font-variant:normal;font-weight:bold;font-stretch:normal;font-size:4px;line-height:125%;font-family:Cantarell;-inkscape-font-specification:'Cantarell, Bold';text-align:start;writing-mode:lr-tb;text-anchor:start;display:inline;fill:#000000;fill-opacity:1;stroke:none;stroke-width:0.33264872;enable-background:new"
         xml:space="preserve"><tspan
           y="164"
           x="160"
           id="tspan865"
           sodipodi:role="line"
           style="font-size:4px;stroke-width:0.33264872">Symbolic</tspan></text>
    </g>
    <g
       inkscape:groupmode="layer"
       id="layer9"
       inkscape:label="icons"
       style="display:inline">
      <rect
         style="opacity:1;vector-effect:none;fill:#1a5fb4;fill-opacity:1;stroke:none;stroke-width:2;stroke-linecap:round;stroke-linejoin:round;stroke-miterlimit:4;stroke-dasharray:none;stroke-dashoffset:0;stroke-opacity:1"
         id="rect4725"
         width="0"
         height="0"
         x="0"
         y="0"
         transform="translate(0,172)" />
      <g
         id="g4763"
         transform="translate(-150)">
        <rect
           ry="8"
           rx="7.9999995"
           y="212"
           x="-112"
           height="76"
           width="112.00001"
           id="rect4733"
           style="display:inline;opacity:1;vector-effect:none;fill:url(#linearGradient4749);fill-opacity:1;stroke:none;stroke-width:0.25;stroke-linecap:butt;stroke-linejoin:miter;stroke-miterlimit:4;stroke-dasharray:none;stroke-dashoffset:0;stroke-opacity:1;marker:none;marker-start:none;marker-mid:none;marker-end:none;paint-order:normal;enable-background:new" />
        <rect
           style="display:inline;opacity:1;vector-effect:none;fill:#deddda;fill-opacity:1;stroke:none;stroke-width:0.25;stroke-linecap:butt;stroke-linejoin:miter;stroke-miterlimit:4;stroke-dasharray:none;stroke-dashoffset:0;stroke-opacity:1;marker:none;marker-start:none;marker-mid:none;marker-end:none;paint-order:normal;enable-background:new"
           id="rect4735"
           width="112.00001"
           height="84"
           x="-112"
           y="200.00002"
           rx="7.9999995"
           ry="8" />
        <rect
           rx="4"
           style="display:inline;opacity:1;vector-effect:none;fill:#241f31;fill-opacity:1;stroke:none;stroke-width:0.01129821px;stroke-linecap:butt;stroke-linejoin:miter;stroke-miterlimit:4;stroke-dasharray:none;stroke-dashoffset:0;stroke-opacity:1;marker:none;marker-start:none;marker-mid:none;marker-end:none;paint-order:normal;enable-background:new"
           id="rect4737"
           width="104"
           height="76"
           x="-108"
           y="204.00002"
           ry="4" />
        <rect
           y="208"
           x="-104"
           height="68"
           width="96"
           id="rect4739"
           style="display:inline;opacity:1;vector-effect:none;fill:url(#radialGradient4751);fill-opacity:1;stroke:none;stroke-width:0.50000006;stroke-linecap:butt;stroke-linejoin:bevel;stroke-miterlimit:4;stroke-dasharray:0.49999998, 1.00000001;stroke-dashoffset:0;stroke-opacity:0.94881891;marker:none;marker-start:none;marker-mid:none;marker-end:none;paint-order:normal;enable-background:new" />
        <rect
           style="display:inline;opacity:0.5;vector-effect:none;fill:url(#radialGradient4753);fill-opacity:1;stroke:none;stroke-width:0.50000006;stroke-linecap:butt;stroke-linejoin:bevel;stroke-miterlimit:4;stroke-dasharray:0.49999998, 1.00000001;stroke-dashoffset:0;stroke-opacity:0.94881891;marker:none;marker-start:none;marker-mid:none;marker-end:none;paint-order:normal;enable-background:new"
           id="rect4741"
           width="96"
           height="68"
           x="-104"
           y="208" />
        <g
           style="display:inline;enable-background:new"
           transform="matrix(3,0,0,3,-290.0006,-1249)"
           inkscape:label="network-wireless-signal-excellent"
           id="g4747">
          <rect
             transform="rotate(-90)"
             y="70.000198"
             x="-505"
             height="16"
             width="16"
             id="rect4743"
             style="color:#bebebe;display:inline;overflow:visible;visibility:visible;fill:none;stroke:none;stroke-width:1;marker:none"
             clip-path="none" />
          <path
             style="display:inline;fill:#ffffff;fill-opacity:1;stroke:none;stroke-width:3.99999905"
             clip-path="none"
             d="m 69.5,52.5 c -5.62844,0 -10.34346,2.000735 -14,5.171875 V 60.5 h 2.960938 c 3.038559,-2.52932 6.439222,-4 11.039062,-4 4.59984,0 8.000503,1.55906 11.039062,4 H 83.5 V 57.738281 C 80.21912,54.806781 75.12844,52.5 69.5,52.5 Z m 0,6 c -4.33328,0 -8.03964,1.47756 -10,4 v 2 h 4 c 1.57756,-1.21304 3.51774,-2 6,-2 2.48226,0 4.43876,0.78696 6,2 h 4 v -2 c -1.98956,-2.4458 -5.7468,-4 -10,-4 z m 0,6 c -2.51466,0 -4.43142,0.6233 -6,2 v 2 h 6 0.75 5.25 v -2 c -1.6738,-1.34412 -3.48534,-2 -6,-2 z m 0,6 a 3.999999,3.999999 0 0 0 -4,4 3.999999,3.999999 0 0 0 4,4 3.999999,3.999999 0 0 0 4,-4 3.999999,3.999999 0 0 0 -4,-4 z"
             transform="matrix(0.5,0,0,0.5,43.250202,464.75)"
             id="path4745"
             inkscape:connector-curvature="0" />
        </g>
      </g>
      <rect
         clip-path="none"
         style="color:#bebebe;display:inline;overflow:visible;visibility:visible;fill:none;stroke:none;stroke-width:1;marker:none"
         id="rect6303-6"
         width="16"
         height="16"
         x="-188"
         y="160"
         transform="rotate(-90)" />
      <g
         id="g936"
         inkscape:label="network-wireless-signal-excellent"
         transform="translate(119.9998,-317)"
         style="display:inline;enable-background:new">
        <rect
           clip-path="none"
           style="color:#bebebe;display:inline;overflow:visible;visibility:visible;fill:none;stroke:none;stroke-width:1;marker:none"
           id="rect932"
           width="16"
           height="16"
           x="-505"
           y="70.000198"
           transform="rotate(-90)" />
        <path
           inkscape:connector-curvature="0"
           id="path934"
           transform="matrix(0.5,0,0,0.5,43.250202,464.75)"
           d="m 69.5,52.5 c -5.62844,0 -10.34346,2.000735 -14,5.171875 V 60.5 h 2.960938 c 3.038559,-2.52932 6.439222,-4 11.039062,-4 4.59984,0 8.000503,1.55906 11.039062,4 H 83.5 V 57.738281 C 80.21912,54.806781 75.12844,52.5 69.5,52.5 Z m 0,6 c -4.33328,0 -8.03964,1.47756 -10,4 v 2 h 4 c 1.57756,-1.21304 3.51774,-2 6,-2 2.48226,0 4.43876,0.78696 6,2 h 4 v -2 c -1.98956,-2.4458 -5.7468,-4 -10,-4 z m 0,6 c -2.51466,0 -4.43142,0.6233 -6,2 v 2 h 6 0.75 5.25 v -2 c -1.6738,-1.34412 -3.48534,-2 -6,-2 z m 0,6 a 3.999999,3.999999 0 0 0 -4,4 3.999999,3.999999 0 0 0 4,4 3.999999,3.999999 0 0 0 4,-4 3.999999,3.999999 0 0 0 -4,-4 z"
           clip-path="none"
           style="display:inline;fill:#241f31;fill-opacity:1;stroke:none;stroke-width:3.99999905" />
      </g>
      <path
         style="opacity:1;vector-effect:none;fill:#241f31;fill-opacity:1;stroke:none;stroke-width:1;stroke-linecap:square;stroke-linejoin:round;stroke-miterlimit:4;stroke-dasharray:none;stroke-dashoffset:0;stroke-opacity:1"
         d="M 162 2 C 160.892 2 160 2.892 160 4 L 160 12 C 160 13.108 160.892 14 162 14 L 167 14 L 167 12 L 162 12 L 162 4 L 174 4 L 174 6 L 176 6 L 176 4 C 176 2.892 175.108 2 174 2 L 162 2 z "
         transform="translate(0,172)"
         id="path952" />
      <rect
         transform="rotate(-90)"
         y="190"
         x="-218"
         height="16"
         width="16"
         id="rect962"
         style="color:#bebebe;display:inline;overflow:visible;visibility:visible;fill:none;stroke:none;stroke-width:1;marker:none"
         clip-path="none" />
      <path
         sodipodi:nodetypes="scccscccssccccccssssss"
         style="display:inline;fill:#241f31;fill-opacity:1;stroke:none;stroke-width:1.99999952"
         clip-path="none"
         d="m 198,205 c -2.16664,0 -4.01982,0.73878 -5,2 v 1 h 2 c 0.78878,-0.60652 1.75887,-1 3,-1 1.24113,0 2.21938,0.39348 3,1 h 2 v -1 c -0.99478,-1.2229 -2.8734,-2 -5,-2 z m 0,3 c -1.25733,0 -2.21571,0.31165 -3,1 v 1 h 3 0.375 2.625 v -1 c -0.8369,-0.67206 -1.74267,-1 -3,-1 z m 0,3 c -1.10457,0 -2,0.89543 -2,2 0,1.10457 0.89543,2 2,2 1.10457,0 2,-0.89543 2,-2 0,-1.10457 -0.89543,-2 -2,-2 z"
         id="path964"
         inkscape:connector-curvature="0" />
      <path
         sodipodi:nodetypes="cssccccccccccc"
         inkscape:connector-curvature="0"
         id="path966"
         d="m 192,202 c -1.108,0 -2,0.892 -2,2 v 12 c 0,1.108 0.892,2 2,2 4,0 8,0 12,0 1.108,0 2,-0.892 2,-2 v -12 c 0,-1.108 -0.892,-2 -2,-2 z m 0,2 h 12 c 0,4 0,8 0,12 -4,0 -8,0 -12,0 z"
         style="opacity:1;vector-effect:none;fill:#241f31;fill-opacity:1;stroke:none;stroke-width:1;stroke-linecap:square;stroke-linejoin:round;stroke-miterlimit:4;stroke-dasharray:none;stroke-dashoffset:0;stroke-opacity:1" />
      <path
         inkscape:connector-curvature="0"
         id="path6305-7"
         d="m 171,178 c -2.16664,0 -4.01982,0.73878 -5,2 v 1 h 2 c 0.78878,-0.60652 1.75887,-1 3,-1 1.24113,0 2.21938,0.39348 3,1 h 2 v -1 c -0.99478,-1.2229 -2.8734,-2 -5,-2 z m 0,3 c -1.25733,0 -2.21571,0.31165 -3,1 v 1 h 3 0.375 2.625 v -1 c -0.8369,-0.67206 -1.74267,-1 -3,-1 z m 0,3 c -1.10457,0 -2,0.89543 -2,2 0,1.10457 0.89543,2 2,2 1.10457,0 2,-0.89543 2,-2 0,-1.10457 -0.89543,-2 -2,-2 z"
         clip-path="none"
         style="display:inline;fill:#241f31;fill-opacity:1;stroke:none;stroke-width:1.99999952"
         sodipodi:nodetypes="scccscccssccccccssssss" />
      <g
         id="g996"
         transform="translate(-420)">
        <rect
           ry="8"
           rx="7.9999995"
           y="212"
           x="8"
           height="76"
           width="112.00001"
           id="rect972"
           style="display:inline;opacity:1;vector-effect:none;fill:url(#linearGradient998);fill-opacity:1;stroke:none;stroke-width:0.25;stroke-linecap:butt;stroke-linejoin:miter;stroke-miterlimit:4;stroke-dasharray:none;stroke-dashoffset:0;stroke-opacity:1;marker:none;marker-start:none;marker-mid:none;marker-end:none;paint-order:normal;enable-background:new" />
        <rect
           style="display:inline;opacity:1;vector-effect:none;fill:#deddda;fill-opacity:1;stroke:none;stroke-width:0.25;stroke-linecap:butt;stroke-linejoin:miter;stroke-miterlimit:4;stroke-dasharray:none;stroke-dashoffset:0;stroke-opacity:1;marker:none;marker-start:none;marker-mid:none;marker-end:none;paint-order:normal;enable-background:new"
           id="rect974"
           width="112.00001"
           height="84"
           x="8"
           y="200.00002"
           rx="7.9999995"
           ry="8" />
        <rect
           rx="4"
           style="display:inline;opacity:1;vector-effect:none;fill:#241f31;fill-opacity:1;stroke:none;stroke-width:0.01129821px;stroke-linecap:butt;stroke-linejoin:miter;stroke-miterlimit:4;stroke-dasharray:none;stroke-dashoffset:0;stroke-opacity:1;marker:none;marker-start:none;marker-mid:none;marker-end:none;paint-order:normal;enable-background:new"
           id="rect976"
           width="104"
           height="76"
           x="12"
           y="204.00002"
           ry="4" />
        <rect
           y="208"
           x="16"
           height="68"
           width="96"
           id="rect978"
           style="display:inline;opacity:1;vector-effect:none;fill:url(#radialGradient1000);fill-opacity:1;stroke:none;stroke-width:0.50000006;stroke-linecap:butt;stroke-linejoin:bevel;stroke-miterlimit:4;stroke-dasharray:0.49999998, 1.00000001;stroke-dashoffset:0;stroke-opacity:0.94881891;marker:none;marker-start:none;marker-mid:none;marker-end:none;paint-order:normal;enable-background:new" />
        <rect
           style="display:inline;opacity:0.753;vector-effect:none;fill:url(#radialGradient1002);fill-opacity:1;stroke:none;stroke-width:0.50000006;stroke-linecap:butt;stroke-linejoin:bevel;stroke-miterlimit:4;stroke-dasharray:0.49999998, 1.00000001;stroke-dashoffset:0;stroke-opacity:0.94881891;marker:none;marker-start:none;marker-mid:none;marker-end:none;paint-order:normal;enable-background:new"
           id="rect980"
           width="96"
           height="68"
           x="16"
           y="208" />
        <g
           style="display:inline;enable-background:new"
           transform="matrix(3,0,0,3,-170.0006,-1249)"
           inkscape:label="network-wireless-signal-excellent"
           id="g986">
          <rect
             transform="rotate(-90)"
             y="70.000198"
             x="-505"
             height="16"
             width="16"
             id="rect982"
             style="color:#bebebe;display:inline;overflow:visible;visibility:visible;fill:none;stroke:none;stroke-width:1;marker:none"
             clip-path="none" />
          <path
             style="display:inline;fill:#ffffff;fill-opacity:1;stroke:none;stroke-width:3.99999905"
             clip-path="none"
             d="m 69.5,52.5 c -5.62844,0 -10.34346,2.000735 -14,5.171875 V 60.5 h 2.960938 c 3.038559,-2.52932 6.439222,-4 11.039062,-4 4.59984,0 8.000503,1.55906 11.039062,4 H 83.5 V 57.738281 C 80.21912,54.806781 75.12844,52.5 69.5,52.5 Z m 0,6 c -4.33328,0 -8.03964,1.47756 -10,4 v 2 h 4 c 1.57756,-1.21304 3.51774,-2 6,-2 2.48226,0 4.43876,0.78696 6,2 h 4 v -2 c -1.98956,-2.4458 -5.7468,-4 -10,-4 z m 0,6 c -2.51466,0 -4.43142,0.6233 -6,2 v 2 h 6 0.75 5.25 v -2 c -1.6738,-1.34412 -3.48534,-2 -6,-2 z m 0,6 a 3.999999,3.999999 0 0 0 -4,4 3.999999,3.999999 0 0 0 4,4 3.999999,3.999999 0 0 0 4,-4 3.999999,3.999999 0 0 0 -4,-4 z"
             transform="matrix(0.5,0,0,0.5,43.250202,464.75)"
             id="path984"
             inkscape:connector-curvature="0" />
        </g>
      </g>
      <g
         id="g1198"
         transform="translate(-9.9999962)">
        <rect
           y="264"
           x="44"
           height="28"
           width="60"
           id="rect1188"
           style="display:inline;opacity:1;fill:url(#linearGradient1192);fill-opacity:1;stroke:none;stroke-width:0.25;stroke-linecap:butt;stroke-linejoin:miter;stroke-miterlimit:4;stroke-dasharray:none;stroke-dashoffset:0;stroke-opacity:1;marker:none;marker-start:none;marker-mid:none;marker-end:none;paint-order:normal;enable-background:new" />
        <path
           sodipodi:nodetypes="ccccc"
           inkscape:connector-curvature="0"
           id="path1190"
           d="m 42,287.99998 h 64.0625 c 1.9375,0 3.9375,2 3.9375,4 H 38 c 0,-2 2,-4 4,-4 z"
           style="display:inline;opacity:1;fill:url(#linearGradient1194);fill-opacity:1;stroke:none;stroke-width:4.99999952;stroke-linecap:square;stroke-linejoin:miter;stroke-miterlimit:4;stroke-dasharray:none;stroke-dashoffset:0;stroke-opacity:1;enable-background:new" />
      </g>
      <g
         id="g1224"
         transform="translate(-550)">
        <rect
           ry="8"
           rx="7.9999995"
           y="212"
           x="8"
           height="76"
           width="112.00001"
           id="rect1200"
           style="display:inline;opacity:1;vector-effect:none;fill:url(#linearGradient1226);fill-opacity:1;stroke:none;stroke-width:0.25;stroke-linecap:butt;stroke-linejoin:miter;stroke-miterlimit:4;stroke-dasharray:none;stroke-dashoffset:0;stroke-opacity:1;marker:none;marker-start:none;marker-mid:none;marker-end:none;paint-order:normal;enable-background:new" />
        <rect
           style="display:inline;opacity:1;vector-effect:none;fill:#deddda;fill-opacity:1;stroke:none;stroke-width:0.25;stroke-linecap:butt;stroke-linejoin:miter;stroke-miterlimit:4;stroke-dasharray:none;stroke-dashoffset:0;stroke-opacity:1;marker:none;marker-start:none;marker-mid:none;marker-end:none;paint-order:normal;enable-background:new"
           id="rect1202"
           width="112.00001"
           height="84"
           x="8"
           y="200.00002"
           rx="7.9999995"
           ry="8" />
        <rect
           rx="4"
           style="display:inline;opacity:1;vector-effect:none;fill:#241f31;fill-opacity:1;stroke:none;stroke-width:0.01129821px;stroke-linecap:butt;stroke-linejoin:miter;stroke-miterlimit:4;stroke-dasharray:none;stroke-dashoffset:0;stroke-opacity:1;marker:none;marker-start:none;marker-mid:none;marker-end:none;paint-order:normal;enable-background:new"
           id="rect1204"
           width="104"
           height="76"
           x="12"
           y="204.00002"
           ry="4" />
        <rect
           y="208"
           x="16"
           height="68"
           width="96"
           id="rect1206"
           style="display:inline;opacity:1;vector-effect:none;fill:url(#radialGradient1228);fill-opacity:1;stroke:none;stroke-width:0.50000006;stroke-linecap:butt;stroke-linejoin:bevel;stroke-miterlimit:4;stroke-dasharray:0.49999998, 1.00000001;stroke-dashoffset:0;stroke-opacity:0.94881891;marker:none;marker-start:none;marker-mid:none;marker-end:none;paint-order:normal;enable-background:new" />
        <rect
           style="display:inline;opacity:0.753;vector-effect:none;fill:url(#radialGradient1230);fill-opacity:1;stroke:none;stroke-width:0.50000006;stroke-linecap:butt;stroke-linejoin:bevel;stroke-miterlimit:4;stroke-dasharray:0.49999998, 1.00000001;stroke-dashoffset:0;stroke-opacity:0.94881891;marker:none;marker-start:none;marker-mid:none;marker-end:none;paint-order:normal;enable-background:new"
           id="rect1208"
           width="96"
           height="68"
           x="16"
           y="208" />
        <g
           style="display:inline;enable-background:new"
           transform="matrix(3,0,0,3,-170.0006,-1249)"
           inkscape:label="network-wireless-signal-excellent"
           id="g1214">
          <rect
             transform="rotate(-90)"
             y="70.000198"
             x="-505"
             height="16"
             width="16"
             id="rect1210"
             style="color:#bebebe;display:inline;overflow:visible;visibility:visible;fill:none;stroke:none;stroke-width:1;marker:none"
             clip-path="none" />
          <path
             style="display:inline;fill:#ffffff;fill-opacity:1;stroke:none;stroke-width:3.99999905"
             clip-path="none"
             d="m 69.5,52.5 c -5.62844,0 -10.34346,2.000735 -14,5.171875 V 60.5 h 2.960938 c 3.038559,-2.52932 6.439222,-4 11.039062,-4 4.59984,0 8.000503,1.55906 11.039062,4 H 83.5 V 57.738281 C 80.21912,54.806781 75.12844,52.5 69.5,52.5 Z m 0,6 c -4.33328,0 -8.03964,1.47756 -10,4 v 2 h 4 c 1.57756,-1.21304 3.51774,-2 6,-2 2.48226,0 4.43876,0.78696 6,2 h 4 v -2 c -1.98956,-2.4458 -5.7468,-4 -10,-4 z m 0,6 c -2.51466,0 -4.43142,0.6233 -6,2 v 2 h 6 0.75 5.25 v -2 c -1.6738,-1.34412 -3.48534,-2 -6,-2 z m 0,6 a 3.999999,3.999999 0 0 0 -4,4 3.999999,3.999999 0 0 0 4,4 3.999999,3.999999 0 0 0 4,-4 3.999999,3.999999 0 0 0 -4,-4 z"
             transform="matrix(0.5,0,0,0.5,43.250202,464.75)"
             id="path1212"
             inkscape:connector-curvature="0" />
        </g>
      </g>
      <g
         id="g1240"
         transform="translate(0,-16)">
        <rect
           style="display:inline;opacity:1;vector-effect:none;fill:url(#linearGradient1064);fill-opacity:1;stroke:none;stroke-width:0.25;stroke-linecap:butt;stroke-linejoin:miter;stroke-miterlimit:4;stroke-dasharray:none;stroke-dashoffset:0;stroke-opacity:1;marker:none;marker-start:none;marker-mid:none;marker-end:none;paint-order:normal;enable-background:new"
           id="rect1048"
           width="112.00001"
           height="76"
           x="8"
           y="212"
           rx="7.9999995"
           ry="8" />
        <rect
           ry="8"
           rx="7.9999995"
           y="200.00002"
           x="8"
           height="84"
           width="112.00001"
           id="rect929-36-9"
           style="display:inline;opacity:1;vector-effect:none;fill:#deddda;fill-opacity:1;stroke:none;stroke-width:0.25;stroke-linecap:butt;stroke-linejoin:miter;stroke-miterlimit:4;stroke-dasharray:none;stroke-dashoffset:0;stroke-opacity:1;marker:none;marker-start:none;marker-mid:none;marker-end:none;paint-order:normal;enable-background:new" />
        <rect
           ry="4"
           y="204.00002"
           x="12"
           height="76"
           width="104"
           id="rect946-0-7"
           style="display:inline;opacity:1;vector-effect:none;fill:#241f31;fill-opacity:1;stroke:none;stroke-width:0.01129821px;stroke-linecap:butt;stroke-linejoin:miter;stroke-miterlimit:4;stroke-dasharray:none;stroke-dashoffset:0;stroke-opacity:1;marker:none;marker-start:none;marker-mid:none;marker-end:none;paint-order:normal;enable-background:new"
           rx="4" />
        <rect
           style="display:inline;opacity:1;vector-effect:none;fill:url(#radialGradient1018);fill-opacity:1;stroke:none;stroke-width:0.50000006;stroke-linecap:butt;stroke-linejoin:bevel;stroke-miterlimit:4;stroke-dasharray:0.49999998, 1.00000001;stroke-dashoffset:0;stroke-opacity:0.94881891;marker:none;marker-start:none;marker-mid:none;marker-end:none;paint-order:normal;enable-background:new"
           id="rect1012"
           width="96"
           height="68"
           x="16"
           y="208" />
        <rect
           y="208"
           x="16"
           height="68"
           width="96"
           id="rect1014"
           style="display:inline;opacity:0.753;vector-effect:none;fill:url(#radialGradient1020);fill-opacity:1;stroke:none;stroke-width:0.50000006;stroke-linecap:butt;stroke-linejoin:bevel;stroke-miterlimit:4;stroke-dasharray:0.49999998, 1.00000001;stroke-dashoffset:0;stroke-opacity:0.94881891;marker:none;marker-start:none;marker-mid:none;marker-end:none;paint-order:normal;enable-background:new" />
        <g
           id="g6295"
           inkscape:label="network-wireless-signal-excellent"
           transform="matrix(3,0,0,3,-170.0006,-1249)"
           style="display:inline;enable-background:new">
          <rect
             clip-path="none"
             style="color:#bebebe;display:inline;overflow:visible;visibility:visible;fill:none;stroke:none;stroke-width:1;marker:none"
             id="rect6303"
             width="16"
             height="16"
             x="-505"
             y="70.000198"
             transform="rotate(-90)" />
          <path
             inkscape:connector-curvature="0"
             id="path6305"
             transform="matrix(0.5,0,0,0.5,43.250202,464.75)"
             d="m 69.5,52.5 c -5.62844,0 -10.34346,2.000735 -14,5.171875 V 60.5 h 2.960938 c 3.038559,-2.52932 6.439222,-4 11.039062,-4 4.59984,0 8.000503,1.55906 11.039062,4 H 83.5 V 57.738281 C 80.21912,54.806781 75.12844,52.5 69.5,52.5 Z m 0,6 c -4.33328,0 -8.03964,1.47756 -10,4 v 2 h 4 c 1.57756,-1.21304 3.51774,-2 6,-2 2.48226,0 4.43876,0.78696 6,2 h 4 v -2 c -1.98956,-2.4458 -5.7468,-4 -10,-4 z m 0,6 c -2.51466,0 -4.43142,0.6233 -6,2 v 2 h 6 0.75 5.25 v -2 c -1.6738,-1.34412 -3.48534,-2 -6,-2 z m 0,6 a 3.999999,3.999999 0 0 0 -4,4 3.999999,3.999999 0 0 0 4,4 3.999999,3.999999 0 0 0 4,-4 3.999999,3.999999 0 0 0 -4,-4 z"
             clip-path="none"
             style="display:inline;fill:#ffffff;fill-opacity:1;stroke:none;stroke-width:3.99999905" />
        </g>
      </g>
      <rect
         transform="rotate(-90)"
         y="220"
         x="-188"
         height="16"
         width="16"
         id="rect1248"
         style="color:#bebebe;display:inline;overflow:visible;visibility:visible;fill:none;stroke:none;stroke-width:1;marker:none"
         clip-path="none" />
      <path
         sodipodi:nodetypes="cssccccccccccc"
         inkscape:connector-curvature="0"
         id="path1250"
         d="m 222,174 c -1.108,0 -2,0.892 -2,2 v 8 c 0,1.108 0.892,2 2,2 h 12 c 1.108,0 2,-0.892 2,-2 v -8 c 0,-1.108 -0.892,-2 -2,-2 z m 0,2 h 12 v 8 h -12 z"
         style="opacity:1;vector-effect:none;fill:#241f31;fill-opacity:1;stroke:none;stroke-width:1;stroke-linecap:square;stroke-linejoin:round;stroke-miterlimit:4;stroke-dasharray:none;stroke-dashoffset:0;stroke-opacity:1" />
      <rect
         y="178"
         x="227"
         height="10.000007"
         width="9"
         id="rect1252"
         style="opacity:1;vector-effect:none;fill:#f0f0f0;fill-opacity:1;stroke:none;stroke-width:3.00000095;stroke-linecap:round;stroke-linejoin:round;stroke-miterlimit:4;stroke-dasharray:none;stroke-dashoffset:0;stroke-opacity:1" />
      <path
         sodipodi:nodetypes="scccscccssccccccssssss"
         style="display:inline;fill:#241f31;fill-opacity:1;stroke:none;stroke-width:1.99999952"
         clip-path="none"
         d="m 231,178 c -2.16664,0 -4.01982,0.73878 -5,2 v 1 h 2 c 0.78878,-0.60652 1.75887,-1 3,-1 1.24113,0 2.21938,0.39348 3,1 h 2 v -1 c -0.99478,-1.2229 -2.8734,-2 -5,-2 z m 0,3 c -1.25733,0 -2.21571,0.31165 -3,1 v 1 h 3 0.375 2.625 v -1 c -0.8369,-0.67206 -1.74267,-1 -3,-1 z m 0,3 c -1.10457,0 -2,0.89543 -2,2 0,1.10457 0.89543,2 2,2 1.10457,0 2,-0.89543 2,-2 0,-1.10457 -0.89543,-2 -2,-2 z"
         id="path1254"
         inkscape:connector-curvature="0" />
    </g>
    <g
       inkscape:groupmode="layer"
       id="layer3"
       inkscape:label="hairlines"
       style="display:none;filter:url(#filter2667)"
       sodipodi:insensitive="true">
      <circle
         cx="64.000031"
         cy="236"
         r="59.504131"
         id="circle2892"
         style="display:inline;opacity:0.1;vector-effect:none;fill:none;fill-opacity:1;stroke:#000000;stroke-width:0.99000001;stroke-linecap:butt;stroke-linejoin:miter;stroke-miterlimit:4;stroke-dasharray:0.99000001, 0.99000001;stroke-dashoffset:0;stroke-opacity:1;marker:none;marker-start:none;marker-mid:none;marker-end:none;paint-order:normal;enable-background:new" />
      <rect
         ry="7.9292889"
         rx="8.701004"
         y="180.49496"
         x="20.495007"
         height="111.01005"
         width="87.009987"
         id="rect2894"
         style="display:inline;opacity:0.1;vector-effect:none;fill:none;fill-opacity:1;stroke:#000000;stroke-width:0.99000001;stroke-linecap:butt;stroke-linejoin:miter;stroke-miterlimit:4;stroke-dasharray:0.99000001, 0.99000001;stroke-dashoffset:0;stroke-opacity:1;marker:none;marker-start:none;marker-mid:none;marker-end:none;paint-order:normal;enable-background:new" />
      <rect
         ry="7.9238095"
         rx="7.9238095"
         y="184.49524"
         x="12.495266"
         height="103.00952"
         width="103.00952"
         id="rect2896"
         style="display:inline;opacity:0.1;vector-effect:none;fill:none;fill-opacity:1;stroke:#000000;stroke-width:0.99000001;stroke-linecap:butt;stroke-linejoin:miter;stroke-miterlimit:4;stroke-dasharray:0.99000001, 0.99000001;stroke-dashoffset:0;stroke-opacity:1;marker:none;marker-start:none;marker-mid:none;marker-end:none;paint-order:normal;enable-background:new" />
      <rect
         ry="8.701005"
         rx="7.9292889"
         y="200.49496"
         x="8.4950066"
         height="87.010048"
         width="111.01004"
         id="rect2898"
         style="display:inline;opacity:0.1;vector-effect:none;fill:none;fill-opacity:1;stroke:#000000;stroke-width:0.99000001;stroke-linecap:butt;stroke-linejoin:miter;stroke-miterlimit:4;stroke-dasharray:0.99000001, 0.99000001;stroke-dashoffset:0;stroke-opacity:1;marker:none;marker-start:none;marker-mid:none;marker-end:none;paint-order:normal;enable-background:new" />
      <path
         inkscape:connector-curvature="0"
         id="path2900"
         d="M 2.6203015e-5,288.99999 H 128.00003"
         style="display:inline;fill:none;stroke:#62a0ea;stroke-width:2;stroke-linecap:butt;stroke-linejoin:miter;stroke-miterlimit:4;stroke-dasharray:none;stroke-opacity:1;enable-background:new" />
    </g>
  </g>
</svg>
