<?xml version="1.0" encoding="UTF-8" standalone="no"?>
<svg
   xmlns:dc="http://purl.org/dc/elements/1.1/"
   xmlns:cc="http://creativecommons.org/ns#"
   xmlns:rdf="http://www.w3.org/1999/02/22-rdf-syntax-ns#"
   xmlns:svg="http://www.w3.org/2000/svg"
   xmlns="http://www.w3.org/2000/svg"
   xmlns:xlink="http://www.w3.org/1999/xlink"
   xmlns:sodipodi="http://sodipodi.sourceforge.net/DTD/sodipodi-0.dtd"
   xmlns:inkscape="http://www.inkscape.org/namespaces/inkscape"
   viewBox="0 0 192 152"
   style="display:inline;enable-background:new"
   version="1.0"
   inkscape:output_extension="org.inkscape.output.svg.inkscape"
   sodipodi:docname="org.gnome.Quadrapassel.Source.svg"
   inkscape:version="1.0 (4035a4fb49, 2020-05-01)"
   sodipodi:version="0.32"
   id="svg11300"
   height="152"
   width="192"
   inkscape:export-filename="Template.png"
   inkscape:export-xdpi="96"
   inkscape:export-ydpi="96">
  <title
     id="title4162">Adwaita Icon Template</title>
  <defs
     id="defs3">
    <linearGradient
       id="linearGradient965"
       inkscape:collect="always">
      <stop
         id="stop961"
         offset="0"
         style="stop-color:#ca7ad3;stop-opacity:1" />
      <stop
         id="stop963"
         offset="1"
         style="stop-color:#b950c5;stop-opacity:1" />
    </linearGradient>
    <linearGradient
       id="linearGradient1568"
       inkscape:collect="always">
      <stop
         id="stop1564"
         offset="0"
         style="stop-color:#613583;stop-opacity:1;" />
      <stop
         style="stop-color:#9a67c2;stop-opacity:1"
         offset="0.05637507"
         id="stop1574" />
      <stop
         style="stop-color:#4f2b6b;stop-opacity:1"
         offset="0.11736781"
         id="stop1572" />
      <stop
         id="stop1566"
         offset="1"
         style="stop-color:#613583;stop-opacity:1" />
    </linearGradient>
    <linearGradient
       id="linearGradient1528"
       inkscape:collect="always">
      <stop
         id="stop1524"
         offset="0"
         style="stop-color:#8f43ac;stop-opacity:1" />
      <stop
         id="stop1526"
         offset="1"
         style="stop-color:#813d9c;stop-opacity:1" />
    </linearGradient>
    <linearGradient
       id="linearGradient1489"
       inkscape:collect="always">
      <stop
         id="stop1485"
         offset="0"
         style="stop-color:#e6313a;stop-opacity:1" />
      <stop
         id="stop1487"
         offset="1"
         style="stop-color:#e01b24;stop-opacity:1" />
    </linearGradient>
    <linearGradient
       id="linearGradient1477"
       inkscape:collect="always">
      <stop
         id="stop1473"
         offset="0"
         style="stop-color:#a51d2d;stop-opacity:1;" />
      <stop
         style="stop-color:#ad1d2e;stop-opacity:1"
         offset="0.49293399"
         id="stop1483" />
      <stop
         style="stop-color:#b5161d;stop-opacity:1"
         offset="0.66739565"
         id="stop1481" />
      <stop
         id="stop1475"
         offset="1"
         style="stop-color:#891825;stop-opacity:1" />
    </linearGradient>
    <linearGradient
       id="linearGradient1440"
       inkscape:collect="always">
      <stop
         id="stop1436"
         offset="0"
         style="stop-color:#e02937;stop-opacity:1" />
      <stop
         id="stop1438"
         offset="1"
         style="stop-color:#c01c28;stop-opacity:1" />
    </linearGradient>
    <linearGradient
       xlink:href="#linearGradient1036"
       id="linearGradient1099"
       gradientUnits="userSpaceOnUse"
       gradientTransform="translate(604.81684,170.58641)"
       x1="32"
       y1="236"
       x2="96"
       y2="236" />
    <linearGradient
       id="linearGradient1036">
      <stop
         style="stop-color:#d5d3cf;stop-opacity:1;"
         offset="0"
         id="stop1032" />
      <stop
         style="stop-color:#f6f5f4;stop-opacity:1"
         offset="1"
         id="stop1034" />
    </linearGradient>
    <radialGradient
       xlink:href="#linearGradient1069"
       id="radialGradient1103"
       gradientUnits="userSpaceOnUse"
       gradientTransform="matrix(0.88333331,0,0,0.88333331,-460.35018,463.11973)"
       cx="-244"
       cy="-76"
       fx="-244"
       fy="-76"
       r="32" />
    <linearGradient
       id="linearGradient1069">
      <stop
         style="stop-color:#d5d3cf;stop-opacity:1"
         offset="0"
         id="stop1065" />
      <stop
         style="stop-color:#949390;stop-opacity:1"
         offset="1"
         id="stop1067-1" />
    </linearGradient>
    <linearGradient
       gradientTransform="translate(-470.5864,432.81685)"
       xlink:href="#linearGradient1025"
       id="linearGradient1027"
       x1="64"
       y1="262.5"
       x2="64"
       y2="232"
       gradientUnits="userSpaceOnUse" />
    <linearGradient
       id="linearGradient1025">
      <stop
         style="stop-color:#9a9996;stop-opacity:1"
         offset="0"
         id="stop1021" />
      <stop
         style="stop-color:#77767b;stop-opacity:1"
         offset="1"
         id="stop1023" />
    </linearGradient>
    <inkscape:path-effect
       is_visible="true"
       id="path-effect35304-9"
       effect="spiro" />
    <clipPath
       id="clipPath1609-7"
       clipPathUnits="userSpaceOnUse">
      <path
         style="fill:#e74747;stroke:none;stroke-width:0.25px;stroke-linecap:butt;stroke-linejoin:miter;stroke-opacity:1"
         d="m 252,116 28,-28 v -8 h -36 v 36 z"
         id="path1611-5"
         inkscape:connector-curvature="0"
         sodipodi:nodetypes="cccccc" />
    </clipPath>
    <linearGradient
       id="linearGradient1697">
      <stop
         style="stop-color:#deddda;stop-opacity:1"
         offset="0"
         id="stop1685" />
      <stop
         id="stop1687"
         offset="0.04545455"
         style="stop-color:#eeeeec;stop-opacity:1" />
      <stop
         style="stop-color:#deddda;stop-opacity:1"
         offset="0.09090909"
         id="stop1689" />
      <stop
         id="stop1691"
         offset="0.90909094"
         style="stop-color:#deddda;stop-opacity:1" />
      <stop
         style="stop-color:#eeeeec;stop-opacity:1"
         offset="0.95454544"
         id="stop1693" />
      <stop
         style="stop-color:#c0bfbc;stop-opacity:1"
         offset="1"
         id="stop1695" />
    </linearGradient>
    <clipPath
       id="clipPath1289"
       clipPathUnits="userSpaceOnUse">
      <path
         sodipodi:nodetypes="scccsssscccssss"
         inkscape:connector-curvature="0"
         id="path1291"
         d="m 64,-148 h 64 l 64,-64 64,64 h 192 c 17.728,0 32,14.272 32,32 v 288 c 0,17.728 -14.272,32 -32,32 H 256 l -64,-64 -64,64 H 64 C 46.272,204 32,189.728 32,172 v -288 c 0,-17.728 14.408898,-34.19889 32,-32 z"
         style="display:inline;opacity:1;vector-effect:none;fill:none;fill-opacity:1;stroke:#000000;stroke-width:4;stroke-linecap:round;stroke-linejoin:round;stroke-miterlimit:4;stroke-dasharray:none;stroke-dashoffset:0;stroke-opacity:1;marker:none;marker-start:none;marker-mid:none;marker-end:none;paint-order:normal;enable-background:new" />
    </clipPath>
    <linearGradient
       gradientTransform="matrix(0,6,-12,0,-64,209.99687)"
       gradientUnits="userSpaceOnUse"
       x2="1"
       id="paint3_linear-2-6-5">
      <stop
         id="stop91-0-7-4"
         stop-color="#C01C27" />
      <stop
         id="stop93-2-5-7"
         stop-color="#E01B24"
         offset="1" />
    </linearGradient>
    <clipPath
       id="clipPath1609"
       clipPathUnits="userSpaceOnUse">
      <path
         style="fill:#e74747;stroke:none;stroke-width:0.25px;stroke-linecap:butt;stroke-linejoin:miter;stroke-opacity:1"
         d="m 252,116 28,-28 v -8 h -36 v 36 z"
         id="path1611"
         inkscape:connector-curvature="0"
         sodipodi:nodetypes="cccccc" />
    </clipPath>
    <linearGradient
       gradientTransform="translate(-64.000031,-184)"
       inkscape:collect="always"
       xlink:href="#linearGradient1440"
       id="linearGradient1442-3"
       x1="64.000031"
       y1="196.5"
       x2="65.356476"
       y2="196.5"
       gradientUnits="userSpaceOnUse" />
    <linearGradient
       gradientUnits="userSpaceOnUse"
       y2="57"
       x2="124"
       y1="57"
       x1="46"
       id="linearGradient1479"
       xlink:href="#linearGradient1477"
       inkscape:collect="always" />
    <radialGradient
       gradientUnits="userSpaceOnUse"
       gradientTransform="matrix(1.3179367,0,0,1.2672468,-32.547141,-56.488204)"
       r="12.999999"
       fy="209.5"
       fx="102.36991"
       cy="209.5"
       cx="102.36991"
       id="radialGradient1491"
       xlink:href="#linearGradient1489"
       inkscape:collect="always" />
    <radialGradient
       inkscape:collect="always"
       xlink:href="#linearGradient1489"
       id="radialGradient1491-3"
       cx="102.36991"
       cy="209.5"
       fx="102.36991"
       fy="209.5"
       r="12.999999"
       gradientTransform="matrix(1.9603811,0,0,1.8849818,-188.31414,-369.90369)"
       gradientUnits="userSpaceOnUse" />
    <radialGradient
       r="12.999999"
       fy="222.76273"
       fx="102.69134"
       cy="222.76273"
       cx="102.69134"
       gradientTransform="matrix(1.2696162,0,0,1.2207848,-27.378549,-37.945356)"
       gradientUnits="userSpaceOnUse"
       id="radialGradient1516"
       xlink:href="#linearGradient1489"
       inkscape:collect="always" />
    <radialGradient
       r="12.999999"
       fy="209.5"
       fx="89.428604"
       cy="209.5"
       cx="89.428604"
       gradientTransform="matrix(1.2248297,0,0,1.1777209,-32.534787,-37.732525)"
       gradientUnits="userSpaceOnUse"
       id="radialGradient1520"
       xlink:href="#linearGradient1489"
       inkscape:collect="always" />
    <radialGradient
       r="12.999999"
       fy="209.5"
       fx="75.747078"
       cy="209.5"
       cx="75.747078"
       gradientTransform="matrix(1.5773208,0,0,1.5166546,-69.29842,-108.73914)"
       gradientUnits="userSpaceOnUse"
       id="radialGradient1522"
       xlink:href="#linearGradient1489"
       inkscape:collect="always" />
    <radialGradient
       inkscape:collect="always"
       xlink:href="#linearGradient1528"
       id="radialGradient1530-9"
       cx="51.000031"
       cy="259.5"
       fx="51.000031"
       fy="259.5"
       r="13"
       gradientTransform="matrix(1.6187981,0,0,1.5565366,-69.558754,-378.92126)"
       gradientUnits="userSpaceOnUse" />
    <linearGradient
       gradientUnits="userSpaceOnUse"
       y2="119.5"
       x2="98"
       y1="119.5"
       x1="20"
       id="linearGradient1570"
       xlink:href="#linearGradient1568"
       inkscape:collect="always" />
    <radialGradient
       gradientUnits="userSpaceOnUse"
       gradientTransform="matrix(1.360565,0,0,1.3082355,-9.014138,-88.193013)"
       r="13"
       fy="284.5"
       fx="25.000038"
       cy="284.5"
       cx="25.000038"
       id="radialGradient967"
       xlink:href="#linearGradient965"
       inkscape:collect="always" />
    <radialGradient
       inkscape:collect="always"
       xlink:href="#linearGradient965"
       id="radialGradient967-3"
       cx="25.000038"
       cy="284.5"
       fx="25.000038"
       fy="284.5"
       r="13"
       gradientTransform="matrix(1.360565,0,0,1.3082355,-21.014177,-347.19301)"
       gradientUnits="userSpaceOnUse" />
    <radialGradient
       r="13"
       fy="284.5"
       fx="43.815365"
       cy="284.5"
       cx="43.815365"
       gradientTransform="matrix(1.360565,0,0,1.3082355,-9.014138,-88.193013)"
       gradientUnits="userSpaceOnUse"
       id="radialGradient992"
       xlink:href="#linearGradient965"
       inkscape:collect="always" />
    <radialGradient
       r="13"
       fy="284.5"
       fx="63.082397"
       cy="284.5"
       cx="63.082397"
       gradientTransform="matrix(1.360565,0,0,1.3082355,-9.014138,-88.193013)"
       gradientUnits="userSpaceOnUse"
       id="radialGradient994"
       xlink:href="#linearGradient965"
       inkscape:collect="always" />
    <radialGradient
       r="13"
       fy="265.39029"
       fx="44.109741"
       cy="265.39029"
       cx="44.109741"
       gradientTransform="matrix(1.360565,0,0,1.3082355,-9.014138,-88.193013)"
       gradientUnits="userSpaceOnUse"
       id="radialGradient996"
       xlink:href="#linearGradient965"
       inkscape:collect="always" />
  </defs>
  <sodipodi:namedview
     inkscape:document-rotation="0"
     borderlayer="true"
     inkscape:snap-text-baseline="true"
     inkscape:snap-smooth-nodes="true"
     inkscape:snap-midpoints="true"
     inkscape:snap-object-midpoints="true"
     inkscape:snap-center="true"
     showborder="true"
     inkscape:snap-bbox-midpoints="true"
     inkscape:snap-bbox-edge-midpoints="true"
     inkscape:snap-intersection-paths="true"
     inkscape:object-paths="true"
     inkscape:snap-global="true"
     inkscape:bbox-nodes="true"
     inkscape:object-nodes="true"
     inkscape:measure-end="0,0"
     inkscape:measure-start="0,0"
     inkscape:locked="false"
     inkscape:guide-bbox="true"
     showguides="false"
     inkscape:pagecheckerboard="false"
     inkscape:window-maximized="0"
     guidetolerance="13"
     gridtolerance="12"
     objecttolerance="7"
     inkscape:snap-bbox="true"
     inkscape:snap-nodes="true"
     height="300px"
     width="400px"
     inkscape:window-y="23"
     inkscape:window-x="26"
     inkscape:window-height="1376"
     inkscape:window-width="2560"
     inkscape:showpageshadow="false"
     inkscape:document-units="px"
     inkscape:grid-bbox="true"
     showgrid="false"
     inkscape:current-layer="layer9"
     inkscape:cy="82.068418"
     inkscape:cx="40.176272"
     inkscape:zoom="5.6568542"
     inkscape:pageshadow="2"
     inkscape:pageopacity="0.0"
     borderopacity="0.25490196"
     bordercolor="#666666"
     pagecolor="#ffffff"
     id="base"
     fill="#f57900"
     stroke="#ef2929">
    <inkscape:grid
       originy="8"
       originx="8"
       empspacing="4"
       visible="true"
       enabled="true"
       spacingy="2"
       spacingx="2"
       id="grid5883"
       type="xygrid" />
    <sodipodi:guide
       inkscape:color="rgb(0,0,255)"
       inkscape:label=""
       inkscape:locked="false"
       id="guide1073"
       orientation="0,1"
       position="72,16" />
    <sodipodi:guide
       inkscape:color="rgb(0,0,255)"
       inkscape:label=""
       inkscape:locked="false"
       id="guide1075"
       orientation="1,0"
       position="20,72" />
    <sodipodi:guide
       inkscape:color="rgb(0,0,255)"
       inkscape:label=""
       inkscape:locked="false"
       id="guide1099"
       orientation="0,1"
       position="72,112" />
    <sodipodi:guide
       inkscape:color="rgb(0,0,255)"
       inkscape:label=""
       inkscape:locked="false"
       id="guide993"
       orientation="0,1"
       position="72,136" />
    <sodipodi:guide
       inkscape:color="rgb(0,0,255)"
       inkscape:label=""
       inkscape:locked="false"
       id="guide995"
       orientation="1,0"
       position="112,72" />
    <sodipodi:guide
       inkscape:color="rgb(0,0,255)"
       inkscape:label=""
       inkscape:locked="false"
       id="guide867"
       orientation="1,0"
       position="8.0000001,72" />
    <sodipodi:guide
       inkscape:color="rgb(0,0,255)"
       inkscape:label=""
       inkscape:locked="false"
       id="guide869"
       orientation="1,0"
       position="128,72" />
    <sodipodi:guide
       inkscape:color="rgb(0,0,255)"
       inkscape:label=""
       inkscape:locked="false"
       id="guide871"
       orientation="0,1"
       position="72,124" />
    <inkscape:grid
       originy="8"
       originx="8"
       dotted="true"
       empopacity="0.08627451"
       empcolor="#000000"
       opacity="0.49019608"
       color="#000000"
       empspacing="8"
       spacingy="1"
       spacingx="1"
       id="grid873"
       type="xygrid" />
    <sodipodi:guide
       inkscape:color="rgb(0,0,255)"
       inkscape:label=""
       inkscape:locked="false"
       id="guide877"
       orientation="1,0"
       position="32,72" />
    <sodipodi:guide
       inkscape:color="rgb(0,0,255)"
       inkscape:label=""
       inkscape:locked="false"
       id="guide879"
       orientation="1,0"
       position="124,72" />
    <sodipodi:guide
       inkscape:color="rgb(0,0,255)"
       inkscape:label=""
       inkscape:locked="false"
       id="guide881"
       orientation="0,1"
       position="72,128" />
    <sodipodi:guide
       inkscape:color="rgb(0,0,255)"
       inkscape:label=""
       inkscape:locked="false"
       id="guide883"
       orientation="0,1"
       position="72,20" />
    <sodipodi:guide
       inkscape:color="rgb(0,0,255)"
       inkscape:label=""
       inkscape:locked="false"
       id="guide885"
       orientation="1,0"
       position="16,72" />
    <sodipodi:guide
       inkscape:color="rgb(0,0,255)"
       inkscape:label=""
       inkscape:locked="false"
       id="guide887"
       orientation="1,0"
       position="136,72" />
    <sodipodi:guide
       inkscape:color="rgb(0,0,255)"
       inkscape:label=""
       inkscape:locked="false"
       id="guide897"
       orientation="0,1"
       position="72,8" />
    <sodipodi:guide
       inkscape:color="rgb(0,0,255)"
       inkscape:label=""
       inkscape:locked="false"
       id="guide899"
       orientation="0,1"
       position="72,32" />
    <sodipodi:guide
       inkscape:color="rgb(0,0,255)"
       inkscape:label=""
       inkscape:locked="false"
       id="guide950"
       orientation="-0.70710678,0.70710678"
       position="264,264" />
    <sodipodi:guide
       inkscape:color="rgb(0,0,255)"
       inkscape:label=""
       inkscape:locked="false"
       id="guide952"
       orientation="0.70710678,0.70710678"
       position="72,72" />
  </sodipodi:namedview>
  <metadata
     id="metadata4">
    <rdf:RDF>
      <cc:Work
         rdf:about="">
        <dc:format>image/svg+xml</dc:format>
        <dc:type
           rdf:resource="http://purl.org/dc/dcmitype/StillImage" />
        <dc:creator>
          <cc:Agent>
            <dc:title>GNOME Design Team</dc:title>
          </cc:Agent>
        </dc:creator>
        <dc:source />
        <cc:license
           rdf:resource="http://creativecommons.org/licenses/by-sa/4.0/" />
        <dc:title>Adwaita Icon Template</dc:title>
        <dc:subject>
          <rdf:Bag />
        </dc:subject>
        <dc:date />
        <dc:rights>
          <cc:Agent>
            <dc:title />
          </cc:Agent>
        </dc:rights>
        <dc:publisher>
          <cc:Agent>
            <dc:title />
          </cc:Agent>
        </dc:publisher>
        <dc:identifier />
        <dc:relation />
        <dc:language />
        <dc:coverage />
        <dc:description />
        <dc:contributor>
          <cc:Agent>
            <dc:title />
          </cc:Agent>
        </dc:contributor>
      </cc:Work>
      <cc:License
         rdf:about="http://creativecommons.org/licenses/by-sa/4.0/">
        <cc:permits
           rdf:resource="http://creativecommons.org/ns#Reproduction" />
        <cc:permits
           rdf:resource="http://creativecommons.org/ns#Distribution" />
        <cc:requires
           rdf:resource="http://creativecommons.org/ns#Notice" />
        <cc:requires
           rdf:resource="http://creativecommons.org/ns#Attribution" />
        <cc:permits
           rdf:resource="http://creativecommons.org/ns#DerivativeWorks" />
        <cc:requires
           rdf:resource="http://creativecommons.org/ns#ShareAlike" />
      </cc:License>
    </rdf:RDF>
  </metadata>
  <g
     transform="translate(8,-156)"
     style="display:inline"
     inkscape:groupmode="layer"
     inkscape:label="App Icon"
     id="layer1">
    <g
       sodipodi:insensitive="true"
       style="display:inline"
       inkscape:label="template"
       id="layer4"
       inkscape:groupmode="layer">
      <rect
         style="display:inline;overflow:visible;visibility:visible;fill:#f0f0f0;fill-opacity:0;fill-rule:nonzero;stroke:none;stroke-width:0.5;marker:none;enable-background:accumulate"
         id="hicolor"
         width="128"
         height="128"
         x="9.2651362e-08"
         y="172"
         inkscape:label="0" />
      <rect
         inkscape:label="0"
         y="172"
         x="160"
         height="16"
         width="16"
         id="symbolic"
         style="display:inline;overflow:visible;visibility:visible;fill:#f0f0f0;fill-opacity:0;fill-rule:nonzero;stroke:none;stroke-width:0.5;marker:none;enable-background:accumulate" />
    </g>
    <g
       style="display:inline"
       inkscape:label="baseplate"
       id="layer2"
       inkscape:groupmode="layer"
       sodipodi:insensitive="true">
      <g
         inkscape:export-ydpi="12"
         inkscape:export-xdpi="12"
         id="g12027"
         transform="matrix(7.9911709,0,0,8.0036407,-167.7909,-4846.0776)"
         style="display:inline;fill:#000000;enable-background:new" />
      <rect
         inkscape:label="0"
         y="172"
         x="9.2651362e-08"
         height="128"
         width="128"
         id="128"
         style="display:inline;overflow:visible;visibility:visible;fill:#f0f0f0;fill-opacity:1;fill-rule:nonzero;stroke:none;stroke-width:0.5;marker:none;enable-background:accumulate" />
      <g
         transform="translate(-24,24)"
         style="fill:none;fill-opacity:0.25098;stroke:#a579b3;stroke-opacity:1"
         id="g883" />
      <g
         transform="translate(-24,24)"
         style="fill:none;fill-opacity:0.25098;stroke:#a579b3;stroke-opacity:1"
         id="g900" />
      <rect
         style="display:inline;overflow:visible;visibility:visible;fill:#f0f0f0;fill-opacity:1;fill-rule:nonzero;stroke:none;stroke-width:0.5;marker:none;enable-background:accumulate"
         id="16"
         width="16"
         height="16"
         x="160"
         y="172"
         inkscape:label="" />
      <text
         inkscape:label="icon-name"
         id="text863"
         y="167"
         x="0"
         style="font-style:normal;font-variant:normal;font-weight:bold;font-stretch:normal;font-size:4px;line-height:125%;font-family:Cantarell;-inkscape-font-specification:'Cantarell, Bold';text-align:start;writing-mode:lr-tb;text-anchor:start;display:inline;fill:#000000;fill-opacity:1;stroke:none;stroke-width:0.332649;enable-background:new"
         xml:space="preserve"><tspan
           y="167"
           x="0"
           id="tspan861"
           sodipodi:role="line"
           style="font-size:4px;stroke-width:0.332649">Hicolor</tspan></text>
      <text
         xml:space="preserve"
         style="font-style:normal;font-variant:normal;font-weight:bold;font-stretch:normal;font-size:4px;line-height:125%;font-family:Cantarell;-inkscape-font-specification:'Cantarell, Bold';text-align:start;writing-mode:lr-tb;text-anchor:start;display:inline;fill:#000000;fill-opacity:1;stroke:none;stroke-width:0.332649;enable-background:new"
         x="160"
         y="167"
         id="text867"
         inkscape:label="icon-name"><tspan
           style="font-size:4px;stroke-width:0.332649"
           sodipodi:role="line"
           id="tspan865"
           x="160"
           y="167">Symbolic</tspan></text>
    </g>
    <g
       style="display:inline"
       inkscape:label="icons"
       id="layer9"
       inkscape:groupmode="layer">
      <path
         transform="translate(-8,156)"
         d="M 20 107 L 20 124 C 20 128.432 23.568 132 28 132 L 46 132 L 72 132 L 98 132 L 98 107 L 72 107 L 46 107 L 20 107 z "
         style="opacity:1;fill:url(#linearGradient1570);fill-opacity:1;stroke:none;stroke-width:29.9999;stroke-linecap:round;stroke-linejoin:round;stop-color:#000000"
         id="rect1422" />
      <path
         transform="translate(-8,156)"
         d="M 46 32 L 46 57 L 72 57 L 98 57 L 98 32 L 72 32 L 46 32 z M 98 57 L 98 82 L 124 82 L 124 57 L 98 57 z "
         style="opacity:1;fill:url(#linearGradient1479);fill-opacity:1;stroke:none;stroke-width:29.9999;stroke-linecap:round;stroke-linejoin:round;stop-color:#000000"
         id="rect1428" />
      <path
         transform="translate(-8,156)"
         d="M -66.970703 103 L -66.970703 128 L -48.970703 128 C -44.538704 128 -40.970703 124.432 -40.970703 120 L -40.970703 103 L -66.970703 103 z "
         style="opacity:0.259019;fill:#000000;fill-opacity:1;stroke:none;stroke-width:29.9999;stroke-linecap:round;stroke-linejoin:round;stop-color:#000000"
         id="rect1350" />
      <rect
         style="opacity:0.259019;fill:#000000;fill-opacity:1;stroke:none;stroke-width:29.9999;stroke-linecap:round;stroke-linejoin:round;stop-color:#000000"
         id="rect1346"
         width="26"
         height="25"
         x="-74.96994"
         y="209"
         rx="0"
         ry="0" />
      <rect
         ry="0"
         rx="0"
         y="234"
         x="-74.96994"
         height="25"
         width="26"
         id="rect1348"
         style="opacity:0.259019;fill:#000000;fill-opacity:1;stroke:none;stroke-width:29.9999;stroke-linecap:round;stroke-linejoin:round;stop-color:#000000" />
      <rect
         style="opacity:0.259019;fill:#000000;fill-opacity:1;stroke:none;stroke-width:29.9999;stroke-linecap:round;stroke-linejoin:round;stop-color:#000000"
         id="rect1352"
         width="26"
         height="25"
         x="-100.96994"
         y="184"
         rx="0"
         ry="0" />
      <rect
         ry="0"
         rx="0"
         y="209"
         x="-100.96994"
         height="25"
         width="26"
         id="rect1354"
         style="opacity:0.259019;fill:#000000;fill-opacity:1;stroke:none;stroke-width:29.9999;stroke-linecap:round;stroke-linejoin:round;stop-color:#000000" />
      <rect
         style="opacity:0.259019;fill:#000000;fill-opacity:1;stroke:none;stroke-width:29.9999;stroke-linecap:round;stroke-linejoin:round;stop-color:#000000"
         id="rect1356"
         width="26"
         height="25"
         x="-100.96994"
         y="234"
         rx="0"
         ry="0" />
      <rect
         ry="0"
         rx="0"
         y="259"
         x="-100.96994"
         height="25"
         width="26"
         id="rect1358"
         style="opacity:0.259019;fill:#000000;fill-opacity:1;stroke:none;stroke-width:29.9999;stroke-linecap:round;stroke-linejoin:round;stop-color:#000000" />
      <rect
         ry="0"
         rx="0"
         y="184"
         x="-126.96994"
         height="25"
         width="26"
         id="rect1360"
         style="opacity:0.259019;fill:#000000;fill-opacity:1;stroke:none;stroke-width:29.9999;stroke-linecap:round;stroke-linejoin:round;stop-color:#000000" />
      <rect
         style="opacity:0.259019;fill:#000000;fill-opacity:1;stroke:none;stroke-width:29.9999;stroke-linecap:round;stroke-linejoin:round;stop-color:#000000"
         id="rect1362"
         width="26"
         height="25"
         x="-126.96994"
         y="209"
         rx="0"
         ry="0" />
      <rect
         ry="0"
         rx="0"
         y="234"
         x="-126.96994"
         height="25"
         width="26"
         id="rect1364"
         style="opacity:0.259019;fill:#000000;fill-opacity:1;stroke:none;stroke-width:29.9999;stroke-linecap:round;stroke-linejoin:round;stop-color:#000000" />
      <rect
         style="opacity:0.259019;fill:#000000;fill-opacity:1;stroke:none;stroke-width:29.9999;stroke-linecap:round;stroke-linejoin:round;stop-color:#000000"
         id="rect1366"
         width="26"
         height="25"
         x="-126.96994"
         y="259"
         rx="0"
         ry="0" />
      <rect
         ry="0"
         rx="0"
         y="209"
         x="-152.96994"
         height="25"
         width="26"
         id="rect1370"
         style="opacity:0.259019;fill:#000000;fill-opacity:1;stroke:none;stroke-width:29.9999;stroke-linecap:round;stroke-linejoin:round;stop-color:#000000" />
      <rect
         style="opacity:0.259019;fill:#000000;fill-opacity:1;stroke:none;stroke-width:29.9999;stroke-linecap:round;stroke-linejoin:round;stop-color:#000000"
         id="rect1372"
         width="26"
         height="25"
         x="-152.96994"
         y="234"
         rx="0"
         ry="0" />
      <path
         id="path1384"
         style="opacity:0.259019;fill:#000000;fill-opacity:1;stroke:none;stroke-width:29.9999;stroke-linecap:round;stroke-linejoin:round;stop-color:#000000"
         d="m -74.96994,209 v -25 h 18 c 4.431999,0 8,3.568 8,8 v 17 z" />
      <path
         id="path1386"
         style="opacity:0.259019;fill:#000000;fill-opacity:1;stroke:none;stroke-width:29.9999;stroke-linecap:round;stroke-linejoin:round;stop-color:#000000"
         d="m -126.96994,259 v 25 h -18 c -4.432,0 -8,-3.568 -8,-8 v -17 z" />
      <path
         d="m -126.9707,209 v -25 h -18 c -4.432,0 -8,3.568 -8,8 v 17 z"
         style="opacity:0.259019;fill:#000000;fill-opacity:1;stroke:none;stroke-width:29.9999;stroke-linecap:round;stroke-linejoin:round;stop-color:#000000"
         id="path1388" />
      <path
         sodipodi:nodetypes="ccccccc"
         d="m 64.000031,186 2.003937,-2 h 22.01062 l 1.985443,1.99999 0,23.00001 h -26 z"
         style="font-variation-settings:normal;opacity:1;vector-effect:none;fill:url(#radialGradient1520);fill-opacity:1;stroke:none;stroke-width:29.9999;stroke-linecap:round;stroke-linejoin:round;stroke-miterlimit:4;stroke-dasharray:none;stroke-dashoffset:0;stroke-opacity:1;stop-color:#000000;stop-opacity:1"
         id="rect1396" />
      <path
         sodipodi:nodetypes="cccccc"
         d="m 64.000046,261 1.904352,-2 h 24.095648 v 25 h -26 z"
         style="font-variation-settings:normal;opacity:1;vector-effect:none;fill:url(#radialGradient994);fill-opacity:1;stroke:none;stroke-width:29.9999;stroke-linecap:round;stroke-linejoin:round;stroke-miterlimit:4;stroke-dasharray:none;stroke-dashoffset:0;stroke-opacity:1;stop-color:#000000;stop-opacity:1"
         id="rect1402" />
      <path
         id="path1434"
         style="opacity:1;fill:#a51d2d;fill-opacity:1;stroke:none;stroke-width:29.9999;stroke-linecap:round;stroke-linejoin:round;stop-color:#000000"
         d="m 90.000023,213 v -25 h 17.999997 c 4.432,0 8,3.568 8,8 v 17 z" />
      <rect
         ry="0"
         rx="0"
         y="209"
         x="90.000031"
         height="25"
         width="26"
         id="rect1392"
         style="opacity:1;fill:url(#radialGradient1516);fill-opacity:1;stroke:none;stroke-width:29.9999;stroke-linecap:round;stroke-linejoin:round;stop-color:#000000;font-variation-settings:normal;vector-effect:none;stroke-miterlimit:4;stroke-dasharray:none;stroke-dashoffset:0;stroke-opacity:1;stop-opacity:1" />
      <path
         sodipodi:nodetypes="cccccc"
         d="m 38.000015,184 h 24.016831 l 1.983169,2 v 23 h -26 z"
         style="font-variation-settings:normal;opacity:1;vector-effect:none;fill:url(#radialGradient1522);fill-opacity:1;stroke:none;stroke-width:29.9999;stroke-linecap:round;stroke-linejoin:round;stroke-miterlimit:4;stroke-dasharray:none;stroke-dashoffset:0;stroke-opacity:1;stop-color:#000000;stop-opacity:1"
         id="rect1404" />
      <rect
         style="opacity:1;fill:url(#radialGradient996);fill-opacity:1;stroke:none;stroke-width:29.9999;stroke-linecap:round;stroke-linejoin:round;stop-color:#000000;font-variation-settings:normal;vector-effect:none;stroke-miterlimit:4;stroke-dasharray:none;stroke-dashoffset:0;stroke-opacity:1;stop-opacity:1"
         id="rect1408"
         width="26"
         height="25"
         x="38.000031"
         y="234"
         rx="0"
         ry="0" />
      <rect
         ry="0"
         rx="0"
         y="259"
         x="38.000031"
         height="25"
         width="26"
         id="rect1410"
         style="opacity:1;fill:url(#radialGradient992);fill-opacity:1;stroke:none;stroke-width:29.9999;stroke-linecap:round;stroke-linejoin:round;stop-color:#000000;font-variation-settings:normal;vector-effect:none;stroke-miterlimit:4;stroke-dasharray:none;stroke-dashoffset:0;stroke-opacity:1;stop-opacity:1" />
      <path
         sodipodi:nodetypes="cccsscc"
         d="m 90.000023,209 v -23 l 2.004738,-2 h 15.995259 c 4.432,0 8,3.568 8,8 v 17 z"
         style="font-variation-settings:normal;opacity:1;vector-effect:none;fill:url(#radialGradient1491);fill-opacity:1;stroke:none;stroke-width:29.9999;stroke-linecap:round;stroke-linejoin:round;stroke-miterlimit:4;stroke-dasharray:none;stroke-dashoffset:0;stroke-opacity:1;stop-color:#000000;stop-opacity:1"
         id="path1416" />
      <path
         sodipodi:nodetypes="ccssccc"
         d="m 38.000039,261 v 23 h -18 c -4.432,0 -8,-3.568 -8,-8 v -17 h 24.056719 z"
         style="font-variation-settings:normal;opacity:1;vector-effect:none;fill:url(#radialGradient967);fill-opacity:1;stroke:none;stroke-width:29.9999;stroke-linecap:round;stroke-linejoin:round;stroke-miterlimit:4;stroke-dasharray:none;stroke-dashoffset:0;stroke-opacity:1;stop-color:#000000;stop-opacity:1"
         id="path1418" />
      <path
         id="rect1579"
         style="font-variation-settings:normal;display:inline;opacity:1;vector-effect:none;fill:#241f31;fill-opacity:1;stroke:none;stroke-width:29.9999;stroke-linecap:round;stroke-linejoin:round;stroke-miterlimit:4;stroke-dasharray:none;stroke-dashoffset:0;stroke-opacity:1;enable-background:new;stop-color:#000000;stop-opacity:1"
         d="m 163,173 v 4 h 8 v 4 h 4 v -4 -4 z" />
      <path
         id="rect1583"
         style="font-variation-settings:normal;display:inline;opacity:1;vector-effect:none;fill:#241f31;fill-opacity:1;stroke:none;stroke-width:29.9999;stroke-linecap:round;stroke-linejoin:round;stroke-miterlimit:4;stroke-dasharray:none;stroke-dashoffset:0;stroke-opacity:1;enable-background:new;stop-color:#000000;stop-opacity:1"
         d="m 165,179 v 4 h -4 v 4 h 12 v -4 h -4 v -4 z" />
    </g>
    <g
       sodipodi:insensitive="true"
       style="display:inline"
       inkscape:label="grid"
       id="layer3"
       inkscape:groupmode="layer">
      <circle
         style="display:inline;opacity:0.1;vector-effect:none;fill:none;fill-opacity:1;stroke:#000000;stroke-width:0.99000001;stroke-linecap:butt;stroke-linejoin:miter;stroke-miterlimit:4;stroke-dasharray:0.99000001, 0.99000001;stroke-dashoffset:0;stroke-opacity:1;marker:none;marker-start:none;marker-mid:none;marker-end:none;paint-order:normal;enable-background:new"
         id="circle2892"
         r="59.504131"
         cy="236"
         cx="64.000031" />
      <rect
         style="display:inline;opacity:0.1;vector-effect:none;fill:none;fill-opacity:1;stroke:#000000;stroke-width:0.99000001;stroke-linecap:butt;stroke-linejoin:miter;stroke-miterlimit:4;stroke-dasharray:0.99000001, 0.99000001;stroke-dashoffset:0;stroke-opacity:1;marker:none;marker-start:none;marker-mid:none;marker-end:none;paint-order:normal;enable-background:new"
         id="rect2894"
         width="87.009987"
         height="111.01005"
         x="20.495007"
         y="180.49496"
         rx="8.701004"
         ry="7.9292889" />
      <rect
         style="display:inline;opacity:0.1;vector-effect:none;fill:none;fill-opacity:1;stroke:#000000;stroke-width:0.99000001;stroke-linecap:butt;stroke-linejoin:miter;stroke-miterlimit:4;stroke-dasharray:0.99000001, 0.99000001;stroke-dashoffset:0;stroke-opacity:1;marker:none;marker-start:none;marker-mid:none;marker-end:none;paint-order:normal;enable-background:new"
         id="rect2896"
         width="103.00952"
         height="103.00952"
         x="12.495266"
         y="184.49524"
         rx="7.9238095"
         ry="7.9238095" />
      <rect
         style="display:inline;opacity:0.1;vector-effect:none;fill:none;fill-opacity:1;stroke:#000000;stroke-width:0.99000001;stroke-linecap:butt;stroke-linejoin:miter;stroke-miterlimit:4;stroke-dasharray:0.99000001, 0.99000001;stroke-dashoffset:0;stroke-opacity:1;marker:none;marker-start:none;marker-mid:none;marker-end:none;paint-order:normal;enable-background:new"
         id="rect2898"
         width="111.01004"
         height="87.010048"
         x="8.4950066"
         y="200.49496"
         rx="7.9292889"
         ry="8.701005" />
      <path
         style="display:inline;fill:none;stroke:#62a0ea;stroke-width:2;stroke-linecap:butt;stroke-linejoin:miter;stroke-miterlimit:4;stroke-dasharray:none;stroke-opacity:1;enable-background:new"
         d="M 2.6203015e-5,288.99999 H 128.00003"
         id="path2900"
         inkscape:connector-curvature="0" />
    </g>
  </g>
</svg>
