<?xml version="1.0" encoding="UTF-8" standalone="no"?>
<!-- Created with Inkscape (http://www.inkscape.org/) -->

<svg
   xmlns:dc="http://purl.org/dc/elements/1.1/"
   xmlns:cc="http://creativecommons.org/ns#"
   xmlns:rdf="http://www.w3.org/1999/02/22-rdf-syntax-ns#"
   xmlns:svg="http://www.w3.org/2000/svg"
   xmlns="http://www.w3.org/2000/svg"
   xmlns:xlink="http://www.w3.org/1999/xlink"
   xmlns:sodipodi="http://sodipodi.sourceforge.net/DTD/sodipodi-0.dtd"
   xmlns:inkscape="http://www.inkscape.org/namespaces/inkscape"
   inkscape:export-ydpi="96"
   inkscape:export-xdpi="96"
   inkscape:export-filename="Template.png"
   width="192"
   height="152"
   id="svg11300"
   sodipodi:version="0.32"
   inkscape:version="0.92.4 (5da689c313, 2019-01-14)"
   sodipodi:docname="com.github.taiko2k.Avvie.svg"
   inkscape:output_extension="org.inkscape.output.svg.inkscape"
   version="1.0"
   style="display:inline;enable-background:new"
   viewBox="0 0 192 152">
  <title
     id="title4162">Adwaita Icon Template</title>
  <defs
     id="defs3">
    <linearGradient
       id="linearGradient1057"
       inkscape:collect="always">
      <stop
         id="stop1044"
         offset="0"
         style="stop-color:#300c9d;stop-opacity:1" />
      <stop
         style="stop-color:#7b54f2;stop-opacity:1"
         offset="0.03846154"
         id="stop1046" />
      <stop
         id="stop1049"
         offset="0.07685554"
         style="stop-color:#300c9d;stop-opacity:1" />
      <stop
         style="stop-color:#300c9d;stop-opacity:1"
         offset="0.92307693"
         id="stop1051" />
      <stop
         id="stop1053"
         offset="0.96153849"
         style="stop-color:#c0bfbc;stop-opacity:1" />
      <stop
         id="stop1055"
         offset="1"
         style="stop-color:#77767b;stop-opacity:1" />
    </linearGradient>
    <linearGradient
       inkscape:collect="always"
       id="linearGradient1782">
      <stop
         style="stop-color:#7dd2a6;stop-opacity:1"
         offset="0"
         id="stop1778" />
      <stop
         style="stop-color:#7fd2a3;stop-opacity:0"
         offset="1"
         id="stop1780" />
    </linearGradient>
    <linearGradient
       id="linearGradient1752"
       inkscape:collect="always">
      <stop
         id="stop1748"
         offset="0"
         style="stop-color:#fcbd74;stop-opacity:1" />
      <stop
         id="stop1750"
         offset="1"
         style="stop-color:#19bcbd;stop-opacity:1" />
    </linearGradient>
    <linearGradient
       inkscape:collect="always"
       id="linearGradient1713">
      <stop
         style="stop-color:#0c92a1;stop-opacity:1"
         offset="0"
         id="stop1701" />
      <stop
         id="stop1703"
         offset="0.03846154"
         style="stop-color:#96edf7;stop-opacity:1" />
      <stop
         style="stop-color:#0c92a1;stop-opacity:1"
         offset="0.07685554"
         id="stop1705" />
      <stop
         id="stop1707"
         offset="0.92307693"
         style="stop-color:#0c92a1;stop-opacity:1" />
      <stop
         style="stop-color:#c0bfbc;stop-opacity:1"
         offset="0.96153849"
         id="stop1709" />
      <stop
         style="stop-color:#77767b;stop-opacity:1"
         offset="1"
         id="stop1711" />
    </linearGradient>
    <linearGradient
       inkscape:collect="always"
       id="linearGradient1113">
      <stop
         style="stop-color:#f9f06b;stop-opacity:1"
         offset="0"
         id="stop1109" />
      <stop
         style="stop-color:#f0358b;stop-opacity:1"
         offset="1"
         id="stop1111" />
    </linearGradient>
    <linearGradient
       id="linearGradient1096"
       inkscape:collect="always">
      <stop
         id="stop1092"
         offset="0"
         style="stop-color:#ffa108;stop-opacity:1" />
      <stop
         id="stop1094"
         offset="1"
         style="stop-color:#e01b24;stop-opacity:0" />
    </linearGradient>
    <linearGradient
       id="linearGradient1058"
       inkscape:collect="always">
      <stop
         id="stop1054"
         offset="0"
         style="stop-color:#f9f06b;stop-opacity:1" />
      <stop
         id="stop1056"
         offset="1"
         style="stop-color:#ed333b;stop-opacity:1" />
    </linearGradient>
    <linearGradient
       inkscape:collect="always"
       id="linearGradient1052">
      <stop
         style="stop-color:#2819c6;stop-opacity:1"
         offset="0"
         id="stop1048" />
      <stop
         style="stop-color:#e01b24;stop-opacity:0"
         offset="1"
         id="stop1050" />
    </linearGradient>
    <linearGradient
       id="linearGradient1008"
       inkscape:collect="always">
      <stop
         id="stop1004"
         offset="0"
         style="stop-color:#1a5fb4;stop-opacity:1" />
      <stop
         id="stop1006"
         offset="1"
         style="stop-color:#62a0ea;stop-opacity:0.00393701" />
    </linearGradient>
    <linearGradient
       inkscape:collect="always"
       id="linearGradient1002">
      <stop
         style="stop-color:#f8e45c;stop-opacity:1"
         offset="0"
         id="stop998" />
      <stop
         style="stop-color:#33d17a;stop-opacity:1"
         offset="1"
         id="stop1000" />
    </linearGradient>
    <linearGradient
       inkscape:collect="always"
       id="linearGradient1736">
      <stop
         style="stop-color:#bde8f7;stop-opacity:1"
         offset="0"
         id="stop1732" />
      <stop
         style="stop-color:#aedfde;stop-opacity:0.01568628"
         offset="1"
         id="stop1734" />
    </linearGradient>
    <linearGradient
       id="linearGradient1730"
       inkscape:collect="always">
      <stop
         id="stop1726"
         offset="0"
         style="stop-color:#fd86db;stop-opacity:1" />
      <stop
         id="stop1728"
         offset="1"
         style="stop-color:#102f9f;stop-opacity:1" />
    </linearGradient>
    <linearGradient
       id="linearGradient1690"
       inkscape:collect="always">
      <stop
         id="stop1677"
         offset="0"
         style="stop-color:#c0bfbc;stop-opacity:1" />
      <stop
         style="stop-color:#deddda;stop-opacity:1"
         offset="0.03846154"
         id="stop1679" />
      <stop
         id="stop1681"
         offset="0.07685554"
         style="stop-color:#c0bfbc;stop-opacity:1" />
      <stop
         style="stop-color:#c0bfbc;stop-opacity:1"
         offset="0.92307693"
         id="stop1683" />
      <stop
         id="stop1686"
         offset="0.96153849"
         style="stop-color:#c0bfbc;stop-opacity:1" />
      <stop
         id="stop1688"
         offset="1"
         style="stop-color:#77767b;stop-opacity:1" />
    </linearGradient>
    <linearGradient
       inkscape:collect="always"
       id="linearGradient1640">
      <stop
         style="stop-color:#cd29f7;stop-opacity:1"
         offset="0"
         id="stop1636" />
      <stop
         style="stop-color:#102f9f;stop-opacity:1"
         offset="1"
         id="stop1638" />
    </linearGradient>
    <linearGradient
       id="linearGradient1634"
       inkscape:collect="always">
      <stop
         id="stop1630"
         offset="0"
         style="stop-color:#3dbae6;stop-opacity:1" />
      <stop
         id="stop1632"
         offset="1"
         style="stop-color:#3d9c9a;stop-opacity:0.01568628" />
    </linearGradient>
    <linearGradient
       inkscape:collect="always"
       id="linearGradient1554">
      <stop
         style="stop-color:#000000;stop-opacity:1;"
         offset="0"
         id="stop1550" />
      <stop
         style="stop-color:#000000;stop-opacity:0;"
         offset="1"
         id="stop1552" />
    </linearGradient>
    <linearGradient
       id="linearGradient1515"
       inkscape:collect="always">
      <stop
         id="stop1503"
         offset="0"
         style="stop-color:#613583;stop-opacity:1" />
      <stop
         style="stop-color:#a347ba;stop-opacity:1"
         offset="0.03846154"
         id="stop1505" />
      <stop
         id="stop1507"
         offset="0.07685554"
         style="stop-color:#613583;stop-opacity:1" />
      <stop
         style="stop-color:#613583;stop-opacity:1"
         offset="0.92307693"
         id="stop1509" />
      <stop
         id="stop1511"
         offset="0.96153849"
         style="stop-color:#c0bfbc;stop-opacity:1" />
      <stop
         id="stop1513"
         offset="1"
         style="stop-color:#77767b;stop-opacity:1" />
    </linearGradient>
    <linearGradient
       inkscape:collect="always"
       id="linearGradient1073">
      <stop
         style="stop-color:#77767b;stop-opacity:1"
         offset="0"
         id="stop1060" />
      <stop
         id="stop1062"
         offset="0.03846154"
         style="stop-color:#c0bfbc;stop-opacity:1" />
      <stop
         style="stop-color:#9a9996;stop-opacity:1"
         offset="0.07685554"
         id="stop1064" />
      <stop
         id="stop1067"
         offset="0.92307693"
         style="stop-color:#9a9996;stop-opacity:1" />
      <stop
         style="stop-color:#c0bfbc;stop-opacity:1"
         offset="0.96153849"
         id="stop1069" />
      <stop
         style="stop-color:#77767b;stop-opacity:1"
         offset="1"
         id="stop1071" />
    </linearGradient>
    <linearGradient
       y2="236"
       x2="96"
       y1="236"
       x1="32"
       gradientTransform="translate(604.81684,170.58641)"
       gradientUnits="userSpaceOnUse"
       id="linearGradient1099"
       xlink:href="#linearGradient1036" />
    <linearGradient
       id="linearGradient1036">
      <stop
         id="stop1032"
         offset="0"
         style="stop-color:#d5d3cf;stop-opacity:1;" />
      <stop
         id="stop1034"
         offset="1"
         style="stop-color:#f6f5f4;stop-opacity:1" />
    </linearGradient>
    <radialGradient
       r="32"
       fy="-76"
       fx="-244"
       cy="-76"
       cx="-244"
       gradientTransform="matrix(0.88333331,0,0,0.88333331,-460.35018,463.11973)"
       gradientUnits="userSpaceOnUse"
       id="radialGradient1103"
       xlink:href="#linearGradient1069" />
    <linearGradient
       id="linearGradient1069">
      <stop
         id="stop1065"
         offset="0"
         style="stop-color:#d5d3cf;stop-opacity:1" />
      <stop
         id="stop1067-1"
         offset="1"
         style="stop-color:#949390;stop-opacity:1" />
    </linearGradient>
    <linearGradient
       gradientUnits="userSpaceOnUse"
       y2="232"
       x2="64"
       y1="262.5"
       x1="64"
       id="linearGradient1027"
       xlink:href="#linearGradient1025"
       gradientTransform="translate(-470.5864,432.81685)" />
    <linearGradient
       id="linearGradient1025">
      <stop
         id="stop1021"
         offset="0"
         style="stop-color:#9a9996;stop-opacity:1" />
      <stop
         id="stop1023"
         offset="1"
         style="stop-color:#77767b;stop-opacity:1" />
    </linearGradient>
    <inkscape:path-effect
       effect="spiro"
       id="path-effect35304-9"
       is_visible="true" />
    <clipPath
       clipPathUnits="userSpaceOnUse"
       id="clipPath1609-7">
      <path
         sodipodi:nodetypes="cccccc"
         inkscape:connector-curvature="0"
         id="path1611-5"
         d="m 252,116 28,-28 v -8 h -36 v 36 z"
         style="fill:#e74747;stroke:none;stroke-width:0.25px;stroke-linecap:butt;stroke-linejoin:miter;stroke-opacity:1" />
    </clipPath>
    <linearGradient
       id="linearGradient1697">
      <stop
         id="stop1685"
         offset="0"
         style="stop-color:#deddda;stop-opacity:1" />
      <stop
         style="stop-color:#eeeeec;stop-opacity:1"
         offset="0.04545455"
         id="stop1687" />
      <stop
         id="stop1689"
         offset="0.09090909"
         style="stop-color:#deddda;stop-opacity:1" />
      <stop
         style="stop-color:#deddda;stop-opacity:1"
         offset="0.90909094"
         id="stop1691" />
      <stop
         id="stop1693"
         offset="0.95454544"
         style="stop-color:#eeeeec;stop-opacity:1" />
      <stop
         id="stop1695"
         offset="1"
         style="stop-color:#c0bfbc;stop-opacity:1" />
    </linearGradient>
    <clipPath
       clipPathUnits="userSpaceOnUse"
       id="clipPath1289">
      <path
         style="display:inline;opacity:1;vector-effect:none;fill:none;fill-opacity:1;stroke:#000000;stroke-width:4;stroke-linecap:round;stroke-linejoin:round;stroke-miterlimit:4;stroke-dasharray:none;stroke-dashoffset:0;stroke-opacity:1;marker:none;marker-start:none;marker-mid:none;marker-end:none;paint-order:normal;enable-background:new"
         d="m 64,-148 h 64 l 64,-64 64,64 h 192 c 17.728,0 32,14.272 32,32 v 288 c 0,17.728 -14.272,32 -32,32 H 256 l -64,-64 -64,64 H 64 C 46.272,204 32,189.728 32,172 v -288 c 0,-17.728 14.408898,-34.19889 32,-32 z"
         id="path1291"
         inkscape:connector-curvature="0"
         sodipodi:nodetypes="scccsssscccssss" />
    </clipPath>
    <linearGradient
       id="paint3_linear-2-6-5"
       x2="1"
       gradientUnits="userSpaceOnUse"
       gradientTransform="matrix(0,6,-12,0,-64,209.99687)">
      <stop
         stop-color="#C01C27"
         id="stop91-0-7-4" />
      <stop
         offset="1"
         stop-color="#E01B24"
         id="stop93-2-5-7" />
    </linearGradient>
    <clipPath
       clipPathUnits="userSpaceOnUse"
       id="clipPath1609">
      <path
         sodipodi:nodetypes="cccccc"
         inkscape:connector-curvature="0"
         id="path1611"
         d="m 252,116 28,-28 v -8 h -36 v 36 z"
         style="fill:#e74747;stroke:none;stroke-width:0.25px;stroke-linecap:butt;stroke-linejoin:miter;stroke-opacity:1" />
    </clipPath>
    <linearGradient
       inkscape:collect="always"
       xlink:href="#linearGradient1073"
       id="linearGradient1546"
       gradientUnits="userSpaceOnUse"
       gradientTransform="matrix(0.21428571,0,0,0.30263158,-370.98484,418.00081)"
       x1="88.595886"
       y1="-449.39401"
       x2="536.59589"
       y2="-449.39401" />
    <linearGradient
       inkscape:collect="always"
       xlink:href="#linearGradient1515"
       id="linearGradient1548"
       gradientUnits="userSpaceOnUse"
       gradientTransform="matrix(0.23214285,0,0,0.32894738,-12.56691,437.82697)"
       x1="88.595886"
       y1="-449.39401"
       x2="536.59589"
       y2="-449.39401" />
    <radialGradient
       inkscape:collect="always"
       xlink:href="#linearGradient1096"
       id="radialGradient1572"
       gradientUnits="userSpaceOnUse"
       gradientTransform="matrix(1.4674201,0.84721548,-0.79740267,1.3811419,587.82814,182.33297)"
       cx="-331.31454"
       cy="230.00624"
       fx="-331.31454"
       fy="230.00624"
       r="48" />
    <radialGradient
       inkscape:collect="always"
       xlink:href="#linearGradient1640"
       id="radialGradient1718"
       gradientUnits="userSpaceOnUse"
       gradientTransform="matrix(2.3115027,0,0,2.2633464,391.45658,-317.90123)"
       cx="-292.47232"
       cy="266.72009"
       fx="-292.47232"
       fy="266.72009"
       r="48" />
    <radialGradient
       inkscape:collect="always"
       xlink:href="#linearGradient1634"
       id="radialGradient1720"
       gradientUnits="userSpaceOnUse"
       gradientTransform="matrix(1.3703012,0.85983496,-0.68634916,1.0938205,252.53081,253.01263)"
       cx="-329.94568"
       cy="231.1385"
       fx="-329.94568"
       fy="231.1385"
       r="48" />
    <radialGradient
       inkscape:collect="always"
       xlink:href="#linearGradient1554"
       id="radialGradient1722"
       gradientUnits="userSpaceOnUse"
       gradientTransform="matrix(1,0,0,0.97916667,0,4.8958333)"
       cx="-304"
       cy="235"
       fx="-304"
       fy="235"
       r="48" />
    <linearGradient
       inkscape:collect="always"
       xlink:href="#linearGradient1690"
       id="linearGradient1724"
       gradientUnits="userSpaceOnUse"
       gradientTransform="matrix(0.23214285,0,0,0.32894738,-12.56691,433.82697)"
       x1="88.595886"
       y1="-449.39401"
       x2="536.59589"
       y2="-449.39401" />
    <radialGradient
       inkscape:collect="always"
       xlink:href="#linearGradient1730"
       id="radialGradient982"
       gradientUnits="userSpaceOnUse"
       gradientTransform="matrix(2.3115027,0,0,2.2633464,391.45658,-317.90123)"
       cx="-292.47232"
       cy="266.72009"
       fx="-292.47232"
       fy="266.72009"
       r="48" />
    <radialGradient
       inkscape:collect="always"
       xlink:href="#linearGradient1736"
       id="radialGradient984"
       gradientUnits="userSpaceOnUse"
       gradientTransform="matrix(1.3703012,0.85983496,-0.68634916,1.0938205,252.53081,253.01263)"
       cx="-329.94568"
       cy="231.1385"
       fx="-329.94568"
       fy="231.1385"
       r="48" />
    <radialGradient
       inkscape:collect="always"
       xlink:href="#linearGradient1554"
       id="radialGradient986"
       gradientUnits="userSpaceOnUse"
       gradientTransform="matrix(1,0,0,0.97916667,0,4.8958333)"
       cx="-304"
       cy="235"
       fx="-304"
       fy="235"
       r="48" />
    <linearGradient
       inkscape:collect="always"
       xlink:href="#linearGradient1690"
       id="linearGradient988"
       gradientUnits="userSpaceOnUse"
       gradientTransform="matrix(0.23214285,0,0,0.32894738,-12.56691,433.82697)"
       x1="88.595886"
       y1="-449.39401"
       x2="536.59589"
       y2="-449.39401" />
    <radialGradient
       inkscape:collect="always"
       xlink:href="#linearGradient1002"
       id="radialGradient1036"
       gradientUnits="userSpaceOnUse"
       gradientTransform="matrix(2.3115027,0,0,2.2633464,391.45658,-317.90123)"
       cx="-292.47232"
       cy="266.72009"
       fx="-292.47232"
       fy="266.72009"
       r="48" />
    <radialGradient
       inkscape:collect="always"
       xlink:href="#linearGradient1008"
       id="radialGradient1038"
       gradientUnits="userSpaceOnUse"
       gradientTransform="matrix(1.3703012,0.85983496,-0.68634916,1.0938205,252.53082,253.01263)"
       cx="-329.94568"
       cy="231.1385"
       fx="-329.94568"
       fy="231.1385"
       r="48" />
    <linearGradient
       inkscape:collect="always"
       xlink:href="#linearGradient1690"
       id="linearGradient1040"
       gradientUnits="userSpaceOnUse"
       gradientTransform="matrix(0.23214285,0,0,0.32894738,-12.56691,433.82697)"
       x1="88.595886"
       y1="-449.39401"
       x2="536.59589"
       y2="-449.39401" />
    <radialGradient
       inkscape:collect="always"
       xlink:href="#linearGradient1058"
       id="radialGradient1086"
       gradientUnits="userSpaceOnUse"
       gradientTransform="matrix(2.3115027,0,0,2.2633464,391.45658,-317.90123)"
       cx="-292.47232"
       cy="266.72009"
       fx="-292.47232"
       fy="266.72009"
       r="48" />
    <radialGradient
       inkscape:collect="always"
       xlink:href="#linearGradient1052"
       id="radialGradient1088"
       gradientUnits="userSpaceOnUse"
       gradientTransform="matrix(1.4674201,0.84721556,-1.6290368,2.8215744,501.2162,-148.97546)"
       cx="-331.31454"
       cy="230.00624"
       fx="-331.31454"
       fy="230.00624"
       r="48" />
    <linearGradient
       inkscape:collect="always"
       xlink:href="#linearGradient1690"
       id="linearGradient1090"
       gradientUnits="userSpaceOnUse"
       gradientTransform="matrix(0.23214285,0,0,0.32894738,-12.56691,433.82697)"
       x1="88.595886"
       y1="-449.39401"
       x2="536.59589"
       y2="-449.39401" />
    <radialGradient
       inkscape:collect="always"
       xlink:href="#linearGradient1113"
       id="radialGradient1137"
       gradientUnits="userSpaceOnUse"
       gradientTransform="matrix(2.3585064,0,0,2.3093708,403.88145,-331.6462)"
       cx="-289.21332"
       cy="270.41824"
       fx="-289.21332"
       fy="270.41824"
       r="48" />
    <linearGradient
       inkscape:collect="always"
       xlink:href="#linearGradient1690"
       id="linearGradient1139"
       gradientUnits="userSpaceOnUse"
       gradientTransform="matrix(0.23214285,0,0,0.32894738,-12.56691,433.82697)"
       x1="88.595886"
       y1="-449.39401"
       x2="536.59589"
       y2="-449.39401" />
    <radialGradient
       inkscape:collect="always"
       xlink:href="#linearGradient1113"
       id="radialGradient1740"
       gradientUnits="userSpaceOnUse"
       gradientTransform="matrix(2.3585064,0,0,2.3093708,771.88145,-331.6462)"
       cx="-289.21332"
       cy="270.41824"
       fx="-289.21332"
       fy="270.41824"
       r="48" />
    <linearGradient
       inkscape:collect="always"
       xlink:href="#linearGradient1713"
       id="linearGradient1742"
       gradientUnits="userSpaceOnUse"
       gradientTransform="matrix(0.23214285,0,0,0.32894738,-12.56691,433.82697)"
       x1="88.595886"
       y1="-449.39401"
       x2="536.59589"
       y2="-449.39401" />
    <radialGradient
       inkscape:collect="always"
       xlink:href="#linearGradient1752"
       id="radialGradient1746"
       gradientUnits="userSpaceOnUse"
       gradientTransform="matrix(1.9974306,0,0,1.9558174,667.99479,-400.07004)"
       cx="-287.71426"
       cy="268.35263"
       fx="-287.71426"
       fy="268.35263"
       r="48" />
    <radialGradient
       inkscape:collect="always"
       xlink:href="#linearGradient1782"
       id="radialGradient1038-7"
       gradientUnits="userSpaceOnUse"
       gradientTransform="matrix(1.3703012,0.85983496,-0.68634916,1.0938205,620.53082,92.012629)"
       cx="-329.94568"
       cy="231.1385"
       fx="-329.94568"
       fy="231.1385"
       r="48" />
    <radialGradient
       inkscape:collect="always"
       xlink:href="#linearGradient1113"
       id="radialGradient1079"
       gradientUnits="userSpaceOnUse"
       gradientTransform="matrix(2.3585064,0,0,2.3093708,771.88145,-331.6462)"
       cx="-289.21332"
       cy="270.41824"
       fx="-289.21332"
       fy="270.41824"
       r="48" />
    <linearGradient
       inkscape:collect="always"
       xlink:href="#linearGradient1057"
       id="linearGradient1081"
       gradientUnits="userSpaceOnUse"
       gradientTransform="matrix(0.23214285,0,0,0.32894738,-12.56691,433.82697)"
       x1="88.595886"
       y1="-449.39401"
       x2="536.59589"
       y2="-449.39401" />
    <radialGradient
       inkscape:collect="always"
       xlink:href="#linearGradient1113"
       id="radialGradient1105"
       gradientUnits="userSpaceOnUse"
       gradientTransform="matrix(2.3585064,0,0,2.3093708,403.88145,-331.6462)"
       cx="-289.21332"
       cy="270.41824"
       fx="-289.21332"
       fy="270.41824"
       r="48" />
    <linearGradient
       inkscape:collect="always"
       xlink:href="#linearGradient1690"
       id="linearGradient1107"
       gradientUnits="userSpaceOnUse"
       gradientTransform="matrix(0.23214285,0,0,0.32894738,-12.56691,433.82697)"
       x1="88.595886"
       y1="-449.39401"
       x2="536.59589"
       y2="-449.39401" />
    <radialGradient
       inkscape:collect="always"
       xlink:href="#linearGradient1730"
       id="radialGradient1155"
       gradientUnits="userSpaceOnUse"
       gradientTransform="matrix(2.3115027,0,0,2.2633464,391.45658,-317.90123)"
       cx="-292.47232"
       cy="266.72009"
       fx="-292.47232"
       fy="266.72009"
       r="48" />
    <radialGradient
       inkscape:collect="always"
       xlink:href="#linearGradient1736"
       id="radialGradient1157"
       gradientUnits="userSpaceOnUse"
       gradientTransform="matrix(1.3703012,0.85983496,-0.68634916,1.0938205,252.53081,253.01263)"
       cx="-329.94568"
       cy="231.1385"
       fx="-329.94568"
       fy="231.1385"
       r="48" />
    <radialGradient
       inkscape:collect="always"
       xlink:href="#linearGradient1554"
       id="radialGradient1159"
       gradientUnits="userSpaceOnUse"
       gradientTransform="matrix(1,0,0,0.97916667,0,4.8958333)"
       cx="-304"
       cy="235"
       fx="-304"
       fy="235"
       r="48" />
    <linearGradient
       inkscape:collect="always"
       xlink:href="#linearGradient1690"
       id="linearGradient1161"
       gradientUnits="userSpaceOnUse"
       gradientTransform="matrix(0.23214285,0,0,0.32894738,-12.56691,433.82697)"
       x1="88.595886"
       y1="-449.39401"
       x2="536.59589"
       y2="-449.39401" />
  </defs>
  <sodipodi:namedview
     stroke="#ef2929"
     fill="#f57900"
     id="base"
     pagecolor="#ffffff"
     bordercolor="#666666"
     borderopacity="0.25490196"
     inkscape:pageopacity="0.0"
     inkscape:pageshadow="2"
     inkscape:zoom="1"
     inkscape:cx="-59.680848"
     inkscape:cy="140.07672"
     inkscape:current-layer="layer9"
     showgrid="false"
     inkscape:grid-bbox="true"
     inkscape:document-units="px"
     inkscape:showpageshadow="false"
     inkscape:window-width="1920"
     inkscape:window-height="1016"
     inkscape:window-x="0"
     inkscape:window-y="27"
     width="400px"
     height="300px"
     inkscape:snap-nodes="true"
     inkscape:snap-bbox="true"
     objecttolerance="7"
     gridtolerance="12"
     guidetolerance="13"
     inkscape:window-maximized="1"
     inkscape:pagecheckerboard="false"
     showguides="false"
     inkscape:guide-bbox="true"
     inkscape:locked="false"
     inkscape:measure-start="0,0"
     inkscape:measure-end="0,0"
     inkscape:object-nodes="true"
     inkscape:bbox-nodes="true"
     inkscape:snap-global="true"
     inkscape:object-paths="true"
     inkscape:snap-intersection-paths="true"
     inkscape:snap-bbox-edge-midpoints="true"
     inkscape:snap-bbox-midpoints="true"
     showborder="true"
     inkscape:snap-center="true"
     inkscape:snap-object-midpoints="true"
     inkscape:snap-midpoints="true"
     inkscape:snap-smooth-nodes="true"
     inkscape:snap-text-baseline="true"
     borderlayer="true">
    <inkscape:grid
       type="xygrid"
       id="grid5883"
       spacingx="2"
       spacingy="2"
       enabled="true"
       visible="true"
       empspacing="4"
       originx="8"
       originy="8" />
    <sodipodi:guide
       position="72,16"
       orientation="0,1"
       id="guide1073"
       inkscape:locked="false"
       inkscape:label=""
       inkscape:color="rgb(0,0,255)" />
    <sodipodi:guide
       position="20,72"
       orientation="1,0"
       id="guide1075"
       inkscape:locked="false"
       inkscape:label=""
       inkscape:color="rgb(0,0,255)" />
    <sodipodi:guide
       position="72,112"
       orientation="0,1"
       id="guide1099"
       inkscape:locked="false"
       inkscape:label=""
       inkscape:color="rgb(0,0,255)" />
    <sodipodi:guide
       position="72,136"
       orientation="0,1"
       id="guide993"
       inkscape:locked="false"
       inkscape:label=""
       inkscape:color="rgb(0,0,255)" />
    <sodipodi:guide
       position="112,72"
       orientation="1,0"
       id="guide995"
       inkscape:locked="false"
       inkscape:label=""
       inkscape:color="rgb(0,0,255)" />
    <sodipodi:guide
       position="8.0000001,72"
       orientation="1,0"
       id="guide867"
       inkscape:locked="false"
       inkscape:label=""
       inkscape:color="rgb(0,0,255)" />
    <sodipodi:guide
       position="128,72"
       orientation="1,0"
       id="guide869"
       inkscape:locked="false"
       inkscape:label=""
       inkscape:color="rgb(0,0,255)" />
    <sodipodi:guide
       position="72,124"
       orientation="0,1"
       id="guide871"
       inkscape:locked="false"
       inkscape:label=""
       inkscape:color="rgb(0,0,255)" />
    <inkscape:grid
       type="xygrid"
       id="grid873"
       spacingx="1"
       spacingy="1"
       empspacing="8"
       color="#000000"
       opacity="0.49019608"
       empcolor="#000000"
       empopacity="0.08627451"
       dotted="true"
       originx="8"
       originy="8" />
    <sodipodi:guide
       position="32,72"
       orientation="1,0"
       id="guide877"
       inkscape:locked="false"
       inkscape:label=""
       inkscape:color="rgb(0,0,255)" />
    <sodipodi:guide
       position="124,72"
       orientation="1,0"
       id="guide879"
       inkscape:locked="false"
       inkscape:label=""
       inkscape:color="rgb(0,0,255)" />
    <sodipodi:guide
       position="72,128"
       orientation="0,1"
       id="guide881"
       inkscape:locked="false"
       inkscape:label=""
       inkscape:color="rgb(0,0,255)" />
    <sodipodi:guide
       position="72,20"
       orientation="0,1"
       id="guide883"
       inkscape:locked="false"
       inkscape:label=""
       inkscape:color="rgb(0,0,255)" />
    <sodipodi:guide
       position="16,72"
       orientation="1,0"
       id="guide885"
       inkscape:locked="false"
       inkscape:label=""
       inkscape:color="rgb(0,0,255)" />
    <sodipodi:guide
       position="136,72"
       orientation="1,0"
       id="guide887"
       inkscape:locked="false"
       inkscape:label=""
       inkscape:color="rgb(0,0,255)" />
    <sodipodi:guide
       position="72,8"
       orientation="0,1"
       id="guide897"
       inkscape:locked="false"
       inkscape:label=""
       inkscape:color="rgb(0,0,255)" />
    <sodipodi:guide
       position="72,32"
       orientation="0,1"
       id="guide899"
       inkscape:locked="false"
       inkscape:label=""
       inkscape:color="rgb(0,0,255)" />
    <sodipodi:guide
       position="264,264"
       orientation="-0.70710678,0.70710678"
       id="guide950"
       inkscape:locked="false"
       inkscape:label=""
       inkscape:color="rgb(0,0,255)" />
    <sodipodi:guide
       position="72,72"
       orientation="0.70710678,0.70710678"
       id="guide952"
       inkscape:locked="false"
       inkscape:label=""
       inkscape:color="rgb(0,0,255)" />
  </sodipodi:namedview>
  <metadata
     id="metadata4">
    <rdf:RDF>
      <cc:Work
         rdf:about="">
        <dc:format>image/svg+xml</dc:format>
        <dc:type
           rdf:resource="http://purl.org/dc/dcmitype/StillImage" />
        <dc:creator>
          <cc:Agent>
            <dc:title>GNOME Design Team</dc:title>
          </cc:Agent>
        </dc:creator>
        <dc:source />
        <cc:license
           rdf:resource="http://creativecommons.org/licenses/by-sa/4.0/" />
        <dc:title>Adwaita Icon Template</dc:title>
        <dc:subject>
          <rdf:Bag />
        </dc:subject>
        <dc:date />
        <dc:rights>
          <cc:Agent>
            <dc:title />
          </cc:Agent>
        </dc:rights>
        <dc:publisher>
          <cc:Agent>
            <dc:title />
          </cc:Agent>
        </dc:publisher>
        <dc:identifier />
        <dc:relation />
        <dc:language />
        <dc:coverage />
        <dc:description />
        <dc:contributor>
          <cc:Agent>
            <dc:title />
          </cc:Agent>
        </dc:contributor>
      </cc:Work>
      <cc:License
         rdf:about="http://creativecommons.org/licenses/by-sa/4.0/">
        <cc:permits
           rdf:resource="http://creativecommons.org/ns#Reproduction" />
        <cc:permits
           rdf:resource="http://creativecommons.org/ns#Distribution" />
        <cc:requires
           rdf:resource="http://creativecommons.org/ns#Notice" />
        <cc:requires
           rdf:resource="http://creativecommons.org/ns#Attribution" />
        <cc:permits
           rdf:resource="http://creativecommons.org/ns#DerivativeWorks" />
        <cc:requires
           rdf:resource="http://creativecommons.org/ns#ShareAlike" />
      </cc:License>
    </rdf:RDF>
  </metadata>
  <g
     id="layer1"
     inkscape:label="App Icon"
     inkscape:groupmode="layer"
     style="display:inline"
     transform="translate(8,-156)">
    <g
       inkscape:groupmode="layer"
       id="layer4"
       inkscape:label="template (do not hide)"
       style="display:inline"
       sodipodi:insensitive="true">
      <rect
         inkscape:label="0"
         y="172"
         x="9.2651362e-08"
         height="128"
         width="128"
         id="hicolor"
         style="display:inline;overflow:visible;visibility:visible;fill:#f0f0f0;fill-opacity:0;fill-rule:nonzero;stroke:none;stroke-width:0.5;marker:none;enable-background:accumulate" />
      <rect
         style="display:inline;overflow:visible;visibility:visible;fill:#f0f0f0;fill-opacity:0;fill-rule:nonzero;stroke:none;stroke-width:0.5;marker:none;enable-background:accumulate"
         id="symbolic"
         width="16"
         height="16"
         x="160"
         y="172"
         inkscape:label="0" />
    </g>
    <g
       inkscape:groupmode="layer"
       id="layer2"
       inkscape:label="baseplate"
       style="display:none"
       sodipodi:insensitive="true">
      <g
         style="display:inline;fill:#000000;enable-background:new"
         transform="matrix(7.9911709,0,0,8.0036407,-167.7909,-4846.0776)"
         id="g12027"
         inkscape:export-xdpi="12"
         inkscape:export-ydpi="12" />
      <rect
         style="display:inline;overflow:visible;visibility:visible;fill:#f0f0f0;fill-opacity:1;fill-rule:nonzero;stroke:none;stroke-width:0.5;marker:none;enable-background:accumulate"
         id="128"
         width="128"
         height="128"
         x="9.2651362e-08"
         y="172"
         inkscape:label="0" />
      <g
         id="g883"
         style="fill:none;fill-opacity:0.25098039;stroke:#a579b3;stroke-opacity:1"
         transform="translate(-24,24)" />
      <g
         id="g900"
         style="fill:none;fill-opacity:0.25098039;stroke:#a579b3;stroke-opacity:1"
         transform="translate(-24,24)" />
      <rect
         inkscape:label=""
         y="172"
         x="160"
         height="16"
         width="16"
         id="16"
         style="display:inline;overflow:visible;visibility:visible;fill:#f0f0f0;fill-opacity:1;fill-rule:nonzero;stroke:none;stroke-width:0.5;marker:none;enable-background:accumulate" />
      <text
         xml:space="preserve"
         style="font-style:normal;font-variant:normal;font-weight:bold;font-stretch:normal;font-size:4px;line-height:125%;font-family:Cantarell;-inkscape-font-specification:'Cantarell, Bold';text-align:start;writing-mode:lr-tb;text-anchor:start;display:inline;fill:#000000;fill-opacity:1;stroke:none;stroke-width:0.33264872;enable-background:new"
         x="0"
         y="167"
         id="text863"
         inkscape:label="icon-name"><tspan
           style="font-size:4px;stroke-width:0.33264872"
           sodipodi:role="line"
           id="tspan861"
           x="0"
           y="167">Hicolor</tspan></text>
      <text
         inkscape:label="icon-name"
         id="text867"
         y="167"
         x="160"
         style="font-style:normal;font-variant:normal;font-weight:bold;font-stretch:normal;font-size:4px;line-height:125%;font-family:Cantarell;-inkscape-font-specification:'Cantarell, Bold';text-align:start;writing-mode:lr-tb;text-anchor:start;display:inline;fill:#000000;fill-opacity:1;stroke:none;stroke-width:0.33264872;enable-background:new"
         xml:space="preserve"><tspan
           y="167"
           x="160"
           id="tspan865"
           sodipodi:role="line"
           style="font-size:4px;stroke-width:0.33264872">Symbolic</tspan></text>
    </g>
    <g
       inkscape:groupmode="layer"
       id="layer9"
       inkscape:label="icons"
       style="display:inline">
      <g
         id="g1153">
        <g
           style="display:inline;fill:url(#radialGradient1159);fill-opacity:1;enable-background:new"
           id="g1143"
           transform="translate(368)">
          <rect
             style="display:inline;opacity:1;vector-effect:none;fill:#9561c0;fill-opacity:1;stroke:none;stroke-width:0.25;stroke-linecap:butt;stroke-linejoin:miter;stroke-miterlimit:4;stroke-dasharray:none;stroke-dashoffset:0;stroke-opacity:1;marker:none;marker-start:none;marker-mid:none;marker-end:none;paint-order:normal;enable-background:new"
             id="rect1137"
             width="96"
             height="92"
             x="-352"
             y="190"
             rx="7.9999995"
             ry="8" />
          <rect
             ry="7.9999995"
             rx="7.9999986"
             y="188"
             x="-352"
             height="91.999992"
             width="96"
             id="rect1139"
             style="display:inline;opacity:1;vector-effect:none;fill:url(#radialGradient1155);fill-opacity:1;stroke:none;stroke-width:0.25;stroke-linecap:butt;stroke-linejoin:miter;stroke-miterlimit:4;stroke-dasharray:none;stroke-dashoffset:0;stroke-opacity:1;marker:none;marker-start:none;marker-mid:none;marker-end:none;paint-order:normal;enable-background:new" />
          <rect
             style="display:inline;opacity:1;vector-effect:none;fill:url(#radialGradient1157);fill-opacity:1;stroke:none;stroke-width:0.25;stroke-linecap:butt;stroke-linejoin:miter;stroke-miterlimit:4;stroke-dasharray:none;stroke-dashoffset:0;stroke-opacity:1;marker:none;marker-start:none;marker-mid:none;marker-end:none;paint-order:normal;enable-background:new"
             id="rect1141"
             width="96"
             height="91.999992"
             x="-352"
             y="188"
             rx="7.9999986"
             ry="7.9999995" />
        </g>
        <path
           sodipodi:nodetypes="cssccsscc"
           inkscape:connector-curvature="0"
           style="display:inline;opacity:1;vector-effect:none;fill:#c0bfbc;fill-opacity:1;stroke:none;stroke-width:0.24999999;stroke-linecap:butt;stroke-linejoin:miter;stroke-miterlimit:4;stroke-dasharray:none;stroke-dashoffset:0;stroke-opacity:1;marker:none;marker-start:none;marker-mid:none;marker-end:none;paint-order:normal;enable-background:new"
           d="m 120,234 v -44 c 0,-4.432 -3.568,-8 -8,-8 H 64 v 12 h 42 c 1.108,0 2,0.892 2,2 v 38 z"
           id="path1145" />
        <path
           sodipodi:nodetypes="cssccsscc"
           inkscape:connector-curvature="0"
           id="path1147"
           d="m 8,234 v 44 c 0,4.432 3.568001,8 8,8 H 64 V 274 H 22 c -1.108,0 -2,-0.892 -2,-2 v -38 z"
           style="display:inline;opacity:1;vector-effect:none;fill:url(#linearGradient1161);fill-opacity:1;stroke:none;stroke-width:0.24999999;stroke-linecap:butt;stroke-linejoin:miter;stroke-miterlimit:4;stroke-dasharray:none;stroke-dashoffset:0;stroke-opacity:1;marker:none;marker-start:none;marker-mid:none;marker-end:none;paint-order:normal;enable-background:new" />
        <path
           inkscape:connector-curvature="0"
           id="path1149"
           d="m 8,232 v 44 c 0,4.432 3.568001,8 8,8 H 64 V 272 H 22 c -1.108,0 -2,-0.892 -2,-2 v -38 z"
           style="opacity:1;vector-effect:none;fill:#f6f5f4;fill-opacity:1;stroke:none;stroke-width:2;stroke-linecap:round;stroke-linejoin:round;stroke-miterlimit:4;stroke-dasharray:none;stroke-dashoffset:0;stroke-opacity:0.97637796" />
        <path
           inkscape:connector-curvature="0"
           style="opacity:1;vector-effect:none;fill:#f6f5f4;fill-opacity:1;stroke:none;stroke-width:2;stroke-linecap:round;stroke-linejoin:round;stroke-miterlimit:4;stroke-dasharray:none;stroke-dashoffset:0;stroke-opacity:0.97637796"
           d="m 120,232 v -44 c 0,-4.432 -3.568,-8 -8,-8 H 64 v 12 h 42 c 1.108,0 2,0.892 2,2 v 38 z"
           id="path1151" />
      </g>
      <g
         id="g1095"
         transform="translate(0,-380)">
        <rect
           transform="translate(368)"
           style="display:inline;opacity:1;vector-effect:none;fill:#e5a50a;fill-opacity:1;stroke:none;stroke-width:0.25;stroke-linecap:butt;stroke-linejoin:miter;stroke-miterlimit:4;stroke-dasharray:none;stroke-dashoffset:0;stroke-opacity:1;marker:none;marker-start:none;marker-mid:none;marker-end:none;paint-order:normal;enable-background:new"
           id="rect1083"
           width="96"
           height="92"
           x="-352"
           y="190"
           rx="7.9999995"
           ry="8" />
        <rect
           transform="translate(368)"
           ry="7.9999995"
           rx="7.9999986"
           y="188"
           x="-352"
           height="91.999992"
           width="96"
           id="rect1085"
           style="display:inline;opacity:1;vector-effect:none;fill:url(#radialGradient1105);fill-opacity:1;stroke:none;stroke-width:0.25;stroke-linecap:butt;stroke-linejoin:miter;stroke-miterlimit:4;stroke-dasharray:none;stroke-dashoffset:0;stroke-opacity:1;marker:none;marker-start:none;marker-mid:none;marker-end:none;paint-order:normal;enable-background:new" />
        <path
           sodipodi:nodetypes="cssccsscc"
           inkscape:connector-curvature="0"
           style="display:inline;opacity:1;vector-effect:none;fill:#c0bfbc;fill-opacity:1;stroke:none;stroke-width:0.24999999;stroke-linecap:butt;stroke-linejoin:miter;stroke-miterlimit:4;stroke-dasharray:none;stroke-dashoffset:0;stroke-opacity:1;marker:none;marker-start:none;marker-mid:none;marker-end:none;paint-order:normal;enable-background:new"
           d="m 120,234 v -44 c 0,-4.432 -3.568,-8 -8,-8 H 64 v 12 h 42 c 1.108,0 2,0.892 2,2 v 38 z"
           id="path1087" />
        <path
           sodipodi:nodetypes="cssccsscc"
           inkscape:connector-curvature="0"
           id="path1089"
           d="m 8,234 v 44 c 0,4.432 3.568001,8 8,8 H 64 V 274 H 22 c -1.108,0 -2,-0.892 -2,-2 v -38 z"
           style="display:inline;opacity:1;vector-effect:none;fill:url(#linearGradient1107);fill-opacity:1;stroke:none;stroke-width:0.24999999;stroke-linecap:butt;stroke-linejoin:miter;stroke-miterlimit:4;stroke-dasharray:none;stroke-dashoffset:0;stroke-opacity:1;marker:none;marker-start:none;marker-mid:none;marker-end:none;paint-order:normal;enable-background:new" />
        <path
           inkscape:connector-curvature="0"
           id="path1091"
           d="m 8,232 v 44 c 0,4.432 3.568001,8 8,8 H 64 V 272 H 22 c -1.108,0 -2,-0.892 -2,-2 v -38 z"
           style="opacity:1;vector-effect:none;fill:#f6f5f4;fill-opacity:1;stroke:none;stroke-width:2;stroke-linecap:round;stroke-linejoin:round;stroke-miterlimit:4;stroke-dasharray:none;stroke-dashoffset:0;stroke-opacity:0.97637796" />
        <path
           inkscape:connector-curvature="0"
           style="opacity:1;vector-effect:none;fill:#f6f5f4;fill-opacity:1;stroke:none;stroke-width:2;stroke-linecap:round;stroke-linejoin:round;stroke-miterlimit:4;stroke-dasharray:none;stroke-dashoffset:0;stroke-opacity:0.97637796"
           d="m 120,232 v -44 c 0,-4.432 -3.568,-8 -8,-8 H 64 v 12 h 42 c 1.108,0 2,0.892 2,2 v 38 z"
           id="path1093" />
      </g>
      <g
         id="g1544"
         transform="translate(-190)">
        <g
           transform="translate(368)"
           id="g1527"
           style="display:inline;enable-background:new">
          <rect
             ry="8"
             rx="7.9999995"
             y="190"
             x="-352"
             height="92"
             width="96"
             id="rect1523"
             style="display:inline;opacity:1;vector-effect:none;fill:url(#linearGradient1546);fill-opacity:1;stroke:none;stroke-width:0.25;stroke-linecap:butt;stroke-linejoin:miter;stroke-miterlimit:4;stroke-dasharray:none;stroke-dashoffset:0;stroke-opacity:1;marker:none;marker-start:none;marker-mid:none;marker-end:none;paint-order:normal;enable-background:new" />
          <rect
             style="display:inline;opacity:1;vector-effect:none;fill:#deddda;fill-opacity:1;stroke:none;stroke-width:0.25;stroke-linecap:butt;stroke-linejoin:miter;stroke-miterlimit:4;stroke-dasharray:none;stroke-dashoffset:0;stroke-opacity:1;marker:none;marker-start:none;marker-mid:none;marker-end:none;paint-order:normal;enable-background:new"
             id="rect1525"
             width="96"
             height="91.999992"
             x="-352"
             y="188"
             rx="7.9999986"
             ry="7.9999995" />
        </g>
        <path
           id="path1529"
           d="m 120,234 v -44 c 0,-4.432 -3.568,-8 -8,-8 H 64 v 12 h 42 c 1.108,0 2,0.892 2,2 v 38 z"
           style="display:inline;opacity:1;vector-effect:none;fill:#613583;fill-opacity:1;stroke:none;stroke-width:0.24999999;stroke-linecap:butt;stroke-linejoin:miter;stroke-miterlimit:4;stroke-dasharray:none;stroke-dashoffset:0;stroke-opacity:1;marker:none;marker-start:none;marker-mid:none;marker-end:none;paint-order:normal;enable-background:new"
           inkscape:connector-curvature="0"
           sodipodi:nodetypes="cssccsscc" />
        <path
           style="display:inline;opacity:1;vector-effect:none;fill:url(#linearGradient1548);fill-opacity:1;stroke:none;stroke-width:0.24999999;stroke-linecap:butt;stroke-linejoin:miter;stroke-miterlimit:4;stroke-dasharray:none;stroke-dashoffset:0;stroke-opacity:1;marker:none;marker-start:none;marker-mid:none;marker-end:none;paint-order:normal;enable-background:new"
           d="m 8,238 v 44 c 0,4.432 3.568001,8 8,8 H 64 V 278 H 22 c -1.108,0 -2,-0.892 -2,-2 v -38 z"
           id="path1531"
           inkscape:connector-curvature="0"
           sodipodi:nodetypes="cssccsscc" />
        <path
           style="opacity:1;vector-effect:none;fill:#c061cb;fill-opacity:1;stroke:none;stroke-width:2;stroke-linecap:round;stroke-linejoin:round;stroke-miterlimit:4;stroke-dasharray:none;stroke-dashoffset:0;stroke-opacity:0.97637796"
           d="m 16,80 v 44 c 0,4.432 3.568001,8 8,8 H 72 V 120 H 30 c -1.108,0 -2,-0.892 -2,-2 V 80 Z"
           transform="translate(-8,156)"
           id="path1533"
           inkscape:connector-curvature="0" />
        <path
           id="path1535"
           d="m 120,232 v -44 c 0,-4.432 -3.568,-8 -8,-8 H 64 v 12 h 42 c 1.108,0 2,0.892 2,2 v 38 z"
           style="opacity:1;vector-effect:none;fill:#c061cb;fill-opacity:1;stroke:none;stroke-width:2;stroke-linecap:round;stroke-linejoin:round;stroke-miterlimit:4;stroke-dasharray:none;stroke-dashoffset:0;stroke-opacity:0.97637796"
           inkscape:connector-curvature="0" />
      </g>
      <g
         id="g1716"
         transform="translate(-330)">
        <g
           transform="translate(368)"
           id="g1698"
           style="display:inline;fill:url(#radialGradient1722);fill-opacity:1;enable-background:new">
          <rect
             ry="8"
             rx="7.9999995"
             y="190"
             x="-352"
             height="92"
             width="96"
             id="rect1692"
             style="display:inline;opacity:1;vector-effect:none;fill:#73119d;fill-opacity:1;stroke:none;stroke-width:0.25;stroke-linecap:butt;stroke-linejoin:miter;stroke-miterlimit:4;stroke-dasharray:none;stroke-dashoffset:0;stroke-opacity:1;marker:none;marker-start:none;marker-mid:none;marker-end:none;paint-order:normal;enable-background:new" />
          <rect
             style="display:inline;opacity:1;vector-effect:none;fill:url(#radialGradient1718);fill-opacity:1;stroke:none;stroke-width:0.25;stroke-linecap:butt;stroke-linejoin:miter;stroke-miterlimit:4;stroke-dasharray:none;stroke-dashoffset:0;stroke-opacity:1;marker:none;marker-start:none;marker-mid:none;marker-end:none;paint-order:normal;enable-background:new"
             id="rect1694"
             width="96"
             height="91.999992"
             x="-352"
             y="188"
             rx="7.9999986"
             ry="7.9999995" />
          <rect
             ry="7.9999995"
             rx="7.9999986"
             y="188"
             x="-352"
             height="91.999992"
             width="96"
             id="rect1696"
             style="display:inline;opacity:1;vector-effect:none;fill:url(#radialGradient1720);fill-opacity:1;stroke:none;stroke-width:0.25;stroke-linecap:butt;stroke-linejoin:miter;stroke-miterlimit:4;stroke-dasharray:none;stroke-dashoffset:0;stroke-opacity:1;marker:none;marker-start:none;marker-mid:none;marker-end:none;paint-order:normal;enable-background:new" />
        </g>
        <path
           id="path1700"
           d="m 120,234 v -44 c 0,-4.432 -3.568,-8 -8,-8 H 64 v 12 h 42 c 1.108,0 2,0.892 2,2 v 38 z"
           style="display:inline;opacity:1;vector-effect:none;fill:#c0bfbc;fill-opacity:1;stroke:none;stroke-width:0.24999999;stroke-linecap:butt;stroke-linejoin:miter;stroke-miterlimit:4;stroke-dasharray:none;stroke-dashoffset:0;stroke-opacity:1;marker:none;marker-start:none;marker-mid:none;marker-end:none;paint-order:normal;enable-background:new"
           inkscape:connector-curvature="0"
           sodipodi:nodetypes="cssccsscc" />
        <path
           style="display:inline;opacity:1;vector-effect:none;fill:url(#linearGradient1724);fill-opacity:1;stroke:none;stroke-width:0.24999999;stroke-linecap:butt;stroke-linejoin:miter;stroke-miterlimit:4;stroke-dasharray:none;stroke-dashoffset:0;stroke-opacity:1;marker:none;marker-start:none;marker-mid:none;marker-end:none;paint-order:normal;enable-background:new"
           d="m 8,234 v 44 c 0,4.432 3.568001,8 8,8 H 64 V 274 H 22 c -1.108,0 -2,-0.892 -2,-2 v -38 z"
           id="path1702"
           inkscape:connector-curvature="0"
           sodipodi:nodetypes="cssccsscc" />
        <path
           style="opacity:1;vector-effect:none;fill:#f6f5f4;fill-opacity:1;stroke:none;stroke-width:2;stroke-linecap:round;stroke-linejoin:round;stroke-miterlimit:4;stroke-dasharray:none;stroke-dashoffset:0;stroke-opacity:0.97637796"
           d="m 8,232 v 44 c 0,4.432 3.568001,8 8,8 H 64 V 272 H 22 c -1.108,0 -2,-0.892 -2,-2 v -38 z"
           id="path1704"
           inkscape:connector-curvature="0" />
        <path
           id="path1706"
           d="m 120,232 v -44 c 0,-4.432 -3.568,-8 -8,-8 H 64 v 12 h 42 c 1.108,0 2,0.892 2,2 v 38 z"
           style="opacity:1;vector-effect:none;fill:#f6f5f4;fill-opacity:1;stroke:none;stroke-width:2;stroke-linecap:round;stroke-linejoin:round;stroke-miterlimit:4;stroke-dasharray:none;stroke-dashoffset:0;stroke-opacity:0.97637796"
           inkscape:connector-curvature="0" />
      </g>
      <path
         style="color:#000000;font-style:normal;font-variant:normal;font-weight:normal;font-stretch:normal;font-size:medium;line-height:normal;font-family:sans-serif;font-variant-ligatures:normal;font-variant-position:normal;font-variant-caps:normal;font-variant-numeric:normal;font-variant-alternates:normal;font-feature-settings:normal;text-indent:0;text-align:start;text-decoration:none;text-decoration-line:none;text-decoration-style:solid;text-decoration-color:#000000;letter-spacing:normal;word-spacing:normal;text-transform:none;writing-mode:lr-tb;direction:ltr;text-orientation:mixed;dominant-baseline:auto;baseline-shift:baseline;text-anchor:start;white-space:normal;shape-padding:0;clip-rule:nonzero;display:inline;overflow:visible;visibility:visible;opacity:1;isolation:auto;mix-blend-mode:normal;color-interpolation:sRGB;color-interpolation-filters:linearRGB;solid-color:#000000;solid-opacity:1;vector-effect:none;fill:#000000;fill-opacity:1;fill-rule:nonzero;stroke:none;stroke-width:2;stroke-linecap:butt;stroke-linejoin:miter;stroke-miterlimit:4;stroke-dasharray:none;stroke-dashoffset:0;stroke-opacity:1;color-rendering:auto;image-rendering:auto;shape-rendering:auto;text-rendering:auto;enable-background:accumulate"
         d="m 161,180 v 7 h 7 v -2 h -5 v -5 z"
         id="path1738"
         inkscape:connector-curvature="0" />
      <path
         style="color:#000000;font-style:normal;font-variant:normal;font-weight:normal;font-stretch:normal;font-size:medium;line-height:normal;font-family:sans-serif;font-variant-ligatures:normal;font-variant-position:normal;font-variant-caps:normal;font-variant-numeric:normal;font-variant-alternates:normal;font-feature-settings:normal;text-indent:0;text-align:start;text-decoration:none;text-decoration-line:none;text-decoration-style:solid;text-decoration-color:#000000;letter-spacing:normal;word-spacing:normal;text-transform:none;writing-mode:lr-tb;direction:ltr;text-orientation:mixed;dominant-baseline:auto;baseline-shift:baseline;text-anchor:start;white-space:normal;shape-padding:0;clip-rule:nonzero;display:inline;overflow:visible;visibility:visible;opacity:1;isolation:auto;mix-blend-mode:normal;color-interpolation:sRGB;color-interpolation-filters:linearRGB;solid-color:#000000;solid-opacity:1;vector-effect:none;fill:#000000;fill-opacity:1;fill-rule:nonzero;stroke:none;stroke-width:2;stroke-linecap:butt;stroke-linejoin:miter;stroke-miterlimit:4;stroke-dasharray:none;stroke-dashoffset:0;stroke-opacity:1;color-rendering:auto;image-rendering:auto;shape-rendering:auto;text-rendering:auto;enable-background:accumulate"
         d="m 168,173 v 2 h 5 v 5 h 2 v -7 z"
         id="path1740"
         inkscape:connector-curvature="0" />
      <rect
         style="opacity:1;vector-effect:none;fill:#000000;fill-opacity:1;stroke:none;stroke-width:2;stroke-linecap:round;stroke-linejoin:round;stroke-miterlimit:4;stroke-dasharray:none;stroke-dashoffset:0;stroke-opacity:0.97637796"
         id="rect1742"
         width="6"
         height="6"
         x="165"
         y="177" />
      <g
         id="g980"
         transform="translate(-470)">
        <g
           transform="translate(368)"
           id="g962"
           style="display:inline;fill:url(#radialGradient986);fill-opacity:1;enable-background:new">
          <rect
             ry="8"
             rx="7.9999995"
             y="190"
             x="-352"
             height="92"
             width="96"
             id="rect956"
             style="display:inline;opacity:1;vector-effect:none;fill:#9561c0;fill-opacity:1;stroke:none;stroke-width:0.25;stroke-linecap:butt;stroke-linejoin:miter;stroke-miterlimit:4;stroke-dasharray:none;stroke-dashoffset:0;stroke-opacity:1;marker:none;marker-start:none;marker-mid:none;marker-end:none;paint-order:normal;enable-background:new" />
          <rect
             style="display:inline;opacity:1;vector-effect:none;fill:url(#radialGradient982);fill-opacity:1;stroke:none;stroke-width:0.25;stroke-linecap:butt;stroke-linejoin:miter;stroke-miterlimit:4;stroke-dasharray:none;stroke-dashoffset:0;stroke-opacity:1;marker:none;marker-start:none;marker-mid:none;marker-end:none;paint-order:normal;enable-background:new"
             id="rect958"
             width="96"
             height="91.999992"
             x="-352"
             y="188"
             rx="7.9999986"
             ry="7.9999995" />
          <rect
             ry="7.9999995"
             rx="7.9999986"
             y="188"
             x="-352"
             height="91.999992"
             width="96"
             id="rect960"
             style="display:inline;opacity:1;vector-effect:none;fill:url(#radialGradient984);fill-opacity:1;stroke:none;stroke-width:0.25;stroke-linecap:butt;stroke-linejoin:miter;stroke-miterlimit:4;stroke-dasharray:none;stroke-dashoffset:0;stroke-opacity:1;marker:none;marker-start:none;marker-mid:none;marker-end:none;paint-order:normal;enable-background:new" />
        </g>
        <path
           id="path964"
           d="m 120,234 v -44 c 0,-4.432 -3.568,-8 -8,-8 H 64 v 12 h 42 c 1.108,0 2,0.892 2,2 v 38 z"
           style="display:inline;opacity:1;vector-effect:none;fill:#c0bfbc;fill-opacity:1;stroke:none;stroke-width:0.24999999;stroke-linecap:butt;stroke-linejoin:miter;stroke-miterlimit:4;stroke-dasharray:none;stroke-dashoffset:0;stroke-opacity:1;marker:none;marker-start:none;marker-mid:none;marker-end:none;paint-order:normal;enable-background:new"
           inkscape:connector-curvature="0"
           sodipodi:nodetypes="cssccsscc" />
        <path
           style="display:inline;opacity:1;vector-effect:none;fill:url(#linearGradient988);fill-opacity:1;stroke:none;stroke-width:0.24999999;stroke-linecap:butt;stroke-linejoin:miter;stroke-miterlimit:4;stroke-dasharray:none;stroke-dashoffset:0;stroke-opacity:1;marker:none;marker-start:none;marker-mid:none;marker-end:none;paint-order:normal;enable-background:new"
           d="m 8,234 v 44 c 0,4.432 3.568001,8 8,8 H 64 V 274 H 22 c -1.108,0 -2,-0.892 -2,-2 v -38 z"
           id="path966"
           inkscape:connector-curvature="0"
           sodipodi:nodetypes="cssccsscc" />
        <path
           style="opacity:1;vector-effect:none;fill:#f6f5f4;fill-opacity:1;stroke:none;stroke-width:2;stroke-linecap:round;stroke-linejoin:round;stroke-miterlimit:4;stroke-dasharray:none;stroke-dashoffset:0;stroke-opacity:0.97637796"
           d="m 8,232 v 44 c 0,4.432 3.568001,8 8,8 H 64 V 272 H 22 c -1.108,0 -2,-0.892 -2,-2 v -38 z"
           id="path968"
           inkscape:connector-curvature="0" />
        <path
           id="path970"
           d="m 120,232 v -44 c 0,-4.432 -3.568,-8 -8,-8 H 64 v 12 h 42 c 1.108,0 2,0.892 2,2 v 38 z"
           style="opacity:1;vector-effect:none;fill:#f6f5f4;fill-opacity:1;stroke:none;stroke-width:2;stroke-linecap:round;stroke-linejoin:round;stroke-miterlimit:4;stroke-dasharray:none;stroke-dashoffset:0;stroke-opacity:0.97637796"
           inkscape:connector-curvature="0" />
      </g>
      <g
         id="g996">
        <path
           style="color:#000000;font-style:normal;font-variant:normal;font-weight:normal;font-stretch:normal;font-size:medium;line-height:normal;font-family:sans-serif;font-variant-ligatures:normal;font-variant-position:normal;font-variant-caps:normal;font-variant-numeric:normal;font-variant-alternates:normal;font-feature-settings:normal;text-indent:0;text-align:start;text-decoration:none;text-decoration-line:none;text-decoration-style:solid;text-decoration-color:#000000;letter-spacing:normal;word-spacing:normal;text-transform:none;writing-mode:lr-tb;direction:ltr;text-orientation:mixed;dominant-baseline:auto;baseline-shift:baseline;text-anchor:start;white-space:normal;shape-padding:0;clip-rule:nonzero;display:inline;overflow:visible;visibility:visible;opacity:1;isolation:auto;mix-blend-mode:normal;color-interpolation:sRGB;color-interpolation-filters:linearRGB;solid-color:#000000;solid-opacity:1;vector-effect:none;fill:#000000;fill-opacity:1;fill-rule:nonzero;stroke:none;stroke-width:2;stroke-linecap:butt;stroke-linejoin:miter;stroke-miterlimit:4;stroke-dasharray:none;stroke-dashoffset:0;stroke-opacity:1;color-rendering:auto;image-rendering:auto;shape-rendering:auto;text-rendering:auto;enable-background:accumulate"
           d="m 211,180 v 7 h 7 v -2 h -5 v -5 z"
           id="path990"
           inkscape:connector-curvature="0" />
        <path
           style="color:#000000;font-style:normal;font-variant:normal;font-weight:normal;font-stretch:normal;font-size:medium;line-height:normal;font-family:sans-serif;font-variant-ligatures:normal;font-variant-position:normal;font-variant-caps:normal;font-variant-numeric:normal;font-variant-alternates:normal;font-feature-settings:normal;text-indent:0;text-align:start;text-decoration:none;text-decoration-line:none;text-decoration-style:solid;text-decoration-color:#000000;letter-spacing:normal;word-spacing:normal;text-transform:none;writing-mode:lr-tb;direction:ltr;text-orientation:mixed;dominant-baseline:auto;baseline-shift:baseline;text-anchor:start;white-space:normal;shape-padding:0;clip-rule:nonzero;display:inline;overflow:visible;visibility:visible;opacity:1;isolation:auto;mix-blend-mode:normal;color-interpolation:sRGB;color-interpolation-filters:linearRGB;solid-color:#000000;solid-opacity:1;vector-effect:none;fill:#000000;fill-opacity:1;fill-rule:nonzero;stroke:none;stroke-width:2;stroke-linecap:butt;stroke-linejoin:miter;stroke-miterlimit:4;stroke-dasharray:none;stroke-dashoffset:0;stroke-opacity:1;color-rendering:auto;image-rendering:auto;shape-rendering:auto;text-rendering:auto;enable-background:accumulate"
           d="m 218,173 v 2 h 5 v 5 h 2 v -7 z"
           id="path992"
           inkscape:connector-curvature="0" />
      </g>
      <g
         id="g1034"
         transform="translate(-610)">
        <rect
           ry="8"
           rx="7.9999995"
           y="190"
           x="-352"
           height="92"
           width="96"
           id="rect1010"
           style="display:inline;opacity:1;vector-effect:none;fill:#a0d56b;fill-opacity:1;stroke:none;stroke-width:0.25;stroke-linecap:butt;stroke-linejoin:miter;stroke-miterlimit:4;stroke-dasharray:none;stroke-dashoffset:0;stroke-opacity:1;marker:none;marker-start:none;marker-mid:none;marker-end:none;paint-order:normal;enable-background:new"
           transform="translate(368)" />
        <rect
           style="display:inline;opacity:1;vector-effect:none;fill:url(#radialGradient1036);fill-opacity:1;stroke:none;stroke-width:0.25;stroke-linecap:butt;stroke-linejoin:miter;stroke-miterlimit:4;stroke-dasharray:none;stroke-dashoffset:0;stroke-opacity:1;marker:none;marker-start:none;marker-mid:none;marker-end:none;paint-order:normal;enable-background:new"
           id="rect1012"
           width="96"
           height="91.999992"
           x="-352"
           y="188"
           rx="7.9999986"
           ry="7.9999995"
           transform="translate(368)" />
        <rect
           ry="7.9999995"
           rx="7.9999986"
           y="188"
           x="-352"
           height="91.999992"
           width="96"
           id="rect1014"
           style="display:inline;opacity:1;vector-effect:none;fill:url(#radialGradient1038);fill-opacity:1;stroke:none;stroke-width:0.25;stroke-linecap:butt;stroke-linejoin:miter;stroke-miterlimit:4;stroke-dasharray:none;stroke-dashoffset:0;stroke-opacity:1;marker:none;marker-start:none;marker-mid:none;marker-end:none;paint-order:normal;enable-background:new"
           transform="translate(368)" />
        <path
           id="path1016"
           d="m 120,234 v -44 c 0,-4.432 -3.568,-8 -8,-8 H 64 v 12 h 42 c 1.108,0 2,0.892 2,2 v 38 z"
           style="display:inline;opacity:1;vector-effect:none;fill:#c0bfbc;fill-opacity:1;stroke:none;stroke-width:0.24999999;stroke-linecap:butt;stroke-linejoin:miter;stroke-miterlimit:4;stroke-dasharray:none;stroke-dashoffset:0;stroke-opacity:1;marker:none;marker-start:none;marker-mid:none;marker-end:none;paint-order:normal;enable-background:new"
           inkscape:connector-curvature="0"
           sodipodi:nodetypes="cssccsscc" />
        <path
           style="display:inline;opacity:1;vector-effect:none;fill:url(#linearGradient1040);fill-opacity:1;stroke:none;stroke-width:0.24999999;stroke-linecap:butt;stroke-linejoin:miter;stroke-miterlimit:4;stroke-dasharray:none;stroke-dashoffset:0;stroke-opacity:1;marker:none;marker-start:none;marker-mid:none;marker-end:none;paint-order:normal;enable-background:new"
           d="m 8,234 v 44 c 0,4.432 3.568001,8 8,8 H 64 V 274 H 22 c -1.108,0 -2,-0.892 -2,-2 v -38 z"
           id="path1018"
           inkscape:connector-curvature="0"
           sodipodi:nodetypes="cssccsscc" />
        <path
           style="opacity:1;vector-effect:none;fill:#f6f5f4;fill-opacity:1;stroke:none;stroke-width:2;stroke-linecap:round;stroke-linejoin:round;stroke-miterlimit:4;stroke-dasharray:none;stroke-dashoffset:0;stroke-opacity:0.97637796"
           d="m 8,232 v 44 c 0,4.432 3.568001,8 8,8 H 64 V 272 H 22 c -1.108,0 -2,-0.892 -2,-2 v -38 z"
           id="path1020"
           inkscape:connector-curvature="0" />
        <path
           id="path1022"
           d="m 120,232 v -44 c 0,-4.432 -3.568,-8 -8,-8 H 64 v 12 h 42 c 1.108,0 2,0.892 2,2 v 38 z"
           style="opacity:1;vector-effect:none;fill:#f6f5f4;fill-opacity:1;stroke:none;stroke-width:2;stroke-linecap:round;stroke-linejoin:round;stroke-miterlimit:4;stroke-dasharray:none;stroke-dashoffset:0;stroke-opacity:0.97637796"
           inkscape:connector-curvature="0" />
      </g>
      <g
         id="g1084"
         transform="translate(-760)">
        <rect
           ry="8"
           rx="7.9999995"
           y="190"
           x="-352"
           height="92"
           width="96"
           id="rect1060"
           style="display:inline;opacity:1;vector-effect:none;fill:#e5a50a;fill-opacity:1;stroke:none;stroke-width:0.25;stroke-linecap:butt;stroke-linejoin:miter;stroke-miterlimit:4;stroke-dasharray:none;stroke-dashoffset:0;stroke-opacity:1;marker:none;marker-start:none;marker-mid:none;marker-end:none;paint-order:normal;enable-background:new"
           transform="translate(368)" />
        <rect
           style="display:inline;opacity:1;vector-effect:none;fill:url(#radialGradient1086);fill-opacity:1;stroke:none;stroke-width:0.25;stroke-linecap:butt;stroke-linejoin:miter;stroke-miterlimit:4;stroke-dasharray:none;stroke-dashoffset:0;stroke-opacity:1;marker:none;marker-start:none;marker-mid:none;marker-end:none;paint-order:normal;enable-background:new"
           id="rect1062"
           width="96"
           height="91.999992"
           x="-352"
           y="188"
           rx="7.9999986"
           ry="7.9999995"
           transform="translate(368)" />
        <rect
           ry="7.9999995"
           rx="7.9999986"
           y="188"
           x="-352"
           height="91.999992"
           width="96"
           id="rect1064"
           style="display:inline;opacity:1;vector-effect:none;fill:url(#radialGradient1088);fill-opacity:1;stroke:none;stroke-width:0.25;stroke-linecap:butt;stroke-linejoin:miter;stroke-miterlimit:4;stroke-dasharray:none;stroke-dashoffset:0;stroke-opacity:1;marker:none;marker-start:none;marker-mid:none;marker-end:none;paint-order:normal;enable-background:new"
           transform="translate(368)" />
        <path
           id="path1066"
           d="m 120,234 v -44 c 0,-4.432 -3.568,-8 -8,-8 H 64 v 12 h 42 c 1.108,0 2,0.892 2,2 v 38 z"
           style="display:inline;opacity:1;vector-effect:none;fill:#c0bfbc;fill-opacity:1;stroke:none;stroke-width:0.24999999;stroke-linecap:butt;stroke-linejoin:miter;stroke-miterlimit:4;stroke-dasharray:none;stroke-dashoffset:0;stroke-opacity:1;marker:none;marker-start:none;marker-mid:none;marker-end:none;paint-order:normal;enable-background:new"
           inkscape:connector-curvature="0"
           sodipodi:nodetypes="cssccsscc" />
        <path
           style="display:inline;opacity:1;vector-effect:none;fill:url(#linearGradient1090);fill-opacity:1;stroke:none;stroke-width:0.24999999;stroke-linecap:butt;stroke-linejoin:miter;stroke-miterlimit:4;stroke-dasharray:none;stroke-dashoffset:0;stroke-opacity:1;marker:none;marker-start:none;marker-mid:none;marker-end:none;paint-order:normal;enable-background:new"
           d="m 8,234 v 44 c 0,4.432 3.568001,8 8,8 H 64 V 274 H 22 c -1.108,0 -2,-0.892 -2,-2 v -38 z"
           id="path1068"
           inkscape:connector-curvature="0"
           sodipodi:nodetypes="cssccsscc" />
        <path
           style="opacity:1;vector-effect:none;fill:#f6f5f4;fill-opacity:1;stroke:none;stroke-width:2;stroke-linecap:round;stroke-linejoin:round;stroke-miterlimit:4;stroke-dasharray:none;stroke-dashoffset:0;stroke-opacity:0.97637796"
           d="m 8,232 v 44 c 0,4.432 3.568001,8 8,8 H 64 V 272 H 22 c -1.108,0 -2,-0.892 -2,-2 v -38 z"
           id="path1070"
           inkscape:connector-curvature="0" />
        <path
           id="path1072"
           d="m 120,232 v -44 c 0,-4.432 -3.568,-8 -8,-8 H 64 v 12 h 42 c 1.108,0 2,0.892 2,2 v 38 z"
           style="opacity:1;vector-effect:none;fill:#f6f5f4;fill-opacity:1;stroke:none;stroke-width:2;stroke-linecap:round;stroke-linejoin:round;stroke-miterlimit:4;stroke-dasharray:none;stroke-dashoffset:0;stroke-opacity:0.97637796"
           inkscape:connector-curvature="0" />
      </g>
      <g
         id="g1135"
         transform="translate(-900)">
        <rect
           ry="8"
           rx="7.9999995"
           y="190"
           x="-352"
           height="92"
           width="96"
           id="rect1115"
           style="display:inline;opacity:1;vector-effect:none;fill:#e5a50a;fill-opacity:1;stroke:none;stroke-width:0.25;stroke-linecap:butt;stroke-linejoin:miter;stroke-miterlimit:4;stroke-dasharray:none;stroke-dashoffset:0;stroke-opacity:1;marker:none;marker-start:none;marker-mid:none;marker-end:none;paint-order:normal;enable-background:new"
           transform="translate(368)" />
        <rect
           style="display:inline;opacity:1;vector-effect:none;fill:url(#radialGradient1137);fill-opacity:1;stroke:none;stroke-width:0.25;stroke-linecap:butt;stroke-linejoin:miter;stroke-miterlimit:4;stroke-dasharray:none;stroke-dashoffset:0;stroke-opacity:1;marker:none;marker-start:none;marker-mid:none;marker-end:none;paint-order:normal;enable-background:new"
           id="rect1117"
           width="96"
           height="91.999992"
           x="-352"
           y="188"
           rx="7.9999986"
           ry="7.9999995"
           transform="translate(368)" />
        <path
           id="path1119"
           d="m 120,234 v -44 c 0,-4.432 -3.568,-8 -8,-8 H 64 v 12 h 42 c 1.108,0 2,0.892 2,2 v 38 z"
           style="display:inline;opacity:1;vector-effect:none;fill:#c0bfbc;fill-opacity:1;stroke:none;stroke-width:0.24999999;stroke-linecap:butt;stroke-linejoin:miter;stroke-miterlimit:4;stroke-dasharray:none;stroke-dashoffset:0;stroke-opacity:1;marker:none;marker-start:none;marker-mid:none;marker-end:none;paint-order:normal;enable-background:new"
           inkscape:connector-curvature="0"
           sodipodi:nodetypes="cssccsscc" />
        <path
           style="display:inline;opacity:1;vector-effect:none;fill:url(#linearGradient1139);fill-opacity:1;stroke:none;stroke-width:0.24999999;stroke-linecap:butt;stroke-linejoin:miter;stroke-miterlimit:4;stroke-dasharray:none;stroke-dashoffset:0;stroke-opacity:1;marker:none;marker-start:none;marker-mid:none;marker-end:none;paint-order:normal;enable-background:new"
           d="m 8,234 v 44 c 0,4.432 3.568001,8 8,8 H 64 V 274 H 22 c -1.108,0 -2,-0.892 -2,-2 v -38 z"
           id="path1121"
           inkscape:connector-curvature="0"
           sodipodi:nodetypes="cssccsscc" />
        <path
           style="opacity:1;vector-effect:none;fill:#f6f5f4;fill-opacity:1;stroke:none;stroke-width:2;stroke-linecap:round;stroke-linejoin:round;stroke-miterlimit:4;stroke-dasharray:none;stroke-dashoffset:0;stroke-opacity:0.97637796"
           d="m 8,232 v 44 c 0,4.432 3.568001,8 8,8 H 64 V 272 H 22 c -1.108,0 -2,-0.892 -2,-2 v -38 z"
           id="path1123"
           inkscape:connector-curvature="0" />
        <path
           id="path1125"
           d="m 120,232 v -44 c 0,-4.432 -3.568,-8 -8,-8 H 64 v 12 h 42 c 1.108,0 2,0.892 2,2 v 38 z"
           style="opacity:1;vector-effect:none;fill:#f6f5f4;fill-opacity:1;stroke:none;stroke-width:2;stroke-linecap:round;stroke-linejoin:round;stroke-miterlimit:4;stroke-dasharray:none;stroke-dashoffset:0;stroke-opacity:0.97637796"
           inkscape:connector-curvature="0" />
      </g>
      <g
         id="g1738"
         transform="translate(-1040)">
        <rect
           style="display:inline;opacity:1;vector-effect:none;fill:#e5a50a;fill-opacity:1;stroke:none;stroke-width:0.25;stroke-linecap:butt;stroke-linejoin:miter;stroke-miterlimit:4;stroke-dasharray:none;stroke-dashoffset:0;stroke-opacity:1;marker:none;marker-start:none;marker-mid:none;marker-end:none;paint-order:normal;enable-background:new"
           id="rect1720"
           width="96"
           height="92"
           x="16"
           y="190"
           rx="7.9999995"
           ry="8" />
        <rect
           ry="7.9999995"
           rx="7.9999986"
           y="188"
           x="16"
           height="91.999992"
           width="96"
           id="rect1722"
           style="display:inline;opacity:1;vector-effect:none;fill:url(#radialGradient1740);fill-opacity:1;stroke:none;stroke-width:0.25;stroke-linecap:butt;stroke-linejoin:miter;stroke-miterlimit:4;stroke-dasharray:none;stroke-dashoffset:0;stroke-opacity:1;marker:none;marker-start:none;marker-mid:none;marker-end:none;paint-order:normal;enable-background:new" />
        <path
           id="path1724"
           d="m 120,234 v -44 c 0,-4.432 -3.568,-8 -8,-8 H 64 v 12 h 42 c 1.108,0 2,0.892 2,2 v 38 z"
           style="display:inline;opacity:1;vector-effect:none;fill:#0c92a1;fill-opacity:1;stroke:none;stroke-width:0.24999999;stroke-linecap:butt;stroke-linejoin:miter;stroke-miterlimit:4;stroke-dasharray:none;stroke-dashoffset:0;stroke-opacity:1;marker:none;marker-start:none;marker-mid:none;marker-end:none;paint-order:normal;enable-background:new"
           inkscape:connector-curvature="0"
           sodipodi:nodetypes="cssccsscc" />
        <path
           style="display:inline;opacity:1;vector-effect:none;fill:url(#linearGradient1742);fill-opacity:1;stroke:none;stroke-width:0.24999999;stroke-linecap:butt;stroke-linejoin:miter;stroke-miterlimit:4;stroke-dasharray:none;stroke-dashoffset:0;stroke-opacity:1;marker:none;marker-start:none;marker-mid:none;marker-end:none;paint-order:normal;enable-background:new"
           d="m 8,234 v 44 c 0,4.432 3.568001,8 8,8 H 64 V 274 H 22 c -1.108,0 -2,-0.892 -2,-2 v -38 z"
           id="path1726"
           inkscape:connector-curvature="0"
           sodipodi:nodetypes="cssccsscc" />
        <path
           style="opacity:1;vector-effect:none;fill:#42e0f1;fill-opacity:1;stroke:none;stroke-width:2;stroke-linecap:round;stroke-linejoin:round;stroke-miterlimit:4;stroke-dasharray:none;stroke-dashoffset:0;stroke-opacity:0.97637796"
           d="m 8,232 v 44 c 0,4.432 3.568001,8 8,8 H 64 V 272 H 22 c -1.108,0 -2,-0.892 -2,-2 v -38 z"
           id="path1728"
           inkscape:connector-curvature="0" />
        <path
           id="path1730"
           d="m 120,232 v -44 c 0,-4.432 -3.568,-8 -8,-8 H 64 v 12 h 42 c 1.108,0 2,0.892 2,2 v 38 z"
           style="opacity:1;vector-effect:none;fill:#42e0f1;fill-opacity:1;stroke:none;stroke-width:2;stroke-linecap:round;stroke-linejoin:round;stroke-miterlimit:4;stroke-dasharray:none;stroke-dashoffset:0;stroke-opacity:0.97637796"
           inkscape:connector-curvature="0" />
      </g>
      <rect
         style="display:inline;opacity:1;vector-effect:none;fill:url(#radialGradient1746);fill-opacity:1;stroke:none;stroke-width:0.25;stroke-linecap:butt;stroke-linejoin:miter;stroke-miterlimit:4;stroke-dasharray:none;stroke-dashoffset:0;stroke-opacity:1;marker:none;marker-start:none;marker-mid:none;marker-end:none;paint-order:normal;enable-background:new"
         id="rect1744"
         width="96"
         height="91.999992"
         x="16"
         y="27"
         rx="7.9999986"
         ry="7.9999995" />
      <rect
         ry="7.9999995"
         rx="7.9999986"
         y="27"
         x="16"
         height="91.999992"
         width="96"
         id="rect1014-5"
         style="display:inline;opacity:1;vector-effect:none;fill:url(#radialGradient1038-7);fill-opacity:1;stroke:none;stroke-width:0.25;stroke-linecap:butt;stroke-linejoin:miter;stroke-miterlimit:4;stroke-dasharray:none;stroke-dashoffset:0;stroke-opacity:1;marker:none;marker-start:none;marker-mid:none;marker-end:none;paint-order:normal;enable-background:new" />
      <g
         id="g1077"
         transform="translate(-1040,-170)">
        <rect
           style="display:inline;opacity:1;vector-effect:none;fill:#e5a50a;fill-opacity:1;stroke:none;stroke-width:0.25;stroke-linecap:butt;stroke-linejoin:miter;stroke-miterlimit:4;stroke-dasharray:none;stroke-dashoffset:0;stroke-opacity:1;marker:none;marker-start:none;marker-mid:none;marker-end:none;paint-order:normal;enable-background:new"
           id="rect1059"
           width="96"
           height="92"
           x="16"
           y="190"
           rx="7.9999995"
           ry="8" />
        <rect
           ry="7.9999995"
           rx="7.9999986"
           y="188"
           x="16"
           height="91.999992"
           width="96"
           id="rect1061"
           style="display:inline;opacity:1;vector-effect:none;fill:url(#radialGradient1079);fill-opacity:1;stroke:none;stroke-width:0.25;stroke-linecap:butt;stroke-linejoin:miter;stroke-miterlimit:4;stroke-dasharray:none;stroke-dashoffset:0;stroke-opacity:1;marker:none;marker-start:none;marker-mid:none;marker-end:none;paint-order:normal;enable-background:new" />
        <path
           id="path1063"
           d="m 120,234 v -44 c 0,-4.432 -3.568,-8 -8,-8 H 64 v 12 h 42 c 1.108,0 2,0.892 2,2 v 38 z"
           style="display:inline;opacity:1;vector-effect:none;fill:#300c9d;fill-opacity:1;stroke:none;stroke-width:0.24999999;stroke-linecap:butt;stroke-linejoin:miter;stroke-miterlimit:4;stroke-dasharray:none;stroke-dashoffset:0;stroke-opacity:1;marker:none;marker-start:none;marker-mid:none;marker-end:none;paint-order:normal;enable-background:new"
           inkscape:connector-curvature="0"
           sodipodi:nodetypes="cssccsscc" />
        <path
           style="display:inline;opacity:1;vector-effect:none;fill:url(#linearGradient1081);fill-opacity:1;stroke:none;stroke-width:0.24999999;stroke-linecap:butt;stroke-linejoin:miter;stroke-miterlimit:4;stroke-dasharray:none;stroke-dashoffset:0;stroke-opacity:1;marker:none;marker-start:none;marker-mid:none;marker-end:none;paint-order:normal;enable-background:new"
           d="m 8,234 v 44 c 0,4.432 3.568001,8 8,8 H 64 V 274 H 22 c -1.108,0 -2,-0.892 -2,-2 v -38 z"
           id="path1065"
           inkscape:connector-curvature="0"
           sodipodi:nodetypes="cssccsscc" />
        <path
           style="opacity:1;vector-effect:none;fill:#5623ee;fill-opacity:1;stroke:none;stroke-width:2;stroke-linecap:round;stroke-linejoin:round;stroke-miterlimit:4;stroke-dasharray:none;stroke-dashoffset:0;stroke-opacity:0.97637796"
           d="m 8,232 v 44 c 0,4.432 3.568001,8 8,8 H 64 V 272 H 22 c -1.108,0 -2,-0.892 -2,-2 v -38 z"
           id="path1067"
           inkscape:connector-curvature="0" />
        <path
           id="path1069"
           d="m 120,232 v -44 c 0,-4.432 -3.568,-8 -8,-8 H 64 v 12 h 42 c 1.108,0 2,0.892 2,2 v 38 z"
           style="opacity:1;vector-effect:none;fill:#5623ee;fill-opacity:1;stroke:none;stroke-width:2;stroke-linecap:round;stroke-linejoin:round;stroke-miterlimit:4;stroke-dasharray:none;stroke-dashoffset:0;stroke-opacity:0.97637796"
           inkscape:connector-curvature="0" />
      </g>
    </g>
    <g
       inkscape:groupmode="layer"
       id="layer3"
       inkscape:label="grid"
       style="display:none"
       sodipodi:insensitive="true">
      <circle
         cx="64.000031"
         cy="236"
         r="59.504131"
         id="circle2892"
         style="display:inline;opacity:0.1;vector-effect:none;fill:none;fill-opacity:1;stroke:#000000;stroke-width:0.99000001;stroke-linecap:butt;stroke-linejoin:miter;stroke-miterlimit:4;stroke-dasharray:0.99000001, 0.99000001;stroke-dashoffset:0;stroke-opacity:1;marker:none;marker-start:none;marker-mid:none;marker-end:none;paint-order:normal;enable-background:new" />
      <rect
         ry="7.9292889"
         rx="8.701004"
         y="180.49496"
         x="20.495007"
         height="111.01005"
         width="87.009987"
         id="rect2894"
         style="display:inline;opacity:0.1;vector-effect:none;fill:none;fill-opacity:1;stroke:#000000;stroke-width:0.99000001;stroke-linecap:butt;stroke-linejoin:miter;stroke-miterlimit:4;stroke-dasharray:0.99000001, 0.99000001;stroke-dashoffset:0;stroke-opacity:1;marker:none;marker-start:none;marker-mid:none;marker-end:none;paint-order:normal;enable-background:new" />
      <rect
         ry="7.9238095"
         rx="7.9238095"
         y="184.49524"
         x="12.495266"
         height="103.00952"
         width="103.00952"
         id="rect2896"
         style="display:inline;opacity:0.1;vector-effect:none;fill:none;fill-opacity:1;stroke:#000000;stroke-width:0.99000001;stroke-linecap:butt;stroke-linejoin:miter;stroke-miterlimit:4;stroke-dasharray:0.99000001, 0.99000001;stroke-dashoffset:0;stroke-opacity:1;marker:none;marker-start:none;marker-mid:none;marker-end:none;paint-order:normal;enable-background:new" />
      <rect
         ry="8.701005"
         rx="7.9292889"
         y="200.49496"
         x="8.4950066"
         height="87.010048"
         width="111.01004"
         id="rect2898"
         style="display:inline;opacity:0.1;vector-effect:none;fill:none;fill-opacity:1;stroke:#000000;stroke-width:0.99000001;stroke-linecap:butt;stroke-linejoin:miter;stroke-miterlimit:4;stroke-dasharray:0.99000001, 0.99000001;stroke-dashoffset:0;stroke-opacity:1;marker:none;marker-start:none;marker-mid:none;marker-end:none;paint-order:normal;enable-background:new" />
      <path
         inkscape:connector-curvature="0"
         id="path2900"
         d="M 2.6203015e-5,288.99999 H 128.00003"
         style="display:inline;fill:none;stroke:#62a0ea;stroke-width:2;stroke-linecap:butt;stroke-linejoin:miter;stroke-miterlimit:4;stroke-dasharray:none;stroke-opacity:1;enable-background:new" />
    </g>
  </g>
</svg>
