<?xml version="1.0" encoding="UTF-8" standalone="no"?>
<!-- Created with Inkscape (http://www.inkscape.org/) -->

<svg
   inkscape:export-ydpi="96"
   inkscape:export-xdpi="96"
   inkscape:export-filename="Template.png"
   width="192"
   height="152"
   id="svg11300"
   sodipodi:version="0.32"
   inkscape:version="1.2.2 (b0a8486541, 2022-12-01)"
   sodipodi:docname="io.gitlab.zehkira.Monophony.Source.svg"
   inkscape:output_extension="org.inkscape.output.svg.inkscape"
   version="1.0"
   style="display:inline;enable-background:new"
   viewBox="0 0 192 152"
   xmlns:inkscape="http://www.inkscape.org/namespaces/inkscape"
   xmlns:sodipodi="http://sodipodi.sourceforge.net/DTD/sodipodi-0.dtd"
   xmlns:xlink="http://www.w3.org/1999/xlink"
   xmlns="http://www.w3.org/2000/svg"
   xmlns:svg="http://www.w3.org/2000/svg"
   xmlns:rdf="http://www.w3.org/1999/02/22-rdf-syntax-ns#"
   xmlns:cc="http://creativecommons.org/ns#"
   xmlns:dc="http://purl.org/dc/elements/1.1/">
  <title
     id="title4162">Adwaita Icon Template</title>
  <defs
     id="defs3">
    <linearGradient
       inkscape:collect="always"
       id="linearGradient32466">
      <stop
         style="stop-color:#77767b;stop-opacity:1;"
         offset="0"
         id="stop32462" />
      <stop
         style="stop-color:#c0bfbc;stop-opacity:1"
         offset="0.21447583"
         id="stop32472" />
      <stop
         style="stop-color:#77767b;stop-opacity:1;"
         offset="0.53618956"
         id="stop32474" />
      <stop
         style="stop-color:#77767b;stop-opacity:1;"
         offset="0.94141138"
         id="stop32476" />
      <stop
         style="stop-color:#9a9996;stop-opacity:1"
         offset="1"
         id="stop32464" />
    </linearGradient>
    <inkscape:path-effect
       effect="fillet_chamfer"
       id="path-effect30181"
       is_visible="true"
       lpeversion="1"
       nodesatellites_param="F,0,1,1,0,4.1731077,0,1 @ F,0,1,1,0,4.1731077,0,1 @ F,0,0,1,0,4.1731077,0,1"
       unit="px"
       method="auto"
       mode="F"
       radius="0"
       chamfer_steps="1"
       flexible="false"
       use_knot_distance="true"
       apply_no_radius="true"
       apply_with_radius="true"
       only_selected="false"
       hide_knots="false" />
    <inkscape:path-effect
       effect="fillet_chamfer"
       id="path-effect27383"
       is_visible="true"
       lpeversion="1"
       nodesatellites_param="F,0,1,1,0,4.1731077,0,1 @ F,0,1,1,0,4.1731077,0,1 @ F,0,0,1,0,4.1731077,0,1"
       unit="px"
       method="auto"
       mode="F"
       radius="0"
       chamfer_steps="1"
       flexible="false"
       use_knot_distance="true"
       apply_no_radius="true"
       apply_with_radius="true"
       only_selected="false"
       hide_knots="false" />
    <linearGradient
       inkscape:collect="always"
       id="linearGradient20810">
      <stop
         style="stop-color:#c0bfbc;stop-opacity:1"
         offset="0"
         id="stop20798" />
      <stop
         style="stop-color:#f6f5f4;stop-opacity:1"
         offset="0.05537377"
         id="stop20800" />
      <stop
         style="stop-color:#9a9996;stop-opacity:1"
         offset="0.11677933"
         id="stop20802" />
      <stop
         style="stop-color:#c0bfbc;stop-opacity:1"
         offset="0.84992874"
         id="stop20804" />
      <stop
         style="stop-color:#9a9996;stop-opacity:1"
         offset="0.9161703"
         id="stop20806" />
      <stop
         style="stop-color:#9a9996;stop-opacity:1"
         offset="1"
         id="stop20808" />
    </linearGradient>
    <linearGradient
       inkscape:collect="always"
       id="linearGradient19501">
      <stop
         style="stop-color:#77767b;stop-opacity:1"
         offset="0"
         id="stop19497" />
      <stop
         style="stop-color:#3d3846;stop-opacity:1"
         offset="1"
         id="stop19499" />
    </linearGradient>
    <linearGradient
       inkscape:collect="always"
       id="linearGradient18779">
      <stop
         style="stop-color:#77767b;stop-opacity:1;"
         offset="0"
         id="stop18775" />
      <stop
         style="stop-color:#c0bfbc;stop-opacity:1"
         offset="0.03532527"
         id="stop18783" />
      <stop
         style="stop-color:#77767b;stop-opacity:1;"
         offset="0.07051439"
         id="stop18785" />
      <stop
         style="stop-color:#77767b;stop-opacity:1;"
         offset="0.9141376"
         id="stop18787" />
      <stop
         style="stop-color:#deddda;stop-opacity:1"
         offset="0.96212536"
         id="stop18789" />
      <stop
         style="stop-color:#77767b;stop-opacity:1;"
         offset="1"
         id="stop18777" />
    </linearGradient>
    <inkscape:path-effect
       effect="fillet_chamfer"
       id="path-effect18463"
       is_visible="true"
       lpeversion="1"
       nodesatellites_param="F,0,1,1,0,4.1731077,0,1 @ F,0,1,1,0,4.1731077,0,1 @ F,0,0,1,0,4.1731077,0,1"
       unit="px"
       method="auto"
       mode="F"
       radius="0"
       chamfer_steps="1"
       flexible="false"
       use_knot_distance="true"
       apply_no_radius="true"
       apply_with_radius="true"
       only_selected="false"
       hide_knots="false" />
    <linearGradient
       inkscape:collect="always"
       id="linearGradient11650">
      <stop
         style="stop-color:#3d3846;stop-opacity:1;"
         offset="0"
         id="stop11646" />
      <stop
         style="stop-color:#5e5c64;stop-opacity:1"
         offset="0.05537377"
         id="stop11658" />
      <stop
         style="stop-color:#3d3846;stop-opacity:1;"
         offset="0.11677933"
         id="stop11656" />
      <stop
         style="stop-color:#3d3846;stop-opacity:1;"
         offset="0.84992874"
         id="stop11660" />
      <stop
         style="stop-color:#77767b;stop-opacity:1"
         offset="0.9161703"
         id="stop11654" />
      <stop
         style="stop-color:#3d3846;stop-opacity:1;"
         offset="1"
         id="stop11648" />
    </linearGradient>
    <linearGradient
       inkscape:collect="always"
       id="linearGradient11618">
      <stop
         style="stop-color:#77767b;stop-opacity:1;"
         offset="0"
         id="stop11614" />
      <stop
         style="stop-color:#9a9996;stop-opacity:1"
         offset="0.02895258"
         id="stop11624" />
      <stop
         style="stop-color:#77767b;stop-opacity:1;"
         offset="0.06036428"
         id="stop11626" />
      <stop
         style="stop-color:#77767b;stop-opacity:1;"
         offset="0.37561578"
         id="stop11628" />
      <stop
         style="stop-color:#c0bfbc;stop-opacity:1"
         offset="0.43583813"
         id="stop11630" />
      <stop
         style="stop-color:#5e5c64;stop-opacity:1"
         offset="0.49036589"
         id="stop11632" />
      <stop
         style="stop-color:#77767b;stop-opacity:1;"
         offset="0.96896267"
         id="stop11634" />
      <stop
         style="stop-color:#77767b;stop-opacity:1;"
         offset="1"
         id="stop11616" />
    </linearGradient>
    <linearGradient
       inkscape:collect="always"
       id="linearGradient11105">
      <stop
         style="stop-color:#c01c28;stop-opacity:1"
         offset="0"
         id="stop11101" />
      <stop
         style="stop-color:#c01c28;stop-opacity:1"
         offset="0.47367212"
         id="stop11109" />
      <stop
         style="stop-color:#ff7800;stop-opacity:1"
         offset="0.65834147"
         id="stop11107" />
      <stop
         style="stop-color:#7b1824;stop-opacity:1;"
         offset="1"
         id="stop11103" />
    </linearGradient>
    <linearGradient
       inkscape:collect="always"
       id="linearGradient10850">
      <stop
         style="stop-color:#ff7800;stop-opacity:1"
         offset="0"
         id="stop10838" />
      <stop
         style="stop-color:#ed333b;stop-opacity:1"
         offset="0.03"
         id="stop10840" />
      <stop
         style="stop-color:#f66151;stop-opacity:1"
         offset="0.05135581"
         id="stop10856" />
      <stop
         style="stop-color:#a51d2d;stop-opacity:1"
         offset="0.09677653"
         id="stop10842" />
      <stop
         style="stop-color:#dd3c51;stop-opacity:1;"
         offset="0.92000002"
         id="stop10844" />
      <stop
         style="stop-color:#f66151;stop-opacity:1"
         offset="0.96776527"
         id="stop10846" />
      <stop
         style="stop-color:#e01b24;stop-opacity:1"
         offset="0.98328829"
         id="stop10854" />
      <stop
         style="stop-color:#ff7800;stop-opacity:1"
         offset="1"
         id="stop10848" />
    </linearGradient>
    <inkscape:path-effect
       effect="fillet_chamfer"
       id="path-effect10588"
       is_visible="true"
       lpeversion="1"
       nodesatellites_param="F,0,1,1,0,4.1731077,0,1 @ F,0,1,1,0,4.1731077,0,1 @ F,0,0,1,0,4.1731077,0,1"
       unit="px"
       method="auto"
       mode="F"
       radius="0"
       chamfer_steps="1"
       flexible="false"
       use_knot_distance="true"
       apply_no_radius="true"
       apply_with_radius="true"
       only_selected="false"
       hide_knots="false" />
    <linearGradient
       inkscape:collect="always"
       id="linearGradient9396">
      <stop
         style="stop-color:#d93e50;stop-opacity:1;"
         offset="0"
         id="stop9392" />
      <stop
         style="stop-color:#7b1824;stop-opacity:1;"
         offset="1"
         id="stop9394" />
    </linearGradient>
    <inkscape:path-effect
       effect="fillet_chamfer"
       id="path-effect7850"
       is_visible="true"
       lpeversion="1"
       nodesatellites_param="F,0,1,1,0,4.1731077,0,1 @ F,0,1,1,0,4.1731077,0,1 @ F,0,0,1,0,4.1731077,0,1"
       unit="px"
       method="auto"
       mode="F"
       radius="0"
       chamfer_steps="1"
       flexible="false"
       use_knot_distance="true"
       apply_no_radius="true"
       apply_with_radius="true"
       only_selected="false"
       hide_knots="false" />
    <linearGradient
       inkscape:collect="always"
       id="linearGradient6123">
      <stop
         style="stop-color:#a51d2d;stop-opacity:1;"
         offset="0"
         id="stop6111" />
      <stop
         style="stop-color:#ed333b;stop-opacity:1"
         offset="0.03"
         id="stop6113" />
      <stop
         style="stop-color:#a51d2d;stop-opacity:1"
         offset="0.08"
         id="stop6115" />
      <stop
         style="stop-color:#dd3c51;stop-opacity:1;"
         offset="0.92000002"
         id="stop6117" />
      <stop
         style="stop-color:#ff7800;stop-opacity:1"
         offset="0.97000003"
         id="stop6119" />
      <stop
         style="stop-color:#a51d2d;stop-opacity:1;"
         offset="1"
         id="stop6121" />
    </linearGradient>
    <linearGradient
       inkscape:collect="always"
       id="linearGradient5928">
      <stop
         style="stop-color:#c0bfbc;stop-opacity:0.3980957;"
         offset="0"
         id="stop5924" />
      <stop
         style="stop-color:#c0bfbc;stop-opacity:0;"
         offset="1"
         id="stop5926" />
    </linearGradient>
    <linearGradient
       y2="236"
       x2="96"
       y1="236"
       x1="32"
       gradientTransform="translate(604.81684,170.58641)"
       gradientUnits="userSpaceOnUse"
       id="linearGradient1099"
       xlink:href="#linearGradient1036" />
    <linearGradient
       id="linearGradient1036">
      <stop
         id="stop1032"
         offset="0"
         style="stop-color:#d5d3cf;stop-opacity:1;" />
      <stop
         id="stop1034"
         offset="1"
         style="stop-color:#f6f5f4;stop-opacity:1" />
    </linearGradient>
    <radialGradient
       r="32"
       fy="-76"
       fx="-244"
       cy="-76"
       cx="-244"
       gradientTransform="matrix(0.88333331,0,0,0.88333331,-460.35018,463.11973)"
       gradientUnits="userSpaceOnUse"
       id="radialGradient1103"
       xlink:href="#linearGradient1069" />
    <linearGradient
       id="linearGradient1069">
      <stop
         id="stop1065"
         offset="0"
         style="stop-color:#d5d3cf;stop-opacity:1" />
      <stop
         id="stop1067-1"
         offset="1"
         style="stop-color:#949390;stop-opacity:1" />
    </linearGradient>
    <linearGradient
       gradientUnits="userSpaceOnUse"
       y2="232"
       x2="64"
       y1="262.5"
       x1="64"
       id="linearGradient1027"
       xlink:href="#linearGradient1025"
       gradientTransform="translate(-470.5864,432.81685)" />
    <linearGradient
       id="linearGradient1025">
      <stop
         id="stop1021"
         offset="0"
         style="stop-color:#9a9996;stop-opacity:1" />
      <stop
         id="stop1023"
         offset="1"
         style="stop-color:#77767b;stop-opacity:1" />
    </linearGradient>
    <inkscape:path-effect
       effect="spiro"
       id="path-effect35304-9"
       is_visible="true" />
    <clipPath
       clipPathUnits="userSpaceOnUse"
       id="clipPath1609-7">
      <path
         sodipodi:nodetypes="cccccc"
         inkscape:connector-curvature="0"
         id="path1611-5"
         d="m 252,116 28,-28 v -8 h -36 v 36 z"
         style="fill:#e74747;stroke:none;stroke-width:0.25px;stroke-linecap:butt;stroke-linejoin:miter;stroke-opacity:1" />
    </clipPath>
    <linearGradient
       id="linearGradient1697">
      <stop
         id="stop1685"
         offset="0"
         style="stop-color:#deddda;stop-opacity:1" />
      <stop
         style="stop-color:#eeeeec;stop-opacity:1"
         offset="0.04545455"
         id="stop1687" />
      <stop
         id="stop1689"
         offset="0.09090909"
         style="stop-color:#deddda;stop-opacity:1" />
      <stop
         style="stop-color:#deddda;stop-opacity:1"
         offset="0.90909094"
         id="stop1691" />
      <stop
         id="stop1693"
         offset="0.95454544"
         style="stop-color:#eeeeec;stop-opacity:1" />
      <stop
         id="stop1695"
         offset="1"
         style="stop-color:#c0bfbc;stop-opacity:1" />
    </linearGradient>
    <clipPath
       clipPathUnits="userSpaceOnUse"
       id="clipPath1289">
      <path
         style="display:inline;opacity:1;vector-effect:none;fill:none;fill-opacity:1;stroke:#000000;stroke-width:4;stroke-linecap:round;stroke-linejoin:round;stroke-miterlimit:4;stroke-dasharray:none;stroke-dashoffset:0;stroke-opacity:1;marker:none;marker-start:none;marker-mid:none;marker-end:none;paint-order:normal;enable-background:new"
         d="m 64,-148 h 64 l 64,-64 64,64 h 192 c 17.728,0 32,14.272 32,32 v 288 c 0,17.728 -14.272,32 -32,32 H 256 l -64,-64 -64,64 H 64 C 46.272,204 32,189.728 32,172 v -288 c 0,-17.728 14.408898,-34.19889 32,-32 z"
         id="path1291"
         inkscape:connector-curvature="0"
         sodipodi:nodetypes="scccsssscccssss" />
    </clipPath>
    <linearGradient
       id="paint3_linear-2-6-5"
       x2="1"
       gradientUnits="userSpaceOnUse"
       gradientTransform="matrix(0,6,-12,0,-64,209.99687)">
      <stop
         stop-color="#C01C27"
         id="stop91-0-7-4" />
      <stop
         offset="1"
         stop-color="#E01B24"
         id="stop93-2-5-7" />
    </linearGradient>
    <clipPath
       clipPathUnits="userSpaceOnUse"
       id="clipPath1609">
      <path
         sodipodi:nodetypes="cccccc"
         inkscape:connector-curvature="0"
         id="path1611"
         d="m 252,116 28,-28 v -8 h -36 v 36 z"
         style="fill:#e74747;stroke:none;stroke-width:0.25px;stroke-linecap:butt;stroke-linejoin:miter;stroke-opacity:1" />
    </clipPath>
    <linearGradient
       inkscape:collect="always"
       id="linearGradient31427">
      <stop
         style="stop-color:#a51d2d;stop-opacity:1;"
         offset="0"
         id="stop31423" />
      <stop
         style="stop-color:#ed333b;stop-opacity:1;"
         offset="0.03"
         id="stop31431" />
      <stop
         style="stop-color:#a51d2d;stop-opacity:1;"
         offset="0.08"
         id="stop31435" />
      <stop
         style="stop-color:#a51d2d;stop-opacity:1;"
         offset="0.92000002"
         id="stop31437" />
      <stop
         style="stop-color:#ed333b;stop-opacity:1;"
         offset="0.97000003"
         id="stop31433" />
      <stop
         style="stop-color:#a51d2d;stop-opacity:1;"
         offset="1"
         id="stop31425" />
    </linearGradient>
    <linearGradient
       inkscape:collect="always"
       xlink:href="#linearGradient29531-9"
       id="linearGradient29533-5"
       x1="98"
       y1="64"
       x2="102"
       y2="64"
       gradientUnits="userSpaceOnUse"
       gradientTransform="matrix(1.2469426,0,0,1.2469426,-17.682027,158.07338)" />
    <linearGradient
       inkscape:collect="always"
       id="linearGradient29531-9">
      <stop
         style="stop-color:#c0bfbc;stop-opacity:1;"
         offset="0"
         id="stop29527-1" />
      <stop
         style="stop-color:#f6f5f4;stop-opacity:1;"
         offset="0.5"
         id="stop29535-2" />
      <stop
         style="stop-color:#c0bfbc;stop-opacity:1;"
         offset="1"
         id="stop29529-7" />
    </linearGradient>
    <linearGradient
       inkscape:collect="always"
       xlink:href="#linearGradient31427"
       id="linearGradient3106"
       gradientUnits="userSpaceOnUse"
       x1="12"
       y1="64"
       x2="116"
       y2="64" />
    <linearGradient
       inkscape:collect="always"
       xlink:href="#linearGradient29531-9"
       id="linearGradient3108"
       gradientUnits="userSpaceOnUse"
       x1="98"
       y1="64"
       x2="102"
       y2="64" />
    <radialGradient
       inkscape:collect="always"
       xlink:href="#linearGradient5928"
       id="radialGradient5930"
       cx="56"
       cy="237.99997"
       fx="56"
       fy="237.99997"
       r="33.000003"
       gradientTransform="matrix(3.7174678,-4.360876,0.36600751,0.31193244,-236.1084,401.94637)"
       gradientUnits="userSpaceOnUse" />
    <radialGradient
       inkscape:collect="always"
       xlink:href="#linearGradient5928"
       id="radialGradient10590"
       gradientUnits="userSpaceOnUse"
       gradientTransform="matrix(3.4236452,-4.0161994,0.33707885,0.28727781,-421.0035,242.08994)"
       cx="56"
       cy="237.99997"
       fx="56"
       fy="237.99997"
       r="33.000003" />
    <linearGradient
       inkscape:collect="always"
       xlink:href="#linearGradient29531-9"
       id="linearGradient10592"
       gradientUnits="userSpaceOnUse"
       x1="98"
       y1="64"
       x2="102"
       y2="64"
       gradientTransform="matrix(0.73062134,0,0,1,-172.99185,18.990481)" />
    <linearGradient
       inkscape:collect="always"
       xlink:href="#linearGradient6123"
       id="linearGradient10594"
       gradientUnits="userSpaceOnUse"
       gradientTransform="matrix(0.99999996,0,0,0.99420742,-210.39095,17.662422)"
       x1="12"
       y1="111.50476"
       x2="123.84961"
       y2="111.50476" />
    <radialGradient
       inkscape:collect="always"
       xlink:href="#linearGradient9396"
       id="radialGradient10596"
       gradientUnits="userSpaceOnUse"
       gradientTransform="matrix(0.59999957,0.59999957,-0.70710679,0.70710677,-44.294163,-135.45622)"
       cx="108"
       cy="288"
       fx="108"
       fy="288"
       r="5" />
    <radialGradient
       inkscape:collect="always"
       xlink:href="#linearGradient9396"
       id="radialGradient10598"
       gradientUnits="userSpaceOnUse"
       gradientTransform="matrix(0.59999957,0.59999957,-0.70710679,0.70710677,40.705837,-135.45622)"
       cx="108"
       cy="288"
       fx="108"
       fy="288"
       r="5" />
    <linearGradient
       inkscape:collect="always"
       xlink:href="#linearGradient11618"
       id="linearGradient11622"
       x1="96.691246"
       y1="262.79175"
       x2="107.88528"
       y2="262.79175"
       gradientUnits="userSpaceOnUse"
       gradientTransform="matrix(1.2469426,0,0,1.2469426,-25.163682,-58.919102)" />
    <linearGradient
       inkscape:collect="always"
       xlink:href="#linearGradient20810"
       id="linearGradient11652"
       x1="96.069458"
       y1="47.211426"
       x2="104.24683"
       y2="47.176025"
       gradientUnits="userSpaceOnUse"
       gradientTransform="matrix(1.2469426,0,0,1.2469426,-17.682027,160.56726)" />
    <inkscape:path-effect
       effect="fillet_chamfer"
       id="path-effect7850-3"
       is_visible="true"
       lpeversion="1"
       nodesatellites_param="F,0,1,1,0,1.2611268,0,1 @ F,0,1,1,0,1.2611268,0,1 @ F,0,1,1,0,1.2611268,0,1"
       unit="px"
       method="auto"
       mode="F"
       radius="0"
       chamfer_steps="1"
       flexible="false"
       use_knot_distance="true"
       apply_no_radius="true"
       apply_with_radius="true"
       only_selected="false"
       hide_knots="false" />
    <radialGradient
       inkscape:collect="always"
       xlink:href="#linearGradient11105"
       id="radialGradient18465"
       gradientUnits="userSpaceOnUse"
       gradientTransform="matrix(1.2000021,0.99999784,-0.98825951,1.1859159,256.98579,-161.96159)"
       cx="107.78898"
       cy="288.53046"
       fx="107.78898"
       fy="288.53046"
       r="5" />
    <radialGradient
       inkscape:collect="always"
       xlink:href="#linearGradient9396"
       id="radialGradient18467"
       gradientUnits="userSpaceOnUse"
       gradientTransform="matrix(0.62277945,0.62277945,-0.73395316,0.73395314,172.11832,9.2094424)"
       cx="108"
       cy="288"
       fx="108"
       fy="288"
       r="5" />
    <linearGradient
       inkscape:collect="always"
       xlink:href="#linearGradient10850"
       id="linearGradient18469"
       gradientUnits="userSpaceOnUse"
       gradientTransform="translate(-132,172.49524)"
       x1="16"
       y1="111.50476"
       x2="119.33084"
       y2="111.50476" />
    <linearGradient
       inkscape:collect="always"
       xlink:href="#linearGradient11650"
       id="linearGradient18471"
       gradientUnits="userSpaceOnUse"
       gradientTransform="matrix(1.2469426,0,0,1.2469426,-17.682027,160.56726)"
       x1="96.069458"
       y1="47.211426"
       x2="104.24683"
       y2="47.176025" />
    <linearGradient
       inkscape:collect="always"
       xlink:href="#linearGradient11618"
       id="linearGradient18473"
       gradientUnits="userSpaceOnUse"
       gradientTransform="matrix(1.2469426,0,0,1.2469426,-25.163682,-58.919102)"
       x1="96.691246"
       y1="262.79175"
       x2="107.88528"
       y2="262.79175" />
    <linearGradient
       inkscape:collect="always"
       xlink:href="#linearGradient29531-9"
       id="linearGradient18475"
       gradientUnits="userSpaceOnUse"
       gradientTransform="matrix(1.2469426,0,0,1.2469426,-17.682027,158.07338)"
       x1="98"
       y1="64"
       x2="102"
       y2="64" />
    <radialGradient
       inkscape:collect="always"
       xlink:href="#linearGradient5928"
       id="radialGradient18477"
       gradientUnits="userSpaceOnUse"
       gradientTransform="matrix(3.7174678,-4.360876,0.36600751,0.31193244,-236.1084,401.94637)"
       cx="56"
       cy="237.99997"
       fx="56"
       fy="237.99997"
       r="33.000003" />
    <linearGradient
       inkscape:collect="always"
       xlink:href="#linearGradient18779"
       id="linearGradient18781"
       x1="-12"
       y1="286"
       x2="-116"
       y2="286"
       gradientUnits="userSpaceOnUse" />
    <radialGradient
       inkscape:collect="always"
       xlink:href="#linearGradient19501"
       id="radialGradient19503"
       cx="101.42432"
       cy="289.16086"
       fx="101.42432"
       fy="289.16086"
       r="5.1898327"
       gradientUnits="userSpaceOnUse"
       gradientTransform="matrix(0.71545358,0.28780911,-0.37320927,0.92774719,136.86496,-8.4590239)" />
    <radialGradient
       inkscape:collect="always"
       xlink:href="#linearGradient19501"
       id="radialGradient20128"
       gradientUnits="userSpaceOnUse"
       gradientTransform="matrix(0.71545358,0.28780911,-0.37320927,0.92774719,62.864951,-8.4590239)"
       cx="101.42432"
       cy="289.16086"
       fx="101.42432"
       fy="289.16086"
       r="5.1898327" />
    <radialGradient
       inkscape:collect="always"
       xlink:href="#linearGradient9396"
       id="radialGradient27385"
       gradientUnits="userSpaceOnUse"
       gradientTransform="matrix(0.59999957,0.59999957,-0.70710679,0.70710677,40.705837,-135.45622)"
       cx="108"
       cy="288"
       fx="108"
       fy="288"
       r="5" />
    <radialGradient
       inkscape:collect="always"
       xlink:href="#linearGradient9396"
       id="radialGradient27387"
       gradientUnits="userSpaceOnUse"
       gradientTransform="matrix(0.59999957,0.59999957,-0.70710679,0.70710677,-48.294163,-135.45622)"
       cx="108"
       cy="288"
       fx="108"
       fy="288"
       r="5" />
    <linearGradient
       inkscape:collect="always"
       xlink:href="#linearGradient6123"
       id="linearGradient27389"
       gradientUnits="userSpaceOnUse"
       gradientTransform="translate(-210.14096,17.485721)"
       x1="12"
       y1="111.50476"
       x2="123.84961"
       y2="111.50476" />
    <linearGradient
       inkscape:collect="always"
       xlink:href="#linearGradient29531-9"
       id="linearGradient27391"
       gradientUnits="userSpaceOnUse"
       x1="98"
       y1="64"
       x2="102"
       y2="64" />
    <radialGradient
       inkscape:collect="always"
       xlink:href="#linearGradient5928"
       id="radialGradient27393"
       gradientUnits="userSpaceOnUse"
       gradientTransform="matrix(3.4070464,-3.9967277,0.33544461,0.285885,-423.69027,242.76665)"
       cx="56"
       cy="237.99997"
       fx="56"
       fy="237.99997"
       r="33.000003" />
    <radialGradient
       inkscape:collect="always"
       xlink:href="#linearGradient19501"
       id="radialGradient30183"
       gradientUnits="userSpaceOnUse"
       gradientTransform="matrix(0.71545358,0.28780911,-0.37320927,0.92774719,136.86496,-8.4590239)"
       cx="101.42432"
       cy="289.16086"
       fx="101.42432"
       fy="289.16086"
       r="5.1898327" />
    <radialGradient
       inkscape:collect="always"
       xlink:href="#linearGradient19501"
       id="radialGradient30185"
       gradientUnits="userSpaceOnUse"
       gradientTransform="matrix(0.71545358,0.28780911,-0.37320927,0.92774719,62.864951,-8.4590239)"
       cx="101.42432"
       cy="289.16086"
       fx="101.42432"
       fy="289.16086"
       r="5.1898327" />
    <linearGradient
       inkscape:collect="always"
       xlink:href="#linearGradient18779"
       id="linearGradient30187"
       gradientUnits="userSpaceOnUse"
       x1="-12"
       y1="286"
       x2="-116"
       y2="286" />
    <linearGradient
       inkscape:collect="always"
       xlink:href="#linearGradient20810"
       id="linearGradient30189"
       gradientUnits="userSpaceOnUse"
       gradientTransform="matrix(1.2469426,0,0,1.2469426,-17.682027,160.56726)"
       x1="96.069458"
       y1="47.211426"
       x2="104.24683"
       y2="47.176025" />
    <linearGradient
       inkscape:collect="always"
       xlink:href="#linearGradient11618"
       id="linearGradient30191"
       gradientUnits="userSpaceOnUse"
       gradientTransform="matrix(1.2469426,0,0,1.2469426,-25.163682,-58.919102)"
       x1="96.691246"
       y1="262.79175"
       x2="107.88528"
       y2="262.79175" />
    <linearGradient
       inkscape:collect="always"
       xlink:href="#linearGradient29531-9"
       id="linearGradient30193"
       gradientUnits="userSpaceOnUse"
       gradientTransform="matrix(1.2469426,0,0,1.2469426,-17.682027,158.07338)"
       x1="98"
       y1="64"
       x2="102"
       y2="64" />
    <radialGradient
       inkscape:collect="always"
       xlink:href="#linearGradient5928"
       id="radialGradient30195"
       gradientUnits="userSpaceOnUse"
       gradientTransform="matrix(3.7174678,-4.360876,0.36600751,0.31193244,-236.1084,401.94637)"
       cx="56"
       cy="237.99997"
       fx="56"
       fy="237.99997"
       r="33.000003" />
    <linearGradient
       inkscape:collect="always"
       xlink:href="#linearGradient32466"
       id="linearGradient32470"
       x1="-36.838188"
       y1="160.9763"
       x2="-25.207167"
       y2="154.26112"
       gradientUnits="userSpaceOnUse" />
  </defs>
  <sodipodi:namedview
     stroke="#ef2929"
     fill="#f57900"
     id="base"
     pagecolor="#ffffff"
     bordercolor="#666666"
     borderopacity="0.25490196"
     inkscape:pageopacity="0.0"
     inkscape:pageshadow="2"
     inkscape:zoom="2.8284271"
     inkscape:cx="-16.018274"
     inkscape:cy="11.797527"
     inkscape:current-layer="layer1"
     showgrid="false"
     inkscape:grid-bbox="true"
     inkscape:document-units="px"
     inkscape:showpageshadow="false"
     inkscape:window-width="1920"
     inkscape:window-height="1016"
     inkscape:window-x="0"
     inkscape:window-y="27"
     width="400px"
     height="300px"
     inkscape:snap-nodes="true"
     inkscape:snap-bbox="true"
     objecttolerance="7"
     gridtolerance="12"
     guidetolerance="13"
     inkscape:window-maximized="1"
     inkscape:pagecheckerboard="false"
     showguides="false"
     inkscape:guide-bbox="true"
     inkscape:locked="false"
     inkscape:measure-start="0,0"
     inkscape:measure-end="0,0"
     inkscape:object-nodes="true"
     inkscape:bbox-nodes="true"
     inkscape:snap-global="true"
     inkscape:object-paths="true"
     inkscape:snap-intersection-paths="true"
     inkscape:snap-bbox-edge-midpoints="true"
     inkscape:snap-bbox-midpoints="true"
     showborder="true"
     inkscape:snap-center="true"
     inkscape:snap-object-midpoints="true"
     inkscape:snap-midpoints="true"
     inkscape:snap-smooth-nodes="true"
     inkscape:snap-text-baseline="true"
     borderlayer="true"
     inkscape:deskcolor="#d1d1d1">
    <inkscape:grid
       type="xygrid"
       id="grid5883"
       spacingx="2"
       spacingy="2"
       enabled="true"
       visible="true"
       empspacing="4"
       originx="8"
       originy="8" />
    <sodipodi:guide
       position="72,16"
       orientation="0,1"
       id="guide1073"
       inkscape:locked="false"
       inkscape:label=""
       inkscape:color="rgb(0,0,255)" />
    <sodipodi:guide
       position="20,72"
       orientation="1,0"
       id="guide1075"
       inkscape:locked="false"
       inkscape:label=""
       inkscape:color="rgb(0,0,255)" />
    <sodipodi:guide
       position="72,112"
       orientation="0,1"
       id="guide1099"
       inkscape:locked="false"
       inkscape:label=""
       inkscape:color="rgb(0,0,255)" />
    <sodipodi:guide
       position="72,136"
       orientation="0,1"
       id="guide993"
       inkscape:locked="false"
       inkscape:label=""
       inkscape:color="rgb(0,0,255)" />
    <sodipodi:guide
       position="112,72"
       orientation="1,0"
       id="guide995"
       inkscape:locked="false"
       inkscape:label=""
       inkscape:color="rgb(0,0,255)" />
    <sodipodi:guide
       position="8.0000001,72"
       orientation="1,0"
       id="guide867"
       inkscape:locked="false"
       inkscape:label=""
       inkscape:color="rgb(0,0,255)" />
    <sodipodi:guide
       position="128,72"
       orientation="1,0"
       id="guide869"
       inkscape:locked="false"
       inkscape:label=""
       inkscape:color="rgb(0,0,255)" />
    <sodipodi:guide
       position="72,124"
       orientation="0,1"
       id="guide871"
       inkscape:locked="false"
       inkscape:label=""
       inkscape:color="rgb(0,0,255)" />
    <inkscape:grid
       type="xygrid"
       id="grid873"
       spacingx="1"
       spacingy="1"
       empspacing="8"
       color="#000000"
       opacity="0.49019608"
       empcolor="#000000"
       empopacity="0.08627451"
       dotted="true"
       originx="8"
       originy="8" />
    <sodipodi:guide
       position="32,72"
       orientation="1,0"
       id="guide877"
       inkscape:locked="false"
       inkscape:label=""
       inkscape:color="rgb(0,0,255)" />
    <sodipodi:guide
       position="124,72"
       orientation="1,0"
       id="guide879"
       inkscape:locked="false"
       inkscape:label=""
       inkscape:color="rgb(0,0,255)" />
    <sodipodi:guide
       position="72,128"
       orientation="0,1"
       id="guide881"
       inkscape:locked="false"
       inkscape:label=""
       inkscape:color="rgb(0,0,255)" />
    <sodipodi:guide
       position="72,20"
       orientation="0,1"
       id="guide883"
       inkscape:locked="false"
       inkscape:label=""
       inkscape:color="rgb(0,0,255)" />
    <sodipodi:guide
       position="16,72"
       orientation="1,0"
       id="guide885"
       inkscape:locked="false"
       inkscape:label=""
       inkscape:color="rgb(0,0,255)" />
    <sodipodi:guide
       position="136,72"
       orientation="1,0"
       id="guide887"
       inkscape:locked="false"
       inkscape:label=""
       inkscape:color="rgb(0,0,255)" />
    <sodipodi:guide
       position="72,8"
       orientation="0,1"
       id="guide897"
       inkscape:locked="false"
       inkscape:label=""
       inkscape:color="rgb(0,0,255)" />
    <sodipodi:guide
       position="72,32"
       orientation="0,1"
       id="guide899"
       inkscape:locked="false"
       inkscape:label=""
       inkscape:color="rgb(0,0,255)" />
    <sodipodi:guide
       position="264,264"
       orientation="-0.70710678,0.70710678"
       id="guide950"
       inkscape:locked="false"
       inkscape:label=""
       inkscape:color="rgb(0,0,255)" />
    <sodipodi:guide
       position="72,72"
       orientation="0.70710678,0.70710678"
       id="guide952"
       inkscape:locked="false"
       inkscape:label=""
       inkscape:color="rgb(0,0,255)" />
  </sodipodi:namedview>
  <metadata
     id="metadata4">
    <rdf:RDF>
      <cc:Work
         rdf:about="">
        <dc:format>image/svg+xml</dc:format>
        <dc:type
           rdf:resource="http://purl.org/dc/dcmitype/StillImage" />
        <dc:creator>
          <cc:Agent>
            <dc:title>GNOME Design Team</dc:title>
          </cc:Agent>
        </dc:creator>
        <dc:source />
        <cc:license
           rdf:resource="http://creativecommons.org/licenses/by-sa/4.0/" />
        <dc:title>Adwaita Icon Template</dc:title>
        <dc:subject>
          <rdf:Bag />
        </dc:subject>
        <dc:date />
        <dc:rights>
          <cc:Agent>
            <dc:title />
          </cc:Agent>
        </dc:rights>
        <dc:publisher>
          <cc:Agent>
            <dc:title />
          </cc:Agent>
        </dc:publisher>
        <dc:identifier />
        <dc:relation />
        <dc:language />
        <dc:coverage />
        <dc:description />
        <dc:contributor>
          <cc:Agent>
            <dc:title />
          </cc:Agent>
        </dc:contributor>
      </cc:Work>
      <cc:License
         rdf:about="http://creativecommons.org/licenses/by-sa/4.0/">
        <cc:permits
           rdf:resource="http://creativecommons.org/ns#Reproduction" />
        <cc:permits
           rdf:resource="http://creativecommons.org/ns#Distribution" />
        <cc:requires
           rdf:resource="http://creativecommons.org/ns#Notice" />
        <cc:requires
           rdf:resource="http://creativecommons.org/ns#Attribution" />
        <cc:permits
           rdf:resource="http://creativecommons.org/ns#DerivativeWorks" />
        <cc:requires
           rdf:resource="http://creativecommons.org/ns#ShareAlike" />
      </cc:License>
    </rdf:RDF>
  </metadata>
  <g
     id="layer1"
     inkscape:label="App Icon"
     inkscape:groupmode="layer"
     style="display:inline"
     transform="translate(8,-156)">
    <g
       inkscape:groupmode="layer"
       id="layer4"
       inkscape:label="template"
       style="display:inline"
       sodipodi:insensitive="true">
      <rect
         inkscape:label="0"
         y="172"
         x="9.2651362e-08"
         height="128"
         width="128"
         id="hicolor"
         style="display:inline;overflow:visible;visibility:visible;fill:#f0f0f0;fill-opacity:0;fill-rule:nonzero;stroke:none;stroke-width:0.5;marker:none;enable-background:accumulate" />
      <rect
         style="display:inline;overflow:visible;visibility:visible;fill:#f0f0f0;fill-opacity:0;fill-rule:nonzero;stroke:none;stroke-width:0.5;marker:none;enable-background:accumulate"
         id="symbolic"
         width="16"
         height="16"
         x="160"
         y="172"
         inkscape:label="0" />
    </g>
    <g
       inkscape:groupmode="layer"
       id="layer2"
       inkscape:label="baseplate"
       style="display:inline"
       sodipodi:insensitive="true">
      <rect
         style="display:inline;overflow:visible;visibility:visible;fill:#f0f0f0;fill-opacity:1;fill-rule:nonzero;stroke:none;stroke-width:0.5;marker:none;enable-background:accumulate"
         id="128"
         width="128"
         height="128"
         x="9.2651362e-08"
         y="172"
         inkscape:label="0" />
      <rect
         inkscape:label=""
         y="172"
         x="160"
         height="16"
         width="16"
         id="16"
         style="display:inline;overflow:visible;visibility:visible;fill:#f0f0f0;fill-opacity:1;fill-rule:nonzero;stroke:none;stroke-width:0.5;marker:none;enable-background:accumulate" />
      <text
         xml:space="preserve"
         style="font-style:normal;font-variant:normal;font-weight:bold;font-stretch:normal;font-size:4px;line-height:125%;font-family:Cantarell;-inkscape-font-specification:'Cantarell, Bold';text-align:start;writing-mode:lr-tb;text-anchor:start;display:inline;fill:#000000;fill-opacity:1;stroke:none;stroke-width:0.332649;enable-background:new"
         x="0"
         y="167"
         id="text863"
         inkscape:label="icon-name"><tspan
           style="font-size:4px;stroke-width:0.332649"
           sodipodi:role="line"
           id="tspan861"
           x="0"
           y="167">Hicolor</tspan></text>
      <text
         inkscape:label="icon-name"
         id="text867"
         y="167"
         x="160"
         style="font-style:normal;font-variant:normal;font-weight:bold;font-stretch:normal;font-size:4px;line-height:125%;font-family:Cantarell;-inkscape-font-specification:'Cantarell, Bold';text-align:start;writing-mode:lr-tb;text-anchor:start;display:inline;fill:#000000;fill-opacity:1;stroke:none;stroke-width:0.332649;enable-background:new"
         xml:space="preserve"><tspan
           y="167"
           x="160"
           id="tspan865"
           sodipodi:role="line"
           style="font-size:4px;stroke-width:0.332649">Symbolic</tspan></text>
    </g>
    <g
       inkscape:groupmode="layer"
       id="layer3"
       inkscape:label="grid"
       style="display:inline"
       sodipodi:insensitive="true">
      <circle
         cx="64.000031"
         cy="236"
         r="59.504131"
         id="circle2892"
         style="display:inline;opacity:0.1;vector-effect:none;fill:none;fill-opacity:1;stroke:#000000;stroke-width:0.99000001;stroke-linecap:butt;stroke-linejoin:miter;stroke-miterlimit:4;stroke-dasharray:0.99000001, 0.99000001;stroke-dashoffset:0;stroke-opacity:1;marker:none;marker-start:none;marker-mid:none;marker-end:none;paint-order:normal;enable-background:new" />
      <rect
         ry="7.9292889"
         rx="8.701004"
         y="180.49496"
         x="20.495007"
         height="111.01005"
         width="87.009987"
         id="rect2894"
         style="display:inline;opacity:0.1;vector-effect:none;fill:none;fill-opacity:1;stroke:#000000;stroke-width:0.99000001;stroke-linecap:butt;stroke-linejoin:miter;stroke-miterlimit:4;stroke-dasharray:0.99000001, 0.99000001;stroke-dashoffset:0;stroke-opacity:1;marker:none;marker-start:none;marker-mid:none;marker-end:none;paint-order:normal;enable-background:new" />
      <rect
         ry="7.9238095"
         rx="7.9238095"
         y="184.49524"
         x="12.495266"
         height="103.00952"
         width="103.00952"
         id="rect2896"
         style="display:inline;opacity:0.1;vector-effect:none;fill:none;fill-opacity:1;stroke:#000000;stroke-width:0.99000001;stroke-linecap:butt;stroke-linejoin:miter;stroke-miterlimit:4;stroke-dasharray:0.99000001, 0.99000001;stroke-dashoffset:0;stroke-opacity:1;marker:none;marker-start:none;marker-mid:none;marker-end:none;paint-order:normal;enable-background:new" />
      <rect
         ry="8.701005"
         rx="7.9292889"
         y="200.49496"
         x="8.4950066"
         height="87.010048"
         width="111.01004"
         id="rect2898"
         style="display:inline;opacity:0.1;vector-effect:none;fill:none;fill-opacity:1;stroke:#000000;stroke-width:0.99000001;stroke-linecap:butt;stroke-linejoin:miter;stroke-miterlimit:4;stroke-dasharray:0.99000001, 0.99000001;stroke-dashoffset:0;stroke-opacity:1;marker:none;marker-start:none;marker-mid:none;marker-end:none;paint-order:normal;enable-background:new" />
      <path
         inkscape:connector-curvature="0"
         id="path2900"
         d="M 2.6203015e-5,288.99999 H 128.00003"
         style="display:inline;fill:none;stroke:#62a0ea;stroke-width:2;stroke-linecap:butt;stroke-linejoin:miter;stroke-miterlimit:4;stroke-dasharray:none;stroke-opacity:1;enable-background:new" />
    </g>
    <g
       id="g3104"
       transform="translate(-210,172.49524)">
      <rect
         style="fill:url(#linearGradient3106);fill-opacity:1;stroke-width:3.99874;stroke-linecap:round;stroke-linejoin:round"
         id="rect3072"
         width="104"
         height="104"
         x="12"
         y="12"
         ry="7"
         rx="7" />
      <rect
         style="fill:#e01b24;fill-opacity:1;stroke-width:3.99874;stroke-linecap:round;stroke-linejoin:round"
         id="rect3074"
         width="104"
         height="96"
         x="12"
         y="12"
         ry="7"
         rx="7" />
      <circle
         style="fill:#241f31;fill-opacity:1;stroke-width:3.99874;stroke-linecap:round;stroke-linejoin:round"
         id="circle3076"
         cx="56"
         cy="61"
         r="36" />
      <circle
         style="fill:#3d3846;fill-opacity:1;stroke-width:3.99874;stroke-linecap:round;stroke-linejoin:round"
         id="circle3078"
         cx="56"
         cy="59"
         r="36" />
      <circle
         style="fill:#e01b24;fill-opacity:1;stroke-width:3.99874;stroke-linecap:round;stroke-linejoin:round"
         id="circle3080"
         cx="56"
         cy="59"
         r="12" />
      <g
         id="g3090"
         inkscape:transform-center-x="2.4748737"
         inkscape:transform-center-y="32.173358"
         style="fill:#a51d2d;fill-opacity:1"
         transform="translate(0,2)">
        <path
           style="fill:#a51d2d;fill-opacity:1;stroke-width:3.99874;stroke-linecap:round;stroke-linejoin:round"
           d="m 98,81 -1,5 4,1 1,-6 z"
           id="path3082"
           sodipodi:nodetypes="ccccc" />
        <rect
           style="fill:#a51d2d;fill-opacity:1;stroke-width:3.99874;stroke-linecap:round;stroke-linejoin:round"
           id="rect3084"
           width="4"
           height="34"
           x="98"
           y="47"
           ry="0" />
        <rect
           style="fill:#3d3846;fill-opacity:1;stroke-width:3.99874;stroke-linecap:round;stroke-linejoin:round"
           id="rect3086"
           width="8"
           height="24"
           x="96"
           y="24"
           ry="1"
           rx="1" />
        <rect
           style="fill:#a51d2d;fill-opacity:1;stroke-width:3.99874;stroke-linecap:round;stroke-linejoin:round"
           id="rect3088"
           width="6"
           height="13"
           x="125.73651"
           y="23.674337"
           ry="1"
           transform="rotate(30)"
           rx="1" />
      </g>
      <g
         id="g3100"
         inkscape:transform-center-x="2.4748737"
         inkscape:transform-center-y="32.173358">
        <path
           style="fill:#77767b;fill-opacity:1;stroke-width:3.99874;stroke-linecap:round;stroke-linejoin:round"
           d="m 98,81 -1,5 4,1 1,-6 z"
           id="path3092"
           sodipodi:nodetypes="ccccc" />
        <rect
           style="fill:#77767b;fill-opacity:1;stroke-width:3.99874;stroke-linecap:round;stroke-linejoin:round"
           id="rect3094"
           width="8"
           height="24"
           x="96"
           y="24"
           ry="1"
           rx="1" />
        <path
           id="path3096"
           style="fill:url(#linearGradient3108);stroke-width:3.99874;stroke-linecap:round;stroke-linejoin:round"
           d="m 98,49 c 0,-1 4,-1 4,0 v 32 h -4 z"
           sodipodi:nodetypes="ccccc" />
        <rect
           style="fill:#c0bfbc;fill-opacity:1;stroke-width:3.99874;stroke-linecap:round;stroke-linejoin:round"
           id="rect3098"
           width="6"
           height="13"
           x="125.73651"
           y="23.674337"
           ry="1"
           transform="rotate(30)"
           rx="1" />
      </g>
      <path
         style="fill:#ffffff;fill-opacity:1;stroke-width:3.99874;stroke-linecap:round;stroke-linejoin:round"
         d="M 52,53 V 65 L 62,59 Z"
         id="path3102"
         sodipodi:nodetypes="cccc" />
    </g>
    <g
       id="g18417"
       transform="translate(-211.48047,-180)">
      <circle
         style="fill:url(#radialGradient19503);fill-opacity:1;stroke:none;stroke-width:1;stroke-linecap:round;stroke-linejoin:round;stroke-dasharray:none;stroke-opacity:1;paint-order:markers stroke fill;stop-color:#000000"
         id="circle10600"
         cx="102.00001"
         cy="286.81015"
         r="5.1898327" />
      <circle
         style="fill:url(#radialGradient20128);fill-opacity:1;stroke:none;stroke-width:1;stroke-linecap:round;stroke-linejoin:round;stroke-dasharray:none;stroke-opacity:1;paint-order:markers stroke fill;stop-color:#000000"
         id="circle20126"
         cx="28"
         cy="286.81015"
         r="5.1898327" />
      <rect
         style="fill:url(#linearGradient18781);fill-opacity:1;stroke-width:3.99874;stroke-linecap:round;stroke-linejoin:round"
         id="rect26825-1"
         width="104"
         height="84"
         x="-116"
         y="204"
         ry="7"
         rx="7"
         transform="scale(-1,1)" />
      <rect
         style="fill:#ffffff;fill-opacity:1;stroke-width:3.99874;stroke-linecap:round;stroke-linejoin:round"
         id="rect6722"
         width="104"
         height="80"
         x="12"
         y="204"
         ry="7"
         rx="7" />
      <rect
         style="fill:#deddda;fill-opacity:1;stroke-width:3.99874;stroke-linecap:round;stroke-linejoin:round"
         id="rect26823-8"
         width="104"
         height="98"
         x="12"
         y="184"
         ry="7"
         rx="7" />
      <circle
         style="fill:#241f31;fill-opacity:1;stroke-width:3.99874;stroke-linecap:round;stroke-linejoin:round"
         id="circle27285-7"
         cx="57.999985"
         cy="232.41302"
         r="42.375019" />
      <circle
         style="fill:#3d3846;fill-opacity:1;stroke-width:3.99874;stroke-linecap:round;stroke-linejoin:round"
         id="path27096-9"
         cx="57.999981"
         cy="231.96193"
         r="41.477482" />
      <circle
         style="fill:#e01b24;fill-opacity:1;stroke-width:3.99874;stroke-linecap:round;stroke-linejoin:round"
         id="path27492-2"
         cx="57.999981"
         cy="231.9772"
         r="15.275579" />
      <path
         style="fill:#9a9996;fill-opacity:1;stroke-width:3.99875;stroke-linecap:round;stroke-linejoin:round"
         d="m 104.51835,251 -1.24694,6.80432 4.7286,1.19568 2,-8 z"
         id="path31952"
         sodipodi:nodetypes="ccccc" />
      <rect
         style="fill:#9a9996;fill-opacity:1;stroke-width:3.99875;stroke-linecap:round;stroke-linejoin:round"
         id="rect31954"
         width="5.4816589"
         height="31.826431"
         x="104.51835"
         y="219.17357"
         ry="0" />
      <rect
         style="fill:url(#linearGradient11652);fill-opacity:1;stroke-width:3.99875;stroke-linecap:round;stroke-linejoin:round"
         id="rect31956"
         width="9.9755411"
         height="29.926622"
         x="102.02446"
         y="190.49388"
         ry="1"
         rx="1" />
      <path
         style="fill:#3d3846;stroke:none;stroke-width:0.999999px;stroke-linecap:butt;stroke-linejoin:miter;stroke-opacity:1"
         d="m 97.385871,269.07078 1.318181,4.64027 1.906788,-3.31752 z"
         id="path11662" />
      <path
         style="fill:url(#linearGradient11622);fill-opacity:1;stroke:none;stroke-width:0.999999px;stroke-linecap:butt;stroke-linejoin:miter;stroke-opacity:1"
         d="m 95.691264,265.75913 -0.01746,2.3135 c -0.02314,0.34267 0.06537,0.67688 0.420644,0.99085 l 4.673232,2.70211 c 0.52784,0.16815 1.01204,0.0673 1.44916,-0.32361 l 6.89543,-11.95646 c 0.15034,-0.2604 0.3395,-0.49195 0.33639,-0.94275 l 3.8e-4,-2.55656 z"
         id="path11422"
         sodipodi:nodetypes="ccccccccc" />
      <path
         style="fill:#e0dfde;fill-opacity:1;stroke-width:3.99875;stroke-linecap:round;stroke-linejoin:round"
         d="m 104.51835,250 -1.51834,5 5,1 1.50499,-6 z"
         id="path29397"
         sodipodi:nodetypes="ccccc" />
      <rect
         style="fill:#f6f5f4;fill-opacity:1;stroke-width:3.99875;stroke-linecap:round;stroke-linejoin:round"
         id="rect27744-0"
         width="9.9755411"
         height="29.926622"
         x="102.02446"
         y="188"
         ry="1"
         rx="1" />
      <path
         id="rect27748-2"
         style="fill:url(#linearGradient29533-5);stroke-width:3.99875;stroke-linecap:round;stroke-linejoin:round"
         d="m 104.51835,219.17357 c 0,-1.24695 4.98777,-1.24695 4.98777,0 V 250 h -4.98777 z"
         sodipodi:nodetypes="ccccc" />
      <rect
         style="fill:#f6f5f4;fill-opacity:1;stroke-width:3.99875;stroke-linecap:round;stroke-linejoin:round"
         id="rect29263-3"
         width="7.4816556"
         height="16.210255"
         x="215.50981"
         y="166.59688"
         ry="1"
         transform="rotate(29.999999)"
         rx="1" />
      <path
         style="fill:#ffffff;fill-opacity:1;stroke-width:3.99875;stroke-linecap:round;stroke-linejoin:round"
         d="m 51.453313,224.86843 v 14.21752 a 2.3627737,2.3627737 29.518125 0 0 3.578411,2.02606 l 11.646299,-6.98777 a 2.503864,2.503864 90 0 0 0,-4.2941 l -11.646299,-6.98777 a 2.3627737,2.3627737 150.48188 0 0 -3.578411,2.02606 z"
         id="path31065-7"
         sodipodi:nodetypes="cccc"
         inkscape:path-effect="#path-effect7850"
         inkscape:original-d="m 51.453313,220.69532 v 22.56374 l 18.803121,-11.28187 z" />
      <path
         id="circle5852"
         style="fill:none;fill-opacity:1;stroke:url(#radialGradient5930);stroke-width:0.999997;stroke-linecap:round;stroke-linejoin:round"
         d="m 96.336383,231.97721 a 38.336398,38.336398 0 0 1 -38.336398,38.3364 38.336398,38.336398 0 0 1 -38.336398,-38.3364 38.336398,38.336398 0 0 1 38.336398,-38.33639 38.336398,38.336398 0 0 1 38.336398,38.33639 z m -2.359183,0 A 35.977215,35.977215 0 0 1 57.999985,267.95444 35.977215,35.977215 0 0 1 22.02277,231.97721 35.977215,35.977215 0 0 1 57.999985,195.99999 35.977215,35.977215 0 0 1 93.9772,231.97721 Z m -2.359168,-2e-5 A 33.618053,33.618053 0 0 1 57.99998,265.59525 33.618053,33.618053 0 0 1 24.381929,231.97719 33.618053,33.618053 0 0 1 57.99998,198.35915 33.618053,33.618053 0 0 1 91.618032,231.97719 Z m -2.359164,0 A 31.258887,31.258887 0 0 1 57.99998,263.23608 31.258887,31.258887 0 0 1 26.741093,231.97719 31.258887,31.258887 0 0 1 57.99998,200.71831 31.258887,31.258887 0 0 1 89.258868,231.97719 Z m -2.359141,0 A 28.899747,28.899747 0 0 1 57.99998,260.87694 28.899747,28.899747 0 0 1 29.100232,231.97719 28.899747,28.899747 0 0 1 57.99998,203.07744 28.899747,28.899747 0 0 1 86.899727,231.97719 Z m -2.359167,0 A 26.540579,26.540579 0 0 1 57.99998,258.51777 26.540579,26.540579 0 0 1 31.4594,231.97719 26.540579,26.540579 0 0 1 57.99998,205.43661 26.540579,26.540579 0 0 1 84.54056,231.97719 Z m -2.359156,2e-5 a 24.181419,24.181419 0 0 1 -24.181419,24.18142 24.181419,24.181419 0 0 1 -24.18142,-24.18142 24.181419,24.181419 0 0 1 24.18142,-24.18142 24.181419,24.181419 0 0 1 24.181419,24.18142 z m -2.359162,0 a 21.822257,21.822257 0 0 1 -21.822257,21.82226 21.822257,21.822257 0 0 1 -21.822257,-21.82226 21.822257,21.822257 0 0 1 21.822257,-21.82225 21.822257,21.822257 0 0 1 21.822257,21.82225 z m -2.359166,0 a 19.463092,19.463092 0 0 1 -19.463091,19.4631 19.463092,19.463092 0 0 1 -19.463092,-19.4631 19.463092,19.463092 0 0 1 19.463092,-19.46309 19.463092,19.463092 0 0 1 19.463091,19.46309 z" />
    </g>
    <g
       id="g26295"
       transform="translate(206.39096,155.00952)">
      <circle
         style="fill:url(#radialGradient10598);fill-opacity:1;stroke:none;stroke-width:1;stroke-linecap:round;stroke-linejoin:round;stroke-dasharray:none;stroke-opacity:1;paint-order:markers stroke fill;stop-color:#000000"
         id="circle10546"
         cx="-98.140961"
         cy="131.99048"
         r="5" />
      <circle
         style="fill:url(#radialGradient10596);fill-opacity:1;stroke:none;stroke-width:1;stroke-linecap:round;stroke-linejoin:round;stroke-dasharray:none;stroke-opacity:1;paint-order:markers stroke fill;stop-color:#000000"
         id="circle10548"
         cx="-183.14096"
         cy="131.99048"
         r="5" />
      <rect
         style="fill:url(#linearGradient10594);fill-opacity:1;stroke-width:3.98714;stroke-linecap:round;stroke-linejoin:round"
         id="rect10550"
         width="112"
         height="85"
         x="-198.39096"
         y="47.990482"
         ry="6.9594522"
         rx="7" />
      <rect
         style="fill:#f99b91;fill-opacity:1;stroke-width:3.99875;stroke-linecap:round;stroke-linejoin:round"
         id="rect10552"
         width="112.00034"
         height="84"
         x="-198.39125"
         y="44.990467"
         ry="7"
         rx="7.000021" />
      <rect
         style="fill:#f66151;fill-opacity:1;stroke-width:3.99758;stroke-linecap:round;stroke-linejoin:round"
         id="rect10554"
         width="111.9349"
         height="82.000313"
         x="-198.39125"
         y="44.990166"
         ry="7.0000267"
         rx="6.9959311" />
      <circle
         style="fill:#241f31;fill-opacity:1;stroke-width:4.01823;stroke-linecap:round;stroke-linejoin:round"
         id="circle10556"
         cx="-150.14096"
         cy="86.071358"
         r="38.199165" />
      <circle
         style="fill:#3d3846;fill-opacity:1;stroke-width:4.01823;stroke-linecap:round;stroke-linejoin:round"
         id="circle10558"
         cx="-150.14096"
         cy="85.54081"
         r="38.199165" />
      <circle
         style="fill:#e01b24;fill-opacity:1;stroke-width:4.01823;stroke-linecap:round;stroke-linejoin:round"
         id="circle10560"
         cx="-150.14096"
         cy="85.554878"
         r="14.06822" />
      <rect
         style="fill:#3d3846;fill-opacity:1;stroke-width:4.4936;stroke-linecap:round;stroke-linejoin:round"
         id="rect10566"
         width="8.9900217"
         height="26.970066"
         x="-104.38098"
         y="44.505447"
         ry="4.4950109"
         rx="4.4950109" />
      <path
         id="rect10568"
         style="fill:url(#linearGradient32470);fill-opacity:1;stroke-width:5.8744;stroke-linecap:round;stroke-linejoin:round"
         d="M -38.015685 140.38213 C -39.38974 141.12672 -40.318047 142.57902 -40.318047 144.25761 L -40.318525 154.54194 C -40.318525 155.5367 -39.987174 156.44891 -39.435356 157.18491 C -39.302266 157.50466 -39.129392 157.80249 -38.92845 158.07852 C -38.247842 159.63057 -36.702945 160.71086 -34.894039 160.71086 C -32.452457 160.71086 -30.485921 158.74456 -30.485921 156.30297 L -30.486158 146.02131 C -30.486158 145.04961 -30.802552 144.15558 -31.331311 143.42856 C -31.467795 143.117 -31.641506 142.82655 -31.84296 142.55798 C -32.505866 140.96534 -34.073381 139.8507 -35.91162 139.8507 C -36.674615 139.8507 -37.391115 140.04369 -38.015685 140.38213 z "
         transform="rotate(30)" />
      <path
         style="fill:#77767b;fill-opacity:1;stroke-width:3.99874;stroke-linecap:round;stroke-linejoin:round"
         d="m -101.39096,99.99048 -2.67816,4.58427 5.26408,2.54164 0.33658,-7.12591 z"
         id="path10572"
         sodipodi:nodetypes="ccccc" />
      <rect
         style="fill:#77767b;fill-opacity:1;stroke-width:4.4936;stroke-linecap:round;stroke-linejoin:round"
         id="rect10574"
         width="8.9900217"
         height="26.970066"
         x="-104.38098"
         y="41.505447"
         ry="4.4950109"
         rx="4.4950109" />
      <path
         id="path10576"
         style="fill:url(#linearGradient10592);stroke-width:3.41798;stroke-linecap:round;stroke-linejoin:round"
         d="m -101.39096,70.548538 c 0,-1 2.92249,-1 2.92249,0 l 0,29.441943 h -2.92249 z"
         sodipodi:nodetypes="ccccc" />
      <path
         style="fill:#ffffff;fill-opacity:1;stroke-width:4.01823;stroke-linecap:round;stroke-linejoin:round"
         d="m -156.17019,79.337807 v 12.43412 a 2.3627737,2.3627737 29.518124 0 0 3.57841,2.026062 l 10.16012,-6.09607 a 2.5038656,2.5038656 90.000015 0 0 0,-4.294094 l -10.16012,-6.096078 a 2.3627723,2.3627723 150.48189 0 0 -3.57841,2.02606 z"
         id="path10582"
         sodipodi:nodetypes="cccc"
         inkscape:path-effect="#path-effect10588"
         inkscape:original-d="m -156.17019,75.164699 v 20.780336 l 17.31694,-10.390162 z" />
      <rect
         style="fill:#f5f3f3;fill-opacity:1;stroke-width:5.8744;stroke-linecap:round;stroke-linejoin:round"
         id="rect33504"
         width="8.8143826"
         height="19.097828"
         x="-40.394329"
         y="139.54619"
         ry="4.4071913"
         transform="rotate(30)"
         rx="4.4071913" />
      <rect
         style="fill:#c0bfbc;fill-opacity:1;stroke-width:5.8744;stroke-linecap:round;stroke-linejoin:round"
         id="rect10578"
         width="8.8143826"
         height="19.097828"
         x="-40.705345"
         y="139.00749"
         ry="4.4071913"
         transform="rotate(30)"
         rx="4.4071913" />
      <path
         id="path10584"
         style="fill:none;fill-opacity:1;stroke:url(#radialGradient10590);stroke-width:1.00487;stroke-linecap:round;stroke-linejoin:round"
         d="m -114.83462,85.554894 a 35.306347,35.306347 0 0 1 -35.30634,35.306336 35.306347,35.306347 0 0 1 -35.30635,-35.306336 35.306347,35.306347 0 0 1 35.30635,-35.306341 35.306347,35.306347 0 0 1 35.30634,35.306341 z m -2.1727,0 a 33.133629,33.133629 0 0 1 -33.13364,33.133636 33.133629,33.133629 0 0 1 -33.13364,-33.133636 33.133629,33.133629 0 0 1 33.13364,-33.13364 33.133629,33.133629 0 0 1 33.13364,33.13364 z m -2.1727,-2.1e-5 a 30.960932,30.960932 0 0 1 -30.96095,30.960937 30.960932,30.960932 0 0 1 -30.96094,-30.960937 30.960932,30.960932 0 0 1 30.96094,-30.960925 30.960932,30.960932 0 0 1 30.96095,30.960925 z m -2.17272,0 a 28.788233,28.788233 0 0 1 -28.78823,28.788237 28.788233,28.788233 0 0 1 -28.78822,-28.788237 28.788233,28.788233 0 0 1 28.78822,-28.78823 28.788233,28.788233 0 0 1 28.78823,28.78823 z m -2.17268,0 a 26.615554,26.615554 0 0 1 -26.61555,26.615567 26.615554,26.615554 0 0 1 -26.61554,-26.615567 26.615554,26.615554 0 0 1 26.61554,-26.615556 26.615554,26.615554 0 0 1 26.61555,26.615556 z m -2.17271,0 a 24.442852,24.442852 0 0 1 -24.44284,24.442857 24.442852,24.442852 0 0 1 -24.44285,-24.442857 24.442852,24.442852 0 0 1 24.44285,-24.442854 24.442852,24.442852 0 0 1 24.44284,24.442854 z m -2.17268,2.1e-5 a 22.270157,22.270157 0 0 1 -22.27015,22.270156 22.270157,22.270157 0 0 1 -22.27015,-22.270156 22.270157,22.270157 0 0 1 22.27015,-22.270161 22.270157,22.270157 0 0 1 22.27015,22.270161 z m -2.17271,0 a 20.09746,20.09746 0 0 1 -20.09744,20.097466 20.09746,20.09746 0 0 1 -20.09744,-20.097466 20.09746,20.09746 0 0 1 20.09744,-20.097456 20.09746,20.09746 0 0 1 20.09744,20.097456 z m -2.17269,0 a 17.924758,17.924758 0 0 1 -17.92475,17.924746 17.924758,17.924758 0 0 1 -17.92476,-17.924746 17.924758,17.924758 0 0 1 17.92476,-17.924762 17.924758,17.924758 0 0 1 17.92475,17.924762 z" />
    </g>
    <path
       id="rect1775"
       style="fill:#241f31;stroke-width:3.85328;stroke-linecap:round;stroke-linejoin:round"
       d="M 162.28516,172 C 161.01887,172 160,173.03014 160,174.30859 v 10.38282 c 0,1.27844 1.01887,2.30859 2.28516,2.30859 h 11.42968 C 174.98112,187 176,185.96985 176,184.69141 V 174.30859 C 176,173.03014 174.98112,172 173.71484,172 Z m 11.64257,1.16211 h 0.14844 c 0.52953,0 0.95508,0.42826 0.95508,0.96289 v 6.29688 c -0.007,0.42809 -0.0133,0.81076 -0.19922,1.13281 l -2,3 c -0.30635,0.45951 -0.9272,0.58367 -1.38672,0.27734 -0.45951,-0.30635 -0.58367,-0.9272 -0.27734,-1.38672 l 1.84375,-2.76562 c -0.0225,-0.0824 -0.0391,-0.16792 -0.0391,-0.25781 V 174.125 c 0,-0.53463 0.42554,-0.96289 0.95507,-0.96289 z m -7.64257,0.99023 c 2.9258,0 5.29735,2.39372 5.29735,5.34766 0,2.95394 -2.37155,5.34766 -5.29735,5.34766 -2.92581,0 -5.29736,-2.39372 -5.29736,-5.34766 0,-2.95394 2.37155,-5.34766 5.29736,-5.34766 z"
       sodipodi:nodetypes="sssssssssssscccsccsssssssss" />
    <path
       style="display:inline;fill:#241f31;fill-opacity:1;stroke-width:1.41323;stroke-linecap:round;stroke-linejoin:round;enable-background:new"
       d="m 164,176.66363 0,5.45223 a 0.71403583,0.71403583 29.518052 0 0 1.08141,0.61228 l 4.48256,-2.68955 a 0.75667931,0.75667931 89.999968 0 0 0,-1.2977 l -4.48256,-2.68954 A 0.71403676,0.71403676 150.48192 0 0 164,176.66363 Z"
       id="path31065-7-6"
       sodipodi:nodetypes="cccc"
       inkscape:path-effect="#path-effect7850-3"
       inkscape:original-d="m 164,175.4025 v 7.97449 l 6.64538,-3.98725 z" />
    <g
       id="g18459"
       transform="translate(-360)">
      <circle
         style="fill:url(#radialGradient18465);fill-opacity:1;stroke:none;stroke-width:1;stroke-linecap:round;stroke-linejoin:round;stroke-dasharray:none;stroke-opacity:1;paint-order:markers stroke fill;stop-color:#000000"
         id="circle18419"
         cx="102.00001"
         cy="286.81015"
         r="5.1898327" />
      <circle
         style="fill:url(#radialGradient18467);fill-opacity:1;stroke:none;stroke-width:1;stroke-linecap:round;stroke-linejoin:round;stroke-dasharray:none;stroke-opacity:1;paint-order:markers stroke fill;stop-color:#000000"
         id="circle18421"
         cx="28"
         cy="286.81015"
         r="5.1898327" />
      <rect
         style="fill:url(#linearGradient18469);fill-opacity:1;stroke-width:3.99874;stroke-linecap:round;stroke-linejoin:round"
         id="rect18423"
         width="104"
         height="84"
         x="-116"
         y="204"
         ry="7"
         rx="7"
         transform="scale(-1,1)" />
      <rect
         style="fill:#f66151;fill-opacity:1;stroke-width:3.99874;stroke-linecap:round;stroke-linejoin:round"
         id="rect18425"
         width="104"
         height="80"
         x="12"
         y="204"
         ry="7"
         rx="7" />
      <rect
         style="fill:#ed333b;fill-opacity:1;stroke-width:3.99874;stroke-linecap:round;stroke-linejoin:round"
         id="rect18427"
         width="104"
         height="98"
         x="12"
         y="184"
         ry="7"
         rx="7" />
      <circle
         style="fill:#241f31;fill-opacity:1;stroke-width:3.99874;stroke-linecap:round;stroke-linejoin:round"
         id="circle18429"
         cx="57.999985"
         cy="232.41302"
         r="42.375019" />
      <circle
         style="fill:#3d3846;fill-opacity:1;stroke-width:3.99874;stroke-linecap:round;stroke-linejoin:round"
         id="circle18431"
         cx="57.999981"
         cy="231.96193"
         r="41.477482" />
      <circle
         style="fill:#e01b24;fill-opacity:1;stroke-width:3.99874;stroke-linecap:round;stroke-linejoin:round"
         id="circle18433"
         cx="57.999981"
         cy="231.9772"
         r="15.275579" />
      <path
         style="fill:#a51d2d;fill-opacity:1;stroke-width:3.99875;stroke-linecap:round;stroke-linejoin:round"
         d="m 104.51835,251.56961 -1.24694,6.23471 4.7286,1.19568 2,-8 z"
         id="path18435"
         sodipodi:nodetypes="ccccc" />
      <rect
         style="fill:#a51d2d;fill-opacity:1;stroke-width:3.99875;stroke-linecap:round;stroke-linejoin:round"
         id="rect18437"
         width="5.4816589"
         height="31.826431"
         x="104.51835"
         y="219.17357"
         ry="0" />
      <rect
         style="fill:url(#linearGradient18471);fill-opacity:1;stroke-width:3.99875;stroke-linecap:round;stroke-linejoin:round"
         id="rect18439"
         width="9.9755411"
         height="29.926622"
         x="102.02446"
         y="190.49388"
         ry="1"
         rx="1" />
      <rect
         style="fill:#a51d2d;fill-opacity:1;stroke-width:3.99875;stroke-linecap:round;stroke-linejoin:round"
         id="rect18441"
         width="7.4816556"
         height="16.210255"
         x="216.75676"
         y="168.75665"
         ry="1"
         transform="rotate(29.999999)"
         rx="1" />
      <path
         style="fill:#3d3846;stroke:none;stroke-width:0.999999px;stroke-linecap:butt;stroke-linejoin:miter;stroke-opacity:1"
         d="m 97.385871,269.07078 1.318181,4.64027 1.906788,-3.31752 z"
         id="path18443" />
      <path
         style="fill:url(#linearGradient18473);fill-opacity:1;stroke:none;stroke-width:0.999999px;stroke-linecap:butt;stroke-linejoin:miter;stroke-opacity:1"
         d="m 95.691264,265.75913 -0.01746,2.3135 c -0.02314,0.34267 0.06537,0.67688 0.420644,0.99085 l 4.673232,2.70211 c 0.52784,0.16815 1.01204,0.0673 1.44916,-0.32361 l 6.89543,-11.95646 c 0.15034,-0.2604 0.23292,-0.39193 0.22981,-0.84273 l 0.0137,-2.48277 z"
         id="path18445"
         sodipodi:nodetypes="ccccccccc" />
      <path
         style="fill:#77767b;fill-opacity:1;stroke-width:3.99875;stroke-linecap:round;stroke-linejoin:round"
         d="m 104.51835,250 -1.51834,5 5,1 1.50499,-6 z"
         id="path18447"
         sodipodi:nodetypes="ccccc" />
      <rect
         style="fill:#77767b;fill-opacity:1;stroke-width:3.99875;stroke-linecap:round;stroke-linejoin:round"
         id="rect18449"
         width="9.9755411"
         height="29.926622"
         x="102.02446"
         y="188"
         ry="1"
         rx="1" />
      <path
         id="path18451"
         style="fill:url(#linearGradient18475);stroke-width:3.99875;stroke-linecap:round;stroke-linejoin:round"
         d="m 104.51835,219.17357 c 0,-1.24695 4.98777,-1.24695 4.98777,0 V 250 h -4.98777 z"
         sodipodi:nodetypes="ccccc" />
      <rect
         style="fill:#c0bfbc;fill-opacity:1;stroke-width:3.99875;stroke-linecap:round;stroke-linejoin:round"
         id="rect18453"
         width="7.4816556"
         height="16.210255"
         x="215.50981"
         y="166.59688"
         ry="1"
         transform="rotate(29.999999)"
         rx="1" />
      <path
         style="fill:#ffffff;fill-opacity:1;stroke-width:3.99875;stroke-linecap:round;stroke-linejoin:round"
         d="m 51.453313,224.86843 v 14.21752 a 2.3627737,2.3627737 29.518125 0 0 3.578411,2.02606 l 11.646299,-6.98777 a 2.503864,2.503864 90 0 0 0,-4.2941 l -11.646299,-6.98777 a 2.3627737,2.3627737 150.48188 0 0 -3.578411,2.02606 z"
         id="path18455"
         sodipodi:nodetypes="cccc"
         inkscape:path-effect="#path-effect18463"
         inkscape:original-d="m 51.453313,220.69532 v 22.56374 l 18.803121,-11.28187 z" />
      <path
         id="path18457"
         style="fill:none;fill-opacity:1;stroke:url(#radialGradient18477);stroke-width:0.999997;stroke-linecap:round;stroke-linejoin:round"
         d="m 96.336383,231.97721 a 38.336398,38.336398 0 0 1 -38.336398,38.3364 38.336398,38.336398 0 0 1 -38.336398,-38.3364 38.336398,38.336398 0 0 1 38.336398,-38.33639 38.336398,38.336398 0 0 1 38.336398,38.33639 z m -2.359183,0 A 35.977215,35.977215 0 0 1 57.999985,267.95444 35.977215,35.977215 0 0 1 22.02277,231.97721 35.977215,35.977215 0 0 1 57.999985,195.99999 35.977215,35.977215 0 0 1 93.9772,231.97721 Z m -2.359168,-2e-5 A 33.618053,33.618053 0 0 1 57.99998,265.59525 33.618053,33.618053 0 0 1 24.381929,231.97719 33.618053,33.618053 0 0 1 57.99998,198.35915 33.618053,33.618053 0 0 1 91.618032,231.97719 Z m -2.359164,0 A 31.258887,31.258887 0 0 1 57.99998,263.23608 31.258887,31.258887 0 0 1 26.741093,231.97719 31.258887,31.258887 0 0 1 57.99998,200.71831 31.258887,31.258887 0 0 1 89.258868,231.97719 Z m -2.359141,0 A 28.899747,28.899747 0 0 1 57.99998,260.87694 28.899747,28.899747 0 0 1 29.100232,231.97719 28.899747,28.899747 0 0 1 57.99998,203.07744 28.899747,28.899747 0 0 1 86.899727,231.97719 Z m -2.359167,0 A 26.540579,26.540579 0 0 1 57.99998,258.51777 26.540579,26.540579 0 0 1 31.4594,231.97719 26.540579,26.540579 0 0 1 57.99998,205.43661 26.540579,26.540579 0 0 1 84.54056,231.97719 Z m -2.359156,2e-5 a 24.181419,24.181419 0 0 1 -24.181419,24.18142 24.181419,24.181419 0 0 1 -24.18142,-24.18142 24.181419,24.181419 0 0 1 24.18142,-24.18142 24.181419,24.181419 0 0 1 24.181419,24.18142 z m -2.359162,0 a 21.822257,21.822257 0 0 1 -21.822257,21.82226 21.822257,21.822257 0 0 1 -21.822257,-21.82226 21.822257,21.822257 0 0 1 21.822257,-21.82225 21.822257,21.822257 0 0 1 21.822257,21.82225 z m -2.359166,0 a 19.463092,19.463092 0 0 1 -19.463091,19.4631 19.463092,19.463092 0 0 1 -19.463092,-19.4631 19.463092,19.463092 0 0 1 19.463092,-19.46309 19.463092,19.463092 0 0 1 19.463091,19.46309 z" />
    </g>
    <g
       id="g27379"
       transform="translate(-293.60904,155.00952)">
      <circle
         style="fill:url(#radialGradient27385);fill-opacity:1;stroke:none;stroke-width:1;stroke-linecap:round;stroke-linejoin:round;stroke-dasharray:none;stroke-opacity:1;paint-order:markers stroke fill;stop-color:#000000"
         id="circle27339"
         cx="-98.140961"
         cy="131.99048"
         r="5" />
      <circle
         style="fill:url(#radialGradient27387);fill-opacity:1;stroke:none;stroke-width:1;stroke-linecap:round;stroke-linejoin:round;stroke-dasharray:none;stroke-opacity:1;paint-order:markers stroke fill;stop-color:#000000"
         id="circle27341"
         cx="-187.14096"
         cy="131.99048"
         r="5" />
      <rect
         style="fill:url(#linearGradient27389);fill-opacity:1;stroke-width:3.99874;stroke-linecap:round;stroke-linejoin:round"
         id="rect27343"
         width="112"
         height="85.495239"
         x="-198.14096"
         y="47.990482"
         ry="7"
         rx="7" />
      <rect
         style="fill:#f66151;fill-opacity:1;stroke-width:3.99874;stroke-linecap:round;stroke-linejoin:round"
         id="rect27345"
         width="112"
         height="84"
         x="-198.14096"
         y="44.990467"
         ry="7"
         rx="7" />
      <rect
         style="fill:#ed333b;fill-opacity:1;stroke-width:3.99874;stroke-linecap:round;stroke-linejoin:round"
         id="rect27347"
         width="112"
         height="82"
         x="-198.14096"
         y="44.990482"
         ry="7"
         rx="7" />
      <circle
         style="fill:#241f31;fill-opacity:1;stroke-width:3.99874;stroke-linecap:round;stroke-linejoin:round"
         id="circle27349"
         cx="-154.14096"
         cy="87.504471"
         r="38.013969" />
      <circle
         style="fill:#3d3846;fill-opacity:1;stroke-width:3.99874;stroke-linecap:round;stroke-linejoin:round"
         id="circle27351"
         cx="-154.14096"
         cy="86.976501"
         r="38.013969" />
      <circle
         style="fill:#e01b24;fill-opacity:1;stroke-width:3.99874;stroke-linecap:round;stroke-linejoin:round"
         id="circle27353"
         cx="-154.14096"
         cy="86.990494"
         r="14.000015" />
      <g
         id="g27363"
         inkscape:transform-center-x="2.4748737"
         inkscape:transform-center-y="32.173358"
         style="fill:#a51d2d;fill-opacity:1"
         transform="translate(-198.14096,20.990481)">
        <path
           style="fill:#a51d2d;fill-opacity:1;stroke-width:3.99874;stroke-linecap:round;stroke-linejoin:round"
           d="m 98,81 -1,5 4,1 1,-6 z"
           id="path27355"
           sodipodi:nodetypes="ccccc" />
        <rect
           style="fill:#a51d2d;fill-opacity:1;stroke-width:3.99874;stroke-linecap:round;stroke-linejoin:round"
           id="rect27357"
           width="4"
           height="34"
           x="98"
           y="47"
           ry="0" />
        <rect
           style="fill:#3d3846;fill-opacity:1;stroke-width:3.99874;stroke-linecap:round;stroke-linejoin:round"
           id="rect27359"
           width="8"
           height="24"
           x="96"
           y="24"
           ry="1"
           rx="1" />
        <rect
           style="fill:#a51d2d;fill-opacity:1;stroke-width:3.99874;stroke-linecap:round;stroke-linejoin:round"
           id="rect27361"
           width="6"
           height="13"
           x="125.73651"
           y="23.674337"
           ry="1"
           transform="rotate(30)"
           rx="1" />
      </g>
      <g
         id="g27373"
         inkscape:transform-center-x="2.4748737"
         inkscape:transform-center-y="32.173358"
         transform="translate(-198.14096,18.990481)">
        <path
           style="fill:#77767b;fill-opacity:1;stroke-width:3.99874;stroke-linecap:round;stroke-linejoin:round"
           d="m 98,81 -1,5 4,1 1,-6 z"
           id="path27365"
           sodipodi:nodetypes="ccccc" />
        <rect
           style="fill:#77767b;fill-opacity:1;stroke-width:3.99874;stroke-linecap:round;stroke-linejoin:round"
           id="rect27367"
           width="8"
           height="24"
           x="96"
           y="24"
           ry="1"
           rx="1" />
        <path
           id="path27369"
           style="fill:url(#linearGradient27391);stroke-width:3.99874;stroke-linecap:round;stroke-linejoin:round"
           d="m 98,49 c 0,-1 4,-1 4,0 v 32 h -4 z"
           sodipodi:nodetypes="ccccc" />
        <rect
           style="fill:#c0bfbc;fill-opacity:1;stroke-width:3.99874;stroke-linecap:round;stroke-linejoin:round"
           id="rect27371"
           width="6"
           height="13"
           x="125.73651"
           y="23.674337"
           ry="1"
           transform="rotate(30)"
           rx="1" />
      </g>
      <path
         style="fill:#ffffff;fill-opacity:1;stroke-width:3.99875;stroke-linecap:round;stroke-linejoin:round"
         d="m -160.14096,80.823799 v 12.333374 a 2.3627739,2.3627739 29.518127 0 0 3.57841,2.026062 l 10.07617,-6.045698 a 2.5038649,2.5038649 90.000012 0 0 0,-4.294093 l -10.07617,-6.045706 a 2.3627727,2.3627727 150.48189 0 0 -3.57841,2.026061 z"
         id="path27375"
         sodipodi:nodetypes="cccc"
         inkscape:path-effect="#path-effect27383"
         inkscape:original-d="m -160.14096,76.650691 v 20.67959 l 17.23299,-10.33979 z" />
      <path
         id="path27377"
         style="fill:none;fill-opacity:1;stroke:url(#radialGradient27393);stroke-width:0.999997;stroke-linecap:round;stroke-linejoin:round"
         d="m -119.00579,86.990511 a 35.135176,35.135176 0 0 1 -35.13517,35.135169 35.135176,35.135176 0 0 1 -35.13518,-35.135169 35.135176,35.135176 0 0 1 35.13518,-35.13517 35.135176,35.135176 0 0 1 35.13517,35.13517 z m -2.16218,0 a 32.972993,32.972993 0 0 1 -32.97299,32.972999 32.972993,32.972993 0 0 1 -32.97299,-32.972999 32.972993,32.972993 0 0 1 32.97299,-32.973 32.972993,32.972993 0 0 1 32.97299,32.973 z m -2.16217,-2e-5 a 30.810829,30.810829 0 0 1 -30.81083,30.810829 30.810829,30.810829 0 0 1 -30.81082,-30.810829 30.810829,30.810829 0 0 1 30.81082,-30.81082 30.810829,30.810829 0 0 1 30.81083,30.81082 z m -2.16216,0 a 28.648662,28.648662 0 0 1 -28.64867,28.648659 28.648662,28.648662 0 0 1 -28.64866,-28.648659 28.648662,28.648662 0 0 1 28.64866,-28.64866 28.648662,28.648662 0 0 1 28.64867,28.64866 z m -2.16215,0 a 26.486518,26.486518 0 0 1 -26.48652,26.486519 26.486518,26.486518 0 0 1 -26.48651,-26.486519 26.486518,26.486518 0 0 1 26.48651,-26.48652 26.486518,26.486518 0 0 1 26.48652,26.48652 z m -2.16217,0 a 24.324349,24.324349 0 0 1 -24.32435,24.324349 24.324349,24.324349 0 0 1 -24.32435,-24.324349 24.324349,24.324349 0 0 1 24.32435,-24.32435 24.324349,24.324349 0 0 1 24.32435,24.32435 z m -2.16215,2e-5 a 22.162187,22.162187 0 0 1 -22.16219,22.162179 22.162187,22.162187 0 0 1 -22.16219,-22.162179 22.162187,22.162187 0 0 1 22.16219,-22.16219 22.162187,22.162187 0 0 1 22.16219,22.16219 z m -2.16217,0 a 20.000023,20.000023 0 0 1 -20.00002,20.000019 20.000023,20.000023 0 0 1 -20.00002,-20.000019 20.000023,20.000023 0 0 1 20.00002,-20.00002 20.000023,20.000023 0 0 1 20.00002,20.00002 z m -2.16217,0 a 17.837856,17.837856 0 0 1 -17.83785,17.837859 17.837856,17.837856 0 0 1 -17.83786,-17.837859 17.837856,17.837856 0 0 1 17.83786,-17.83786 17.837856,17.837856 0 0 1 17.83785,17.83786 z" />
    </g>
    <g
       id="g30177"
       transform="translate(-351.48047,-180)">
      <circle
         style="fill:url(#radialGradient30183);fill-opacity:1;stroke:none;stroke-width:1;stroke-linecap:round;stroke-linejoin:round;stroke-dasharray:none;stroke-opacity:1;paint-order:markers stroke fill;stop-color:#000000"
         id="circle30139"
         cx="102.00001"
         cy="286.81015"
         r="5.1898327" />
      <circle
         style="fill:url(#radialGradient30185);fill-opacity:1;stroke:none;stroke-width:1;stroke-linecap:round;stroke-linejoin:round;stroke-dasharray:none;stroke-opacity:1;paint-order:markers stroke fill;stop-color:#000000"
         id="circle30141"
         cx="28"
         cy="286.81015"
         r="5.1898327" />
      <rect
         style="fill:url(#linearGradient30187);fill-opacity:1;stroke-width:3.99874;stroke-linecap:round;stroke-linejoin:round"
         id="rect30143"
         width="104"
         height="84"
         x="-116"
         y="204"
         ry="7"
         rx="7"
         transform="scale(-1,1)" />
      <rect
         style="fill:#ffffff;fill-opacity:1;stroke-width:3.99874;stroke-linecap:round;stroke-linejoin:round"
         id="rect30145"
         width="104"
         height="80"
         x="12"
         y="204"
         ry="7"
         rx="7" />
      <rect
         style="fill:#deddda;fill-opacity:1;stroke-width:3.99874;stroke-linecap:round;stroke-linejoin:round"
         id="rect30147"
         width="104"
         height="98"
         x="12"
         y="184"
         ry="7"
         rx="7" />
      <circle
         style="fill:#241f31;fill-opacity:1;stroke-width:3.99874;stroke-linecap:round;stroke-linejoin:round"
         id="circle30149"
         cx="57.999985"
         cy="232.41302"
         r="42.375019" />
      <circle
         style="fill:#3d3846;fill-opacity:1;stroke-width:3.99874;stroke-linecap:round;stroke-linejoin:round"
         id="circle30151"
         cx="57.999981"
         cy="231.96193"
         r="41.477482" />
      <circle
         style="fill:#e01b24;fill-opacity:1;stroke-width:4.71789;stroke-linecap:round;stroke-linejoin:round"
         id="circle30153"
         cx="57.999981"
         cy="231.9772"
         r="18.022797" />
      <path
         style="fill:#9a9996;fill-opacity:1;stroke-width:3.99875;stroke-linecap:round;stroke-linejoin:round"
         d="m 104.51835,251 -1.24694,6.80432 4.7286,1.19568 2,-8 z"
         id="path30155"
         sodipodi:nodetypes="ccccc" />
      <rect
         style="fill:#9a9996;fill-opacity:1;stroke-width:3.99875;stroke-linecap:round;stroke-linejoin:round"
         id="rect30157"
         width="5.4816589"
         height="31.826431"
         x="104.51835"
         y="219.17357"
         ry="0" />
      <rect
         style="fill:url(#linearGradient30189);fill-opacity:1;stroke-width:3.99875;stroke-linecap:round;stroke-linejoin:round"
         id="rect30159"
         width="9.9755411"
         height="29.926622"
         x="102.02446"
         y="190.49388"
         ry="4.9877706"
         rx="4.9877706" />
      <path
         style="fill:#3d3846;stroke:none;stroke-width:0.999999px;stroke-linecap:butt;stroke-linejoin:miter;stroke-opacity:1"
         d="m 97.385871,269.07078 1.318181,4.64027 1.906788,-3.31752 z"
         id="path30161" />
      <path
         style="fill:url(#linearGradient30191);fill-opacity:1;stroke:none;stroke-width:0.999999px;stroke-linecap:butt;stroke-linejoin:miter;stroke-opacity:1"
         d="m 95.691264,265.75913 -0.01746,2.3135 c -0.02314,0.34267 0.06537,0.67688 0.420644,0.99085 l 4.673232,2.70211 c 0.52784,0.16815 1.01204,0.0673 1.44916,-0.32361 l 6.89543,-11.95646 c 0.15034,-0.2604 0.3395,-0.49195 0.33639,-0.94275 l 3.8e-4,-2.55656 z"
         id="path30163"
         sodipodi:nodetypes="ccccccccc" />
      <path
         style="fill:#e0dfde;fill-opacity:1;stroke-width:3.99875;stroke-linecap:round;stroke-linejoin:round"
         d="m 104.51835,250 -1.51834,5 5,1 1.50499,-6 z"
         id="path30165"
         sodipodi:nodetypes="ccccc" />
      <rect
         style="fill:#f6f5f4;fill-opacity:1;stroke-width:3.99875;stroke-linecap:round;stroke-linejoin:round"
         id="rect30167"
         width="9.9755411"
         height="29.926622"
         x="102.02446"
         y="188"
         ry="4.9877706"
         rx="4.9877706" />
      <path
         id="path30169"
         style="fill:url(#linearGradient30193);stroke-width:3.99875;stroke-linecap:round;stroke-linejoin:round"
         d="m 104.51835,219.17357 c 0,-1.24695 4.98777,-1.24695 4.98777,0 V 250 h -4.98777 z"
         sodipodi:nodetypes="ccccc" />
      <rect
         style="fill:#f6f5f4;fill-opacity:1;stroke-width:3.99875;stroke-linecap:round;stroke-linejoin:round"
         id="rect30171"
         width="7.4816556"
         height="16.210255"
         x="215.50981"
         y="166.59688"
         ry="1"
         transform="rotate(29.999999)"
         rx="1" />
      <path
         style="fill:#ffffff;fill-opacity:1;stroke-width:3.99875;stroke-linecap:round;stroke-linejoin:round"
         d="m 51.453313,224.86843 v 14.21752 a 2.3627737,2.3627737 29.518125 0 0 3.578411,2.02606 l 11.646299,-6.98777 a 2.503864,2.503864 90 0 0 0,-4.2941 l -11.646299,-6.98777 a 2.3627737,2.3627737 150.48188 0 0 -3.578411,2.02606 z"
         id="path30173"
         sodipodi:nodetypes="cccc"
         inkscape:path-effect="#path-effect30181"
         inkscape:original-d="m 51.453313,220.69532 v 22.56374 l 18.803121,-11.28187 z" />
      <path
         id="path30175"
         style="fill:none;fill-opacity:1;stroke:url(#radialGradient30195);stroke-width:0.999997;stroke-linecap:round;stroke-linejoin:round"
         d="m 96.336383,231.97721 c 10e-7,21.17261 -17.163789,38.3364 -38.336398,38.3364 -21.172609,0 -38.336399,-17.16379 -38.336398,-38.3364 4e-6,-21.1726 17.163793,-38.33639 38.336398,-38.33639 21.172605,0 38.336394,17.16379 38.336398,38.33639 z m -2.359183,0 c 8e-6,19.86967 -16.107542,35.97723 -35.977215,35.97723 -19.869673,0 -35.977223,-16.10756 -35.977215,-35.97723 -3e-6,-19.86967 16.107546,-35.97722 35.977215,-35.97722 19.869669,0 35.977218,16.10755 35.977215,35.97722 z m -2.359168,-2e-5 c 4e-6,18.56674 -15.051312,33.61806 -33.618052,33.61806 -18.56674,0 -33.618055,-15.05132 -33.618051,-33.61806 7e-6,-18.56673 15.051319,-33.61804 33.618051,-33.61804 18.566733,0 33.618045,15.05131 33.618052,33.61804 z m -2.359164,0 c 2e-6,17.26381 -13.99508,31.25889 -31.258888,31.25889 -17.263808,0 -31.258889,-13.99508 -31.258887,-31.25889 4e-6,-17.2638 13.995083,-31.25888 31.258887,-31.25888 17.263804,0 31.258884,13.99508 31.258888,31.25888 z m -2.359141,0 c 2e-6,15.96089 -12.938856,28.89975 -28.899747,28.89975 -15.960891,0 -28.89975,-12.93886 -28.899748,-28.89975 -2e-6,-15.96089 12.938857,-28.89975 28.899748,-28.89975 15.960891,0 28.899749,12.93886 28.899747,28.89975 z m -2.359167,0 c 10e-7,14.65796 -11.882622,26.54058 -26.54058,26.54058 -14.657958,0 -26.540581,-11.88262 -26.54058,-26.54058 -10e-7,-14.65796 11.882622,-26.54058 26.54058,-26.54058 14.657958,0 26.540581,11.88262 26.54058,26.54058 z m -2.359156,2e-5 c 10e-7,13.35503 -10.82639,24.18142 -24.181419,24.18142 -13.35503,0 -24.181421,-10.82639 -24.18142,-24.18142 -10e-7,-13.35503 10.82639,-24.18142 24.18142,-24.18142 13.355029,0 24.18142,10.82639 24.181419,24.18142 z m -2.359162,0 c 2e-6,12.0521 -9.770156,21.82226 -21.822257,21.82226 -12.052101,0 -21.822259,-9.77016 -21.822257,-21.82226 4e-6,-12.0521 9.77016,-21.82225 21.822257,-21.82225 12.052097,0 21.822253,9.77015 21.822257,21.82225 z"
         sodipodi:nodetypes="ssssssssssssssssssssssssssssssssssssssss" />
    </g>
  </g>
</svg>
