<?xml version="1.0" encoding="UTF-8" standalone="no"?>
<!-- Created with Inkscape (http://www.inkscape.org/) -->

<svg
   inkscape:export-ydpi="96"
   inkscape:export-xdpi="96"
   inkscape:export-filename="Template.png"
   width="192"
   height="152"
   id="svg11300"
   sodipodi:version="0.32"
   inkscape:version="1.3.2 (091e20ef0f, 2023-11-25)"
   sodipodi:docname="org.notanapp.EDS.svg"
   inkscape:output_extension="org.inkscape.output.svg.inkscape"
   version="1.0"
   style="display:inline;enable-background:new"
   viewBox="0 0 192 152"
   xmlns:inkscape="http://www.inkscape.org/namespaces/inkscape"
   xmlns:sodipodi="http://sodipodi.sourceforge.net/DTD/sodipodi-0.dtd"
   xmlns:xlink="http://www.w3.org/1999/xlink"
   xmlns="http://www.w3.org/2000/svg"
   xmlns:svg="http://www.w3.org/2000/svg"
   xmlns:rdf="http://www.w3.org/1999/02/22-rdf-syntax-ns#"
   xmlns:cc="http://creativecommons.org/ns#"
   xmlns:dc="http://purl.org/dc/elements/1.1/">
  <title
     id="title4162">Adwaita Icon Template</title>
  <defs
     id="defs3">
    <linearGradient
       id="linearGradient4"
       inkscape:collect="always">
      <stop
         style="stop-color:#3d3846;stop-opacity:1;"
         offset="0"
         id="stop4" />
      <stop
         style="stop-color:#766b87;stop-opacity:1;"
         offset="0.43197903"
         id="stop6" />
      <stop
         style="stop-color:#3d3846;stop-opacity:1;"
         offset="1"
         id="stop5" />
    </linearGradient>
    <linearGradient
       id="linearGradient1"
       inkscape:collect="always">
      <stop
         style="stop-color:#e01b24;stop-opacity:1;"
         offset="0"
         id="stop1" />
      <stop
         style="stop-color:#241f31;stop-opacity:0.31560102;"
         offset="1"
         id="stop2" />
    </linearGradient>
    <clipPath
       id="clipPath898"
       clipPathUnits="userSpaceOnUse">
      <rect
         ry="8.4666662"
         rx="8.4666662"
         y="214.22339"
         x="140.59975"
         height="31.75"
         width="126.99947"
         id="rect900"
         style="opacity:0.1;fill:#000000;fill-opacity:1;stroke:none;stroke-width:4.23333311;stroke-linecap:butt;stroke-linejoin:miter;stroke-miterlimit:4;stroke-dasharray:none;stroke-dashoffset:0;stroke-opacity:1;marker:none;marker-start:none;marker-mid:none;marker-end:none;paint-order:normal" />
    </clipPath>
    <clipPath
       id="clipPath920"
       clipPathUnits="userSpaceOnUse">
      <rect
         ry="8.4666662"
         rx="8.4666662"
         y="250.92276"
         x="140.59975"
         height="31.75"
         width="126.99947"
         id="rect922"
         style="opacity:0.1;fill:#000000;fill-opacity:1;stroke:none;stroke-width:4.23333311;stroke-linecap:butt;stroke-linejoin:miter;stroke-miterlimit:4;stroke-dasharray:none;stroke-dashoffset:0;stroke-opacity:1;marker:none;marker-start:none;marker-mid:none;marker-end:none;paint-order:normal" />
    </clipPath>
    <clipPath
       id="clipPath924"
       clipPathUnits="userSpaceOnUse">
      <rect
         style="opacity:0.1;fill:#000000;fill-opacity:1;stroke:none;stroke-width:4.23333311;stroke-linecap:butt;stroke-linejoin:miter;stroke-miterlimit:4;stroke-dasharray:none;stroke-dashoffset:0;stroke-opacity:1;marker:none;marker-start:none;marker-mid:none;marker-end:none;paint-order:normal"
         id="rect926"
         width="126.99947"
         height="31.75"
         x="140.59975"
         y="288.20465"
         rx="8.4666662"
         ry="8.4666662" />
    </clipPath>
    <clipPath
       id="clipPath928"
       clipPathUnits="userSpaceOnUse">
      <rect
         ry="8.4666662"
         rx="8.4666662"
         y="324.90402"
         x="140.59975"
         height="31.75"
         width="126.99947"
         id="rect930"
         style="opacity:0.1;fill:#000000;fill-opacity:1;stroke:none;stroke-width:4.23333311;stroke-linecap:butt;stroke-linejoin:miter;stroke-miterlimit:4;stroke-dasharray:none;stroke-dashoffset:0;stroke-opacity:1;marker:none;marker-start:none;marker-mid:none;marker-end:none;paint-order:normal" />
    </clipPath>
    <clipPath
       id="clipPath932"
       clipPathUnits="userSpaceOnUse">
      <rect
         style="opacity:0.1;fill:#000000;fill-opacity:1;stroke:none;stroke-width:4.23333311;stroke-linecap:butt;stroke-linejoin:miter;stroke-miterlimit:4;stroke-dasharray:none;stroke-dashoffset:0;stroke-opacity:1;marker:none;marker-start:none;marker-mid:none;marker-end:none;paint-order:normal"
         id="rect934"
         width="126.99947"
         height="31.75"
         x="140.59975"
         y="362.18594"
         rx="8.4666662"
         ry="8.4666662" />
    </clipPath>
    <clipPath
       id="clipPath936"
       clipPathUnits="userSpaceOnUse">
      <rect
         ry="8.4666662"
         rx="8.4666662"
         y="399.46786"
         x="140.59975"
         height="31.75"
         width="126.99947"
         id="rect938"
         style="opacity:0.1;fill:#000000;fill-opacity:1;stroke:none;stroke-width:4.23333311;stroke-linecap:butt;stroke-linejoin:miter;stroke-miterlimit:4;stroke-dasharray:none;stroke-dashoffset:0;stroke-opacity:1;marker:none;marker-start:none;marker-mid:none;marker-end:none;paint-order:normal" />
    </clipPath>
    <clipPath
       id="clipPath940"
       clipPathUnits="userSpaceOnUse">
      <rect
         style="opacity:0.1;fill:#000000;fill-opacity:1;stroke:none;stroke-width:4.23333311;stroke-linecap:butt;stroke-linejoin:miter;stroke-miterlimit:4;stroke-dasharray:none;stroke-dashoffset:0;stroke-opacity:1;marker:none;marker-start:none;marker-mid:none;marker-end:none;paint-order:normal"
         id="rect942"
         width="126.99947"
         height="31.75"
         x="140.59975"
         y="436.16724"
         rx="8.4666662"
         ry="8.4666662" />
    </clipPath>
    <clipPath
       id="clipPath944"
       clipPathUnits="userSpaceOnUse">
      <rect
         ry="8.4666662"
         rx="8.4666662"
         y="473.44913"
         x="140.59975"
         height="31.75"
         width="253.86797"
         id="rect946"
         style="opacity:0.1;fill:#000000;fill-opacity:1;stroke:none;stroke-width:4.23333311;stroke-linecap:butt;stroke-linejoin:miter;stroke-miterlimit:4;stroke-dasharray:none;stroke-dashoffset:0;stroke-opacity:1;marker:none;marker-start:none;marker-mid:none;marker-end:none;paint-order:normal" />
    </clipPath>
    <linearGradient
       inkscape:collect="always"
       xlink:href="#linearGradient1"
       id="linearGradient2"
       x1="-31.097309"
       y1="213.99181"
       x2="-13.45399"
       y2="215.93652"
       gradientUnits="userSpaceOnUse" />
    <linearGradient
       inkscape:collect="always"
       xlink:href="#linearGradient4"
       id="linearGradient5"
       x1="12.157227"
       y1="279.60742"
       x2="131.99992"
       y2="279.60742"
       gradientUnits="userSpaceOnUse"
       gradientTransform="translate(0,-2)" />
  </defs>
  <sodipodi:namedview
     stroke="#ef2929"
     fill="#f57900"
     id="base"
     pagecolor="#ffffff"
     bordercolor="#666666"
     borderopacity="0.25490196"
     inkscape:pageopacity="0.0"
     inkscape:pageshadow="2"
     inkscape:zoom="1"
     inkscape:cx="166.99599"
     inkscape:cy="121.06153"
     inkscape:current-layer="layer9"
     showgrid="true"
     inkscape:grid-bbox="true"
     inkscape:document-units="px"
     inkscape:showpageshadow="false"
     inkscape:window-width="1920"
     inkscape:window-height="1016"
     inkscape:window-x="1600"
     inkscape:window-y="27"
     width="400px"
     height="300px"
     inkscape:snap-nodes="true"
     inkscape:snap-bbox="true"
     objecttolerance="7"
     gridtolerance="12"
     guidetolerance="13"
     inkscape:window-maximized="1"
     inkscape:pagecheckerboard="false"
     showguides="false"
     inkscape:guide-bbox="true"
     inkscape:locked="false"
     inkscape:measure-start="0,0"
     inkscape:measure-end="0,0"
     inkscape:object-nodes="true"
     inkscape:bbox-nodes="true"
     inkscape:snap-global="true"
     inkscape:object-paths="true"
     inkscape:snap-intersection-paths="true"
     inkscape:snap-bbox-edge-midpoints="true"
     inkscape:snap-bbox-midpoints="true"
     showborder="true"
     inkscape:snap-center="true"
     inkscape:snap-object-midpoints="true"
     inkscape:snap-midpoints="true"
     inkscape:snap-smooth-nodes="true"
     borderlayer="true"
     inkscape:deskcolor="#d1d1d1">
    <inkscape:grid
       type="xygrid"
       id="grid5883"
       spacingx="8"
       spacingy="8"
       enabled="true"
       visible="true"
       empspacing="4"
       originx="0"
       originy="0"
       units="px" />
    <sodipodi:guide
       position="16,32"
       orientation="0,1"
       id="guide1073"
       inkscape:locked="false"
       inkscape:label=""
       inkscape:color="rgb(0,0,255)" />
    <sodipodi:guide
       position="32,256"
       orientation="1,0"
       id="guide1075"
       inkscape:locked="false"
       inkscape:label=""
       inkscape:color="rgb(0,0,255)" />
    <sodipodi:guide
       position="16,416"
       orientation="0,1"
       id="guide1099"
       inkscape:locked="false"
       inkscape:label=""
       inkscape:color="rgb(0,0,255)" />
    <sodipodi:guide
       position="16,480"
       orientation="0,1"
       id="guide993"
       inkscape:locked="false"
       inkscape:label=""
       inkscape:color="rgb(0,0,255)" />
    <sodipodi:guide
       position="416,256"
       orientation="1,0"
       id="guide995"
       inkscape:locked="false"
       inkscape:label=""
       inkscape:color="rgb(0,0,255)" />
    <sodipodi:guide
       position="96,256"
       orientation="1,0"
       id="guide867"
       inkscape:locked="false"
       inkscape:label=""
       inkscape:color="rgb(0,0,255)" />
    <sodipodi:guide
       position="480,256"
       orientation="1,0"
       id="guide869"
       inkscape:locked="false"
       inkscape:label=""
       inkscape:color="rgb(0,0,255)" />
    <sodipodi:guide
       position="16,96"
       orientation="0,1"
       id="guide871"
       inkscape:locked="false"
       inkscape:label=""
       inkscape:color="rgb(0,0,255)" />
    <inkscape:grid
       type="xygrid"
       id="grid873"
       spacingx="1"
       spacingy="1"
       empspacing="32"
       color="#000000"
       opacity="0.49019608"
       empcolor="#000000"
       empopacity="0.08627451"
       dotted="true"
       originx="0"
       originy="0"
       units="px"
       visible="true" />
    <sodipodi:guide
       position="48,256"
       orientation="1,0"
       id="guide877"
       inkscape:locked="false"
       inkscape:label=""
       inkscape:color="rgb(0,0,255)" />
    <sodipodi:guide
       position="464,256"
       orientation="1,0"
       id="guide879"
       inkscape:locked="false"
       inkscape:label=""
       inkscape:color="rgb(0,0,255)" />
    <sodipodi:guide
       position="16,464"
       orientation="0,1"
       id="guide881"
       inkscape:locked="false"
       inkscape:label=""
       inkscape:color="rgb(0,0,255)" />
    <sodipodi:guide
       position="16,48"
       orientation="0,1"
       id="guide883"
       inkscape:locked="false"
       inkscape:label=""
       inkscape:color="rgb(0,0,255)" />
    <sodipodi:guide
       position="16,256"
       orientation="1,0"
       id="guide885"
       inkscape:locked="false"
       inkscape:label=""
       inkscape:color="rgb(0,0,255)" />
    <sodipodi:guide
       position="496,256"
       orientation="1,0"
       id="guide887"
       inkscape:locked="false"
       inkscape:label=""
       inkscape:color="rgb(0,0,255)" />
    <sodipodi:guide
       position="16,496"
       orientation="0,1"
       id="guide897"
       inkscape:locked="false"
       inkscape:label=""
       inkscape:color="rgb(0,0,255)" />
    <sodipodi:guide
       position="16,16"
       orientation="0,1"
       id="guide899"
       inkscape:locked="false"
       inkscape:label=""
       inkscape:color="rgb(0,0,255)" />
    <sodipodi:guide
       position="256,256"
       orientation="-0.70710678,0.70710678"
       id="guide950"
       inkscape:locked="false"
       inkscape:label=""
       inkscape:color="rgb(0,0,255)" />
    <sodipodi:guide
       position="256,256"
       orientation="0.70710678,0.70710678"
       id="guide952"
       inkscape:locked="false"
       inkscape:label=""
       inkscape:color="rgb(0,0,255)" />
  </sodipodi:namedview>
  <metadata
     id="metadata4">
    <rdf:RDF>
      <cc:Work
         rdf:about="">
        <dc:format>image/svg+xml</dc:format>
        <dc:type
           rdf:resource="http://purl.org/dc/dcmitype/StillImage" />
        <dc:creator>
          <cc:Agent>
            <dc:title>GNOME Design Team</dc:title>
          </cc:Agent>
        </dc:creator>
        <dc:source />
        <cc:license
           rdf:resource="http://creativecommons.org/licenses/by-sa/4.0/" />
        <dc:title>Adwaita Icon Template</dc:title>
        <dc:subject>
          <rdf:Bag />
        </dc:subject>
        <dc:date />
        <dc:rights>
          <cc:Agent>
            <dc:title />
          </cc:Agent>
        </dc:rights>
        <dc:publisher>
          <cc:Agent>
            <dc:title />
          </cc:Agent>
        </dc:publisher>
        <dc:identifier />
        <dc:relation />
        <dc:language />
        <dc:coverage />
        <dc:description />
        <dc:contributor>
          <cc:Agent>
            <dc:title />
          </cc:Agent>
        </dc:contributor>
      </cc:Work>
      <cc:License
         rdf:about="http://creativecommons.org/licenses/by-sa/4.0/">
        <cc:permits
           rdf:resource="http://creativecommons.org/ns#Reproduction" />
        <cc:permits
           rdf:resource="http://creativecommons.org/ns#Distribution" />
        <cc:requires
           rdf:resource="http://creativecommons.org/ns#Notice" />
        <cc:requires
           rdf:resource="http://creativecommons.org/ns#Attribution" />
        <cc:permits
           rdf:resource="http://creativecommons.org/ns#DerivativeWorks" />
        <cc:requires
           rdf:resource="http://creativecommons.org/ns#ShareAlike" />
      </cc:License>
    </rdf:RDF>
  </metadata>
  <g
     id="layer1"
     inkscape:label="Icon"
     inkscape:groupmode="layer"
     style="display:inline"
     transform="translate(0,-148)">
    <g
       inkscape:groupmode="layer"
       id="layer2"
       inkscape:label="baseplate"
       style="display:none"
       sodipodi:insensitive="true">
      <g
         style="display:inline;fill:#000000;enable-background:new"
         transform="matrix(7.9911709,0,0,8.0036407,-159.7909,-4854.0776)"
         id="g12027"
         inkscape:export-xdpi="12"
         inkscape:export-ydpi="12" />
      <rect
         style="display:inline;overflow:visible;visibility:visible;fill:#f0f0f0;fill-opacity:1;fill-rule:nonzero;stroke:none;stroke-width:0.5;marker:none;enable-background:accumulate"
         id="rect13805"
         width="128"
         height="128"
         x="8"
         y="164"
         inkscape:label="512x512" />
      <g
         id="g883"
         style="display:inline;fill:none;fill-opacity:0.25098039;stroke:#a579b3;stroke-opacity:1;enable-background:new"
         transform="translate(-16,16.000016)" />
      <g
         id="g900"
         style="display:inline;fill:none;fill-opacity:0.25098039;stroke:#a579b3;stroke-opacity:1;enable-background:new"
         transform="translate(-16,16.000016)" />
      <rect
         inkscape:label="512x512"
         y="164"
         x="168"
         height="16"
         width="16"
         id="rect859"
         style="display:inline;overflow:visible;visibility:visible;fill:#f0f0f0;fill-opacity:1;fill-rule:nonzero;stroke:none;stroke-width:0.5;marker:none;enable-background:accumulate" />
      <text
         xml:space="preserve"
         style="font-style:normal;font-variant:normal;font-weight:bold;font-stretch:normal;font-size:4px;line-height:125%;font-family:Cantarell;-inkscape-font-specification:'Cantarell, Bold';text-align:start;writing-mode:lr-tb;text-anchor:start;display:inline;fill:#000000;fill-opacity:1;stroke:none;stroke-width:0.332649;enable-background:new"
         x="8"
         y="156"
         id="text863"
         inkscape:label="icon-name"><tspan
           style="font-size:4px;stroke-width:0.332649"
           sodipodi:role="line"
           id="tspan861"
           x="8"
           y="156">Hicolor</tspan></text>
      <text
         inkscape:label="icon-name"
         id="text867"
         y="156"
         x="168"
         style="font-style:normal;font-variant:normal;font-weight:bold;font-stretch:normal;font-size:4px;line-height:125%;font-family:Cantarell;-inkscape-font-specification:'Cantarell, Bold';text-align:start;writing-mode:lr-tb;text-anchor:start;display:inline;fill:#000000;fill-opacity:1;stroke:none;stroke-width:0.332649;enable-background:new"
         xml:space="preserve"><tspan
           y="156"
           x="168"
           id="tspan865"
           sodipodi:role="line"
           style="font-size:4px;stroke-width:0.332649">Symbolic</tspan></text>
    </g>
    <g
       inkscape:groupmode="layer"
       id="layer10"
       inkscape:label="template"
       sodipodi:insensitive="true">
      <rect
         inkscape:label="0"
         y="164"
         x="8"
         height="128"
         width="128"
         id="hicolor"
         style="display:inline;overflow:visible;visibility:visible;fill:#f0f0f0;fill-opacity:0;fill-rule:nonzero;stroke:none;stroke-width:0.5;marker:none;filter:url(#filter10013);enable-background:accumulate" />
      <rect
         style="display:inline;overflow:visible;visibility:visible;fill:#f0f0f0;fill-opacity:0;fill-rule:nonzero;stroke:none;stroke-width:0.5;marker:none;filter:url(#filter10013);enable-background:accumulate"
         id="symbolic"
         width="16"
         height="16"
         x="168"
         y="164"
         inkscape:label="0" />
    </g>
    <g
       inkscape:groupmode="layer"
       id="layer9"
       inkscape:label="icons"
       style="display:inline">
      <path
         style="display:inline;opacity:1;fill:url(#linearGradient5);fill-opacity:1;stroke:none;stroke-width:0.0112982px;stroke-linecap:butt;stroke-linejoin:miter;stroke-miterlimit:4;stroke-dasharray:none;stroke-dashoffset:0;stroke-opacity:1;marker:none;marker-start:none;marker-mid:none;marker-end:none;paint-order:normal;enable-background:new"
         d="M 131.99993,230 A 59.999995,59.999995 0 0 1 71.999945,290 59.999995,59.999995 0 0 1 11.999938,230 59.999995,59.999995 0 0 1 71.999945,170.00001 59.999995,59.999995 0 0 1 131.99993,230 Z"
         id="path945"
         inkscape:connector-curvature="0" />
      <rect
         ry="56"
         rx="56"
         y="171"
         x="16"
         height="114"
         width="112"
         id="rect978"
         style="display:inline;opacity:1;fill:#d5d3cf;fill-opacity:1;stroke:none;stroke-width:0.01129822px;stroke-linecap:butt;stroke-linejoin:miter;stroke-miterlimit:4;stroke-dasharray:none;stroke-dashoffset:0;stroke-opacity:1;marker:none;marker-start:none;marker-mid:none;marker-end:none;paint-order:normal;enable-background:new" />
      <path
         inkscape:connector-curvature="0"
         id="path981"
         d="M 131.99993,227 A 59.999995,59.999995 0 0 1 71.999945,286.99999 59.999995,59.999995 0 0 1 11.999938,227 59.999995,59.999995 0 0 1 71.999945,167 59.999995,59.999995 0 0 1 131.99993,227 Z"
         style="display:inline;opacity:1;fill:#77767b;fill-opacity:1;stroke:none;stroke-width:0.01129822px;stroke-linecap:butt;stroke-linejoin:miter;stroke-miterlimit:4;stroke-dasharray:none;stroke-dashoffset:0;stroke-opacity:1;marker:none;marker-start:none;marker-mid:none;marker-end:none;paint-order:normal;enable-background:new" />
      <circle
         cy="227"
         cx="71.999939"
         id="circle983"
         style="display:inline;opacity:1;fill:#deddda;fill-opacity:1;stroke:none;stroke-width:0.01129822px;stroke-linecap:butt;stroke-linejoin:miter;stroke-miterlimit:4;stroke-dasharray:none;stroke-dashoffset:0;stroke-opacity:1;marker:none;marker-start:none;marker-mid:none;marker-end:none;paint-order:normal;enable-background:new"
         r="54" />
      <path
         id="path8"
         style="color:#000000;fill:#000000;fill-opacity:0.193102;fill-rule:evenodd;stroke-linecap:round;-inkscape-stroke:none"
         d="m 45.828125,200.13671 a 1.001565,1.001565 0 0 0 -0.466797,0.22461 1.001565,1.001565 0 0 0 -0.103516,1.41407 l 21.710938,25.125 a 5.9999995,5.9999995 0 0 0 -0.419922,5.6582 5.9999995,5.9999995 0 0 0 7.923828,3.03711 A 5.9999995,5.9999995 0 0 0 77.289062,233 l 22.261719,0.11914 a 2.00313,2.00313 0 0 0 2.013669,-1.99219 2.00313,2.00313 0 0 0 -1.992184,-2.01563 l -21.650391,-0.11523 a 5.9999995,5.9999995 0 0 0 -0.414063,-1.32422 5.9999995,5.9999995 0 0 0 -7.923828,-3.03711 5.9999995,5.9999995 0 0 0 -1.255859,0.77539 L 46.773438,200.46484 a 1.001565,1.001565 0 0 0 -0.945313,-0.32813 z" />
      <path
         sodipodi:nodetypes="cc"
         inkscape:connector-curvature="0"
         id="path987"
         d="M 72.654987,228.85566 99.561848,229"
         style="display:inline;fill:#3d3846;fill-rule:evenodd;stroke:#3d3846;stroke-width:4.00626;stroke-linecap:round;stroke-linejoin:miter;stroke-opacity:1;enable-background:new"
         inkscape:transform-center-x="-14.191143"
         inkscape:transform-center-y="0.855209" />
      <path
         transform="rotate(-24.039088)"
         style="color:#000000;clip-rule:nonzero;display:inline;overflow:visible;visibility:visible;opacity:1;color-interpolation:sRGB;color-interpolation-filters:linearRGB;fill:url(#linearGradient2);fill-opacity:1;fill-rule:nonzero;stroke:none;stroke-width:7.77222;stroke-linecap:round;stroke-linejoin:round;stroke-miterlimit:4;stroke-dasharray:none;stroke-dashoffset:0;stroke-opacity:1;marker:none;color-rendering:auto;image-rendering:auto;shape-rendering:auto;text-rendering:auto;enable-background:accumulate"
         id="circle1"
         sodipodi:type="arc"
         sodipodi:cx="-27.096169"
         sodipodi:cy="237.56682"
         sodipodi:rx="40.30957"
         sodipodi:ry="40.30957"
         sodipodi:start="4.4049804"
         sodipodi:end="5.1206344"
         sodipodi:arc-type="slice"
         d="m -39.29343,199.14692 a 40.30957,40.30957 0 0 1 28.200143,1.42302 l -16.002882,36.99688 z" />
      <path
         inkscape:transform-center-x="13.503233"
         sodipodi:nodetypes="cc"
         inkscape:transform-center-y="-14.556591"
         style="display:inline;fill:none;fill-rule:evenodd;stroke:#ffffff;stroke-width:2.00313;stroke-linecap:round;stroke-linejoin:miter;stroke-opacity:1;enable-background:new"
         d="M 70.998704,227.91562 46.015659,199.00459"
         id="path989"
         inkscape:connector-curvature="0" />
      <circle
         transform="rotate(-24.039088)"
         style="color:#000000;clip-rule:nonzero;display:inline;overflow:visible;visibility:visible;opacity:1;color-interpolation:sRGB;color-interpolation-filters:linearRGB;fill:#241f31;fill-opacity:1;fill-rule:nonzero;stroke:none;stroke-width:7.77221;stroke-linecap:round;stroke-linejoin:round;stroke-miterlimit:4;stroke-dasharray:none;stroke-dashoffset:0;stroke-opacity:1;marker:none;color-rendering:auto;image-rendering:auto;shape-rendering:auto;text-rendering:auto;enable-background:accumulate"
         id="circle993"
         cx="-27.096161"
         cy="237.56682"
         r="5.9999995" />
      <circle
         style="color:#000000;clip-rule:nonzero;display:inline;overflow:visible;visibility:visible;opacity:1;color-interpolation:sRGB;color-interpolation-filters:linearRGB;fill:#deddda;fill-opacity:1;fill-rule:nonzero;stroke:none;stroke-width:8.01252;stroke-linecap:round;stroke-linejoin:round;stroke-miterlimit:4;stroke-dasharray:none;stroke-dashoffset:0;stroke-opacity:1;marker:none;color-rendering:auto;image-rendering:auto;shape-rendering:auto;text-rendering:auto;enable-background:accumulate"
         id="circle997"
         cx="72.029114"
         cy="228"
         r="2" />
      <path
         style="display:inline;opacity:0.29289686;fill:#000000;fill-opacity:1;stroke:none;stroke-width:0.01129822px;stroke-linecap:butt;stroke-linejoin:miter;stroke-miterlimit:4;stroke-dasharray:none;stroke-dashoffset:0;stroke-opacity:1;marker:none;marker-start:none;marker-mid:none;marker-end:none;paint-order:normal;enable-background:new"
         d="m 72.000045,173 a 54,54 0 0 0 -54,54 54,54 0 0 0 0.0415,1.1709 A 54,54 0 0 1 72.000045,175 54,54 0 0 1 125.95854,227.82813 54,54 0 0 0 126.00004,227 54,54 0 0 0 72.000035,173 Z"
         id="circle1003"
         inkscape:connector-curvature="0" />
      <path
         id="path26401"
         style="color:#000000;display:inline;overflow:visible;visibility:visible;fill:#bebebe;fill-opacity:1;fill-rule:nonzero;stroke:none;stroke-width:1;marker:none;enable-background:accumulate"
         d="M 175.90625 164.96875 C 172.04026 164.96875 168.90625 168.10276 168.90625 171.96875 C 168.90625 175.83474 172.04026 178.96875 175.90625 178.96875 C 179.77224 178.96875 182.90625 175.83474 182.90625 171.96875 C 182.90625 168.10276 179.77224 164.96875 175.90625 164.96875 z M 176.00586 167 L 176.00195 170.52539 A 1.4751791 1.4751791 0 0 1 177.47461 172 A 1.4751791 1.4751791 0 0 1 176 173.47461 A 1.4751791 1.4751791 0 0 1 174.52539 172 A 1.4751791 1.4751791 0 0 1 174.55664 171.71094 L 171.09766 171.01562 A 5 5 0 0 1 176.00586 167 z " />
    </g>
  </g>
</svg>
