<?xml version="1.0" encoding="UTF-8" standalone="no"?>
<svg
   xmlns:osb="http://www.openswatchbook.org/uri/2009/osb"
   xmlns:dc="http://purl.org/dc/elements/1.1/"
   xmlns:cc="http://creativecommons.org/ns#"
   xmlns:rdf="http://www.w3.org/1999/02/22-rdf-syntax-ns#"
   xmlns:svg="http://www.w3.org/2000/svg"
   xmlns="http://www.w3.org/2000/svg"
   xmlns:xlink="http://www.w3.org/1999/xlink"
   xmlns:sodipodi="http://sodipodi.sourceforge.net/DTD/sodipodi-0.dtd"
   xmlns:inkscape="http://www.inkscape.org/namespaces/inkscape"
   viewBox="0 0 192 152"
   style="display:inline;enable-background:new"
   version="1.0"
   inkscape:output_extension="org.inkscape.output.svg.inkscape"
   sodipodi:docname="org.gnome.Seahorse.svg"
   inkscape:version="1.0beta1 (fe3e306978, 2019-09-17)"
   sodipodi:version="0.32"
   id="svg11300"
   height="152"
   width="192"
   inkscape:export-filename="Template.png"
   inkscape:export-xdpi="96"
   inkscape:export-ydpi="96">
  <title
     id="title4162">Adwaita Icon Template</title>
  <defs
     id="defs3">
    <linearGradient
       xlink:href="#linearGradient1036"
       id="linearGradient1099"
       gradientUnits="userSpaceOnUse"
       gradientTransform="translate(604.81684,170.58641)"
       x1="32"
       y1="236"
       x2="96"
       y2="236" />
    <linearGradient
       id="linearGradient1036">
      <stop
         style="stop-color:#d5d3cf;stop-opacity:1;"
         offset="0"
         id="stop1032" />
      <stop
         style="stop-color:#f6f5f4;stop-opacity:1"
         offset="1"
         id="stop1034" />
    </linearGradient>
    <radialGradient
       xlink:href="#linearGradient1069"
       id="radialGradient1103"
       gradientUnits="userSpaceOnUse"
       gradientTransform="matrix(0.88333331,0,0,0.88333331,-460.35018,463.11973)"
       cx="-244"
       cy="-76"
       fx="-244"
       fy="-76"
       r="32" />
    <linearGradient
       id="linearGradient1069">
      <stop
         style="stop-color:#d5d3cf;stop-opacity:1"
         offset="0"
         id="stop1065" />
      <stop
         style="stop-color:#949390;stop-opacity:1"
         offset="1"
         id="stop1067-1" />
    </linearGradient>
    <linearGradient
       gradientTransform="translate(-470.5864,432.81685)"
       xlink:href="#linearGradient1025"
       id="linearGradient1027"
       x1="64"
       y1="262.5"
       x2="64"
       y2="232"
       gradientUnits="userSpaceOnUse" />
    <linearGradient
       id="linearGradient1025">
      <stop
         style="stop-color:#9a9996;stop-opacity:1"
         offset="0"
         id="stop1021" />
      <stop
         style="stop-color:#77767b;stop-opacity:1"
         offset="1"
         id="stop1023" />
    </linearGradient>
    <inkscape:path-effect
       is_visible="true"
       id="path-effect35304-9"
       effect="spiro" />
    <linearGradient
       id="linearGradient1296"
       inkscape:collect="always">
      <stop
         id="stop1292"
         offset="0"
         style="stop-color:#77767b;stop-opacity:1;" />
      <stop
         style="stop-color:#c0bfbc;stop-opacity:1"
         offset="0.17589436"
         id="stop1300" />
      <stop
         id="stop1302"
         offset="0.4092612"
         style="stop-color:#77767b;stop-opacity:1" />
      <stop
         id="stop1294"
         offset="1"
         style="stop-color:#3d3846;stop-opacity:1" />
    </linearGradient>
    <linearGradient
       inkscape:collect="always"
       id="linearGradient969">
      <stop
         style="stop-color:#f6f5f4;stop-opacity:1"
         offset="0"
         id="stop963" />
      <stop
         id="stop965"
         offset="0.25731823"
         style="stop-color:#ffffff;stop-opacity:1" />
      <stop
         style="stop-color:#c0bfbc;stop-opacity:1"
         offset="0.5999999"
         id="stop1085" />
      <stop
         id="stop1087"
         offset="0.70312482"
         style="stop-color:#f6f5f4;stop-opacity:1" />
      <stop
         style="stop-color:#f6f5f4;stop-opacity:1"
         offset="1"
         id="stop967" />
    </linearGradient>
    <linearGradient
       id="linearGradient975"
       inkscape:collect="always">
      <stop
         id="stop971"
         offset="0"
         style="stop-color:#deddda;stop-opacity:1" />
      <stop
         id="stop973"
         offset="1"
         style="stop-color:#ffffff;stop-opacity:1" />
    </linearGradient>
    <linearGradient
       y2="249.87819"
       x2="67.121834"
       y1="241.10054"
       x1="75.899483"
       gradientTransform="translate(55.100502,0.07106726)"
       gradientUnits="userSpaceOnUse"
       id="linearGradient977"
       xlink:href="#linearGradient1008"
       inkscape:collect="always" />
    <linearGradient
       id="linearGradient1008"
       inkscape:collect="always">
      <stop
         id="stop1004"
         offset="0"
         style="stop-color:#deddda;stop-opacity:1;" />
      <stop
         style="stop-color:#e7e7e5;stop-opacity:1"
         offset="0.2753801"
         id="stop1104" />
      <stop
         id="stop1030"
         offset="1"
         style="stop-color:#9a9996;stop-opacity:1" />
    </linearGradient>
    <linearGradient
       y2="70.300697"
       x2="85.886963"
       y1="67.679771"
       x1="88.507896"
       gradientTransform="translate(55.769701,171.28412)"
       gradientUnits="userSpaceOnUse"
       id="linearGradient979"
       xlink:href="#linearGradient1040"
       inkscape:collect="always" />
    <linearGradient
       inkscape:collect="always"
       id="linearGradient1040">
      <stop
         style="stop-color:#c0bfbc;stop-opacity:1"
         offset="0"
         id="stop1036" />
      <stop
         style="stop-color:#f6f5f4;stop-opacity:1"
         offset="1"
         id="stop1038" />
    </linearGradient>
    <linearGradient
       y2="20"
       x2="20"
       y1="20"
       x1="59.979103"
       gradientUnits="userSpaceOnUse"
       id="linearGradient1799"
       xlink:href="#linearGradient1296"
       inkscape:collect="always" />
    <linearGradient
       y2="20"
       x2="20"
       y1="20"
       x1="59.979103"
       gradientUnits="userSpaceOnUse"
       id="linearGradient1801"
       xlink:href="#linearGradient1296"
       inkscape:collect="always" />
    <linearGradient
       y2="244.77818"
       x2="72.435028"
       y1="237.70711"
       x1="79.506096"
       gradientTransform="matrix(-0.70710678,0.70710678,0.70710678,0.70710678,-23.865009,4.6963868)"
       gradientUnits="userSpaceOnUse"
       id="linearGradient1803"
       xlink:href="#linearGradient969"
       inkscape:collect="always" />
    <linearGradient
       y2="69.613197"
       x2="86.574471"
       y1="67.679771"
       x1="88.507896"
       gradientTransform="matrix(-0.70710678,0.70710678,0.70710678,0.70710678,96.727711,126.23551)"
       gradientUnits="userSpaceOnUse"
       id="linearGradient1805"
       xlink:href="#linearGradient975"
       inkscape:collect="always" />
    <linearGradient
       y2="20"
       x2="20"
       y1="20"
       x1="59.979103"
       gradientUnits="userSpaceOnUse"
       id="linearGradient1926"
       xlink:href="#linearGradient1296"
       inkscape:collect="always" />
    <linearGradient
       y2="20"
       x2="20"
       y1="20"
       x1="59.979103"
       gradientUnits="userSpaceOnUse"
       id="linearGradient1928"
       xlink:href="#linearGradient1296"
       inkscape:collect="always" />
    <linearGradient
       y2="244.77818"
       x2="72.435028"
       y1="237.70711"
       x1="79.506096"
       gradientTransform="matrix(-0.70710678,0.70710678,0.70710678,0.70710678,-23.865009,4.6963868)"
       gradientUnits="userSpaceOnUse"
       id="linearGradient1930"
       xlink:href="#linearGradient969"
       inkscape:collect="always" />
    <linearGradient
       y2="69.613197"
       x2="86.574471"
       y1="67.679771"
       x1="88.507896"
       gradientTransform="matrix(-0.70710678,0.70710678,0.70710678,0.70710678,96.727711,126.23551)"
       gradientUnits="userSpaceOnUse"
       id="linearGradient1933"
       xlink:href="#linearGradient975"
       inkscape:collect="always" />
    <linearGradient
       y2="249.87819"
       x2="67.121834"
       y1="238.30762"
       x1="78.692398"
       gradientTransform="translate(55.100502,0.07106726)"
       gradientUnits="userSpaceOnUse"
       id="linearGradient1986"
       xlink:href="#linearGradient969"
       inkscape:collect="always" />
    <linearGradient
       y2="70.300697"
       x2="85.886963"
       y1="67.679771"
       x1="88.507896"
       gradientTransform="translate(55.769701,171.28412)"
       gradientUnits="userSpaceOnUse"
       id="linearGradient1988"
       xlink:href="#linearGradient1040"
       inkscape:collect="always" />
    <linearGradient
       gradientUnits="userSpaceOnUse"
       y2="268"
       x2="198"
       y1="268"
       x1="142"
       id="linearGradient1039"
       xlink:href="#linearGradient1296"
       inkscape:collect="always" />
    <linearGradient
       id="linearGradient7212"
       osb:paint="solid">
      <stop
         id="stop7214"
         offset="0"
         style="stop-color:#000000;stop-opacity:1;" />
    </linearGradient>
  </defs>
  <sodipodi:namedview
     borderlayer="true"
     inkscape:document-rotation="0"
     inkscape:snap-text-baseline="true"
     inkscape:snap-smooth-nodes="true"
     inkscape:snap-midpoints="true"
     inkscape:snap-object-midpoints="true"
     inkscape:snap-center="true"
     showborder="true"
     inkscape:snap-bbox-midpoints="true"
     inkscape:snap-bbox-edge-midpoints="true"
     inkscape:snap-intersection-paths="true"
     inkscape:object-paths="true"
     inkscape:snap-global="true"
     inkscape:bbox-nodes="true"
     inkscape:object-nodes="true"
     inkscape:measure-end="0,0"
     inkscape:measure-start="0,0"
     inkscape:locked="false"
     inkscape:guide-bbox="true"
     showguides="false"
     inkscape:pagecheckerboard="false"
     inkscape:window-maximized="1"
     guidetolerance="13"
     gridtolerance="12"
     objecttolerance="7"
     inkscape:snap-bbox="true"
     inkscape:snap-nodes="true"
     height="300px"
     width="400px"
     inkscape:window-y="27"
     inkscape:window-x="0"
     inkscape:window-height="1376"
     inkscape:window-width="3440"
     inkscape:showpageshadow="false"
     inkscape:document-units="px"
     inkscape:grid-bbox="true"
     showgrid="true"
     inkscape:current-layer="layer9"
     inkscape:cy="25.10537"
     inkscape:cx="143.91316"
     inkscape:zoom="1"
     inkscape:pageshadow="2"
     inkscape:pageopacity="0.0"
     borderopacity="0.25490196"
     bordercolor="#666666"
     pagecolor="#ffffff"
     id="base"
     fill="#f57900"
     stroke="#ef2929">
    <inkscape:grid
       originy="0"
       originx="0"
       empspacing="4"
       visible="true"
       enabled="true"
       spacingy="2"
       spacingx="2"
       id="grid5883"
       type="xygrid" />
    <sodipodi:guide
       inkscape:color="rgb(0,0,255)"
       inkscape:label=""
       inkscape:locked="false"
       id="guide1073"
       orientation="0,1"
       position="64,8" />
    <sodipodi:guide
       inkscape:color="rgb(0,0,255)"
       inkscape:label=""
       inkscape:locked="false"
       id="guide1075"
       orientation="1,0"
       position="12,64" />
    <sodipodi:guide
       inkscape:color="rgb(0,0,255)"
       inkscape:label=""
       inkscape:locked="false"
       id="guide1099"
       orientation="0,1"
       position="64,104" />
    <sodipodi:guide
       inkscape:color="rgb(0,0,255)"
       inkscape:label=""
       inkscape:locked="false"
       id="guide993"
       orientation="0,1"
       position="64,128" />
    <sodipodi:guide
       inkscape:color="rgb(0,0,255)"
       inkscape:label=""
       inkscape:locked="false"
       id="guide995"
       orientation="1,0"
       position="104,64" />
    <sodipodi:guide
       inkscape:color="rgb(0,0,255)"
       inkscape:label=""
       inkscape:locked="false"
       id="guide867"
       orientation="1,0"
       position="9.2651362e-08,64" />
    <sodipodi:guide
       inkscape:color="rgb(0,0,255)"
       inkscape:label=""
       inkscape:locked="false"
       id="guide869"
       orientation="1,0"
       position="120,64" />
    <sodipodi:guide
       inkscape:color="rgb(0,0,255)"
       inkscape:label=""
       inkscape:locked="false"
       id="guide871"
       orientation="0,1"
       position="64,116" />
    <inkscape:grid
       dotted="true"
       empopacity="0.08627451"
       empcolor="#000000"
       opacity="0.49019608"
       color="#000000"
       empspacing="8"
       spacingy="1"
       spacingx="1"
       id="grid873"
       type="xygrid" />
    <sodipodi:guide
       inkscape:color="rgb(0,0,255)"
       inkscape:label=""
       inkscape:locked="false"
       id="guide877"
       orientation="1,0"
       position="24,64" />
    <sodipodi:guide
       inkscape:color="rgb(0,0,255)"
       inkscape:label=""
       inkscape:locked="false"
       id="guide879"
       orientation="1,0"
       position="116,64" />
    <sodipodi:guide
       inkscape:color="rgb(0,0,255)"
       inkscape:label=""
       inkscape:locked="false"
       id="guide881"
       orientation="0,1"
       position="64,120" />
    <sodipodi:guide
       inkscape:color="rgb(0,0,255)"
       inkscape:label=""
       inkscape:locked="false"
       id="guide883"
       orientation="0,1"
       position="64,12" />
    <sodipodi:guide
       inkscape:color="rgb(0,0,255)"
       inkscape:label=""
       inkscape:locked="false"
       id="guide885"
       orientation="1,0"
       position="8,64" />
    <sodipodi:guide
       inkscape:color="rgb(0,0,255)"
       inkscape:label=""
       inkscape:locked="false"
       id="guide887"
       orientation="1,0"
       position="128,64" />
    <sodipodi:guide
       inkscape:color="rgb(0,0,255)"
       inkscape:label=""
       inkscape:locked="false"
       id="guide897"
       orientation="0,1"
       position="64,0" />
    <sodipodi:guide
       inkscape:color="rgb(0,0,255)"
       inkscape:label=""
       inkscape:locked="false"
       id="guide899"
       orientation="0,1"
       position="64,24" />
    <sodipodi:guide
       inkscape:color="rgb(0,0,255)"
       inkscape:label=""
       inkscape:locked="false"
       id="guide950"
       orientation="-0.70710678,0.70710678"
       position="256,256" />
    <sodipodi:guide
       inkscape:color="rgb(0,0,255)"
       inkscape:label=""
       inkscape:locked="false"
       id="guide952"
       orientation="0.70710678,0.70710678"
       position="64,64" />
  </sodipodi:namedview>
  <metadata
     id="metadata4">
    <rdf:RDF>
      <cc:Work
         rdf:about="">
        <dc:format>image/svg+xml</dc:format>
        <dc:type
           rdf:resource="http://purl.org/dc/dcmitype/StillImage" />
        <dc:creator>
          <cc:Agent>
            <dc:title>GNOME Design Team</dc:title>
          </cc:Agent>
        </dc:creator>
        <dc:source />
        <cc:license
           rdf:resource="http://creativecommons.org/licenses/by-sa/4.0/" />
        <dc:title>Adwaita Icon Template</dc:title>
        <dc:subject>
          <rdf:Bag />
        </dc:subject>
        <dc:date />
        <dc:rights>
          <cc:Agent>
            <dc:title />
          </cc:Agent>
        </dc:rights>
        <dc:publisher>
          <cc:Agent>
            <dc:title />
          </cc:Agent>
        </dc:publisher>
        <dc:identifier />
        <dc:relation />
        <dc:language />
        <dc:coverage />
        <dc:description />
        <dc:contributor>
          <cc:Agent>
            <dc:title />
          </cc:Agent>
        </dc:contributor>
      </cc:Work>
      <cc:License
         rdf:about="http://creativecommons.org/licenses/by-sa/4.0/">
        <cc:permits
           rdf:resource="http://creativecommons.org/ns#Reproduction" />
        <cc:permits
           rdf:resource="http://creativecommons.org/ns#Distribution" />
        <cc:requires
           rdf:resource="http://creativecommons.org/ns#Notice" />
        <cc:requires
           rdf:resource="http://creativecommons.org/ns#Attribution" />
        <cc:permits
           rdf:resource="http://creativecommons.org/ns#DerivativeWorks" />
        <cc:requires
           rdf:resource="http://creativecommons.org/ns#ShareAlike" />
      </cc:License>
    </rdf:RDF>
  </metadata>
  <g
     transform="translate(0,-172)"
     style="display:inline"
     inkscape:groupmode="layer"
     inkscape:label="App Icon"
     id="layer1">
    <g
       sodipodi:insensitive="true"
       style="display:none"
       inkscape:label="baseplate"
       id="layer2"
       inkscape:groupmode="layer">
      <text
         inkscape:label="context"
         id="context"
         y="128.65199"
         x="-0.050041199"
         style="font-style:normal;font-variant:normal;font-weight:normal;font-stretch:normal;font-size:5.33333px;line-height:125%;font-family:Cantarell;-inkscape-font-specification:'Cantarell, Normal';text-align:start;writing-mode:lr-tb;text-anchor:start;display:inline;fill:#000000;fill-opacity:1;stroke:none;stroke-width:0.332649;enable-background:new"
         xml:space="preserve"><tspan
           style="font-size:5.33333px;stroke-width:0.332649"
           y="128.65199"
           x="-0.050041199"
           id="tspan2716"
           sodipodi:role="line">apps</tspan></text>
      <text
         xml:space="preserve"
         style="font-style:normal;font-variant:normal;font-weight:bold;font-stretch:normal;font-size:5.33333px;line-height:125%;font-family:Cantarell;-inkscape-font-specification:'Cantarell, Bold';text-align:start;writing-mode:lr-tb;text-anchor:start;display:inline;fill:#000000;fill-opacity:1;stroke:none;stroke-width:0.332649;enable-background:new"
         x="-0.24669456"
         y="137.23398"
         id="text3021"
         inkscape:label="icon-name"><tspan
           style="font-size:5.33333px;stroke-width:0.332649"
           sodipodi:role="line"
           id="tspan3023"
           x="-0.24669456"
           y="137.23398">org.gnome.Seahorse</tspan></text>
      <g
         inkscape:export-ydpi="12"
         inkscape:export-xdpi="12"
         id="g12027"
         transform="matrix(7.9911709,0,0,8.0036407,-167.7909,-4846.0776)"
         style="display:inline;fill:#000000;enable-background:new" />
      <rect
         inkscape:label="512x512"
         y="172"
         x="9.2651362e-08"
         height="128"
         width="128"
         id="rect13805"
         style="display:inline;overflow:visible;visibility:visible;fill:#f0f0f0;fill-opacity:1;fill-rule:nonzero;stroke:none;stroke-width:0.5;marker:none;enable-background:accumulate" />
      <g
         transform="translate(-24,24)"
         style="fill:none;fill-opacity:0.25098;stroke:#a579b3;stroke-opacity:1"
         id="g883" />
      <g
         transform="translate(-24,24)"
         style="fill:none;fill-opacity:0.25098;stroke:#a579b3;stroke-opacity:1"
         id="g900" />
      <rect
         style="display:inline;overflow:visible;visibility:visible;fill:#f0f0f0;fill-opacity:1;fill-rule:nonzero;stroke:none;stroke-width:0.5;marker:none;enable-background:accumulate"
         id="rect859"
         width="16"
         height="16"
         x="160"
         y="172"
         inkscape:label="512x512" />
      <text
         inkscape:label="icon-name"
         id="text863"
         y="164"
         x="0"
         style="font-style:normal;font-variant:normal;font-weight:bold;font-stretch:normal;font-size:4px;line-height:125%;font-family:Cantarell;-inkscape-font-specification:'Cantarell, Bold';text-align:start;writing-mode:lr-tb;text-anchor:start;display:inline;fill:#000000;fill-opacity:1;stroke:none;stroke-width:0.332649;enable-background:new"
         xml:space="preserve"><tspan
           y="164"
           x="0"
           id="tspan861"
           sodipodi:role="line"
           style="font-size:4px;stroke-width:0.332649">Hicolor</tspan></text>
      <text
         xml:space="preserve"
         style="font-style:normal;font-variant:normal;font-weight:bold;font-stretch:normal;font-size:4px;line-height:125%;font-family:Cantarell;-inkscape-font-specification:'Cantarell, Bold';text-align:start;writing-mode:lr-tb;text-anchor:start;display:inline;fill:#000000;fill-opacity:1;stroke:none;stroke-width:0.332649;enable-background:new"
         x="160"
         y="164"
         id="text867"
         inkscape:label="icon-name"><tspan
           style="font-size:4px;stroke-width:0.332649"
           sodipodi:role="line"
           id="tspan865"
           x="160"
           y="164">Symbolic</tspan></text>
    </g>
    <g
       inkscape:label="template"
       id="layer4"
       inkscape:groupmode="layer">
      <rect
         style="display:inline;overflow:visible;visibility:visible;fill:#f0f0f0;fill-opacity:0;fill-rule:nonzero;stroke:none;stroke-width:0.5;marker:none;enable-background:accumulate"
         id="hicolor"
         width="128"
         height="128"
         x="0"
         y="172"
         inkscape:label="0" />
      <rect
         inkscape:label="0"
         y="172"
         x="160"
         height="16"
         width="16"
         id="symbolic"
         style="display:inline;overflow:visible;visibility:visible;fill:#f0f0f0;fill-opacity:0;fill-rule:nonzero;stroke:none;stroke-width:0.5;marker:none;enable-background:accumulate" />
    </g>
    <g
       sodipodi:insensitive="true"
       style="display:none"
       inkscape:label="hairlines"
       id="layer3"
       inkscape:groupmode="layer">
      <circle
         style="display:inline;opacity:0.1;vector-effect:none;fill:none;fill-opacity:1;stroke:#000000;stroke-width:0.99;stroke-linecap:butt;stroke-linejoin:miter;stroke-miterlimit:4;stroke-dasharray:0.99, 0.99;stroke-dashoffset:0;stroke-opacity:1;marker:none;marker-start:none;marker-mid:none;marker-end:none;paint-order:normal;enable-background:new"
         id="circle2892"
         r="59.504131"
         cy="236"
         cx="64.000031" />
      <rect
         style="display:inline;opacity:0.1;vector-effect:none;fill:none;fill-opacity:1;stroke:#000000;stroke-width:0.99;stroke-linecap:butt;stroke-linejoin:miter;stroke-miterlimit:4;stroke-dasharray:0.99, 0.99;stroke-dashoffset:0;stroke-opacity:1;marker:none;marker-start:none;marker-mid:none;marker-end:none;paint-order:normal;enable-background:new"
         id="rect2894"
         width="87.009987"
         height="111.01005"
         x="20.495007"
         y="180.49496"
         rx="8.701004"
         ry="7.9292889" />
      <rect
         style="display:inline;opacity:0.1;vector-effect:none;fill:none;fill-opacity:1;stroke:#000000;stroke-width:0.99;stroke-linecap:butt;stroke-linejoin:miter;stroke-miterlimit:4;stroke-dasharray:0.99, 0.99;stroke-dashoffset:0;stroke-opacity:1;marker:none;marker-start:none;marker-mid:none;marker-end:none;paint-order:normal;enable-background:new"
         id="rect2896"
         width="103.00952"
         height="103.00952"
         x="12.495266"
         y="184.49524"
         rx="7.9238095"
         ry="7.9238095" />
      <rect
         style="display:inline;opacity:0.1;vector-effect:none;fill:none;fill-opacity:1;stroke:#000000;stroke-width:0.99;stroke-linecap:butt;stroke-linejoin:miter;stroke-miterlimit:4;stroke-dasharray:0.99, 0.99;stroke-dashoffset:0;stroke-opacity:1;marker:none;marker-start:none;marker-mid:none;marker-end:none;paint-order:normal;enable-background:new"
         id="rect2898"
         width="111.01004"
         height="87.010048"
         x="8.4950066"
         y="200.49496"
         rx="7.9292889"
         ry="8.701005" />
      <path
         style="display:inline;fill:none;stroke:#62a0ea;stroke-width:2;stroke-linecap:butt;stroke-linejoin:miter;stroke-miterlimit:4;stroke-dasharray:none;stroke-opacity:1;enable-background:new"
         d="M 2.6203015e-5,288.99999 H 128.00003"
         id="path2900"
         inkscape:connector-curvature="0" />
    </g>
    <g
       style="display:inline"
       inkscape:label="icons"
       id="layer9"
       inkscape:groupmode="layer">
      <rect
         style="display:inline;opacity:1;fill:#2ec27e;fill-opacity:1;stroke:none;stroke-width:0.25;stroke-linecap:butt;stroke-linejoin:miter;stroke-miterlimit:4;stroke-dasharray:none;stroke-dashoffset:0;stroke-opacity:1;marker:none;marker-start:none;marker-mid:none;marker-end:none;paint-order:normal;enable-background:new"
         id="rect1027"
         width="112"
         height="63.999977"
         x="8"
         y="224"
         rx="8"
         ry="8" />
      <g
         style="display:inline;opacity:1;stroke:#26a269;stroke-width:0.935414;enable-background:new"
         id="g1256"
         transform="matrix(1,0,0,1.1428571,-4.8522949e-8,-22.857143)">
        <path
           style="fill:none;fill-rule:evenodd;stroke:#26a269;stroke-width:1.87083;stroke-linecap:butt;stroke-linejoin:miter;stroke-miterlimit:4;stroke-dasharray:none;stroke-opacity:1"
           d="m 27,230 v 14"
           id="path1164"
           inkscape:connector-curvature="0"
           sodipodi:nodetypes="cc" />
        <path
           inkscape:connector-curvature="0"
           id="path1166"
           d="m 32,230 v 14"
           style="fill:none;fill-rule:evenodd;stroke:#26a269;stroke-width:3.74166;stroke-linecap:butt;stroke-linejoin:miter;stroke-miterlimit:4;stroke-dasharray:none;stroke-opacity:1"
           sodipodi:nodetypes="cc" />
        <path
           inkscape:connector-curvature="0"
           id="path1168"
           d="m 37,230 v 14"
           style="fill:none;fill-rule:evenodd;stroke:#26a269;stroke-width:1.87083;stroke-linecap:butt;stroke-linejoin:miter;stroke-miterlimit:4;stroke-dasharray:none;stroke-opacity:1"
           sodipodi:nodetypes="cc" />
        <path
           style="fill:none;fill-rule:evenodd;stroke:#26a269;stroke-width:1.87083;stroke-linecap:butt;stroke-linejoin:miter;stroke-miterlimit:4;stroke-dasharray:none;stroke-opacity:1"
           d="m 41,230 v 14"
           id="path1170"
           inkscape:connector-curvature="0"
           sodipodi:nodetypes="cc" />
        <path
           style="fill:none;fill-rule:evenodd;stroke:#26a269;stroke-width:3.74166;stroke-linecap:butt;stroke-linejoin:miter;stroke-miterlimit:4;stroke-dasharray:none;stroke-opacity:1"
           d="m 46,230 v 14"
           id="path1172"
           inkscape:connector-curvature="0"
           sodipodi:nodetypes="cc" />
        <path
           inkscape:connector-curvature="0"
           id="path1174"
           d="m 56,230 v 14"
           style="fill:none;fill-rule:evenodd;stroke:#26a269;stroke-width:3.74166;stroke-linecap:butt;stroke-linejoin:miter;stroke-miterlimit:4;stroke-dasharray:none;stroke-opacity:1"
           sodipodi:nodetypes="cc" />
        <path
           style="fill:none;fill-rule:evenodd;stroke:#26a269;stroke-width:1.87083;stroke-linecap:butt;stroke-linejoin:miter;stroke-miterlimit:4;stroke-dasharray:none;stroke-opacity:1"
           d="m 51,230 v 14"
           id="path1176"
           inkscape:connector-curvature="0"
           sodipodi:nodetypes="cc" />
        <path
           inkscape:connector-curvature="0"
           id="path1178"
           d="m 63,230 v 14"
           style="fill:none;fill-rule:evenodd;stroke:#26a269;stroke-width:5.61249;stroke-linecap:butt;stroke-linejoin:miter;stroke-miterlimit:4;stroke-dasharray:none;stroke-opacity:1"
           sodipodi:nodetypes="cc" />
        <path
           inkscape:connector-curvature="0"
           id="path1180"
           d="m 69,230 v 14"
           style="fill:none;fill-rule:evenodd;stroke:#26a269;stroke-width:1.87083;stroke-linecap:butt;stroke-linejoin:miter;stroke-miterlimit:4;stroke-dasharray:none;stroke-opacity:1"
           sodipodi:nodetypes="cc" />
        <path
           inkscape:connector-curvature="0"
           id="path1182"
           d="m 73,230 v 14"
           style="fill:none;fill-rule:evenodd;stroke:#26a269;stroke-width:1.87083;stroke-linecap:butt;stroke-linejoin:miter;stroke-miterlimit:4;stroke-dasharray:none;stroke-opacity:1"
           sodipodi:nodetypes="cc" />
        <path
           style="fill:none;fill-rule:evenodd;stroke:#26a269;stroke-width:1.87083;stroke-linecap:butt;stroke-linejoin:miter;stroke-miterlimit:4;stroke-dasharray:none;stroke-opacity:1"
           d="m 77,230 v 14"
           id="path1184"
           inkscape:connector-curvature="0"
           sodipodi:nodetypes="cc" />
        <path
           style="fill:none;fill-rule:evenodd;stroke:#26a269;stroke-width:3.74166;stroke-linecap:butt;stroke-linejoin:miter;stroke-miterlimit:4;stroke-dasharray:none;stroke-opacity:1"
           d="m 82,230 v 14"
           id="path1186"
           inkscape:connector-curvature="0"
           sodipodi:nodetypes="cc" />
        <path
           inkscape:connector-curvature="0"
           id="path1188"
           d="m 87,230 v 14"
           style="fill:none;fill-rule:evenodd;stroke:#26a269;stroke-width:1.87083;stroke-linecap:butt;stroke-linejoin:miter;stroke-miterlimit:4;stroke-dasharray:none;stroke-opacity:1"
           sodipodi:nodetypes="cc" />
        <path
           style="fill:none;fill-rule:evenodd;stroke:#26a269;stroke-width:1.87083;stroke-linecap:butt;stroke-linejoin:miter;stroke-miterlimit:4;stroke-dasharray:none;stroke-opacity:1"
           d="m 99,230 v 14"
           id="path1190"
           inkscape:connector-curvature="0"
           sodipodi:nodetypes="cc" />
        <path
           style="fill:none;fill-rule:evenodd;stroke:#26a269;stroke-width:5.61249;stroke-linecap:butt;stroke-linejoin:miter;stroke-miterlimit:4;stroke-dasharray:none;stroke-opacity:1"
           d="m 93,230 v 14"
           id="path1192"
           inkscape:connector-curvature="0"
           sodipodi:nodetypes="cc" />
        <path
           inkscape:connector-curvature="0"
           id="path1194"
           d="m 103,230 v 14"
           style="fill:none;fill-rule:evenodd;stroke:#26a269;stroke-width:1.87083;stroke-linecap:butt;stroke-linejoin:miter;stroke-miterlimit:4;stroke-dasharray:none;stroke-opacity:1"
           sodipodi:nodetypes="cc" />
        <path
           style="fill:none;fill-rule:evenodd;stroke:#26a269;stroke-width:1.87083;stroke-linecap:butt;stroke-linejoin:miter;stroke-miterlimit:4;stroke-dasharray:none;stroke-opacity:1"
           d="m 107,230 v 14"
           id="path1196"
           inkscape:connector-curvature="0"
           sodipodi:nodetypes="cc" />
      </g>
      <g
         style="display:inline;fill:#8ff0a4;enable-background:new"
         id="g1130"
         transform="translate(-4.8522949e-8,12)">
        <path
           style="font-style:normal;font-variant:normal;font-weight:800;font-stretch:normal;font-size:medium;line-height:1000%;font-family:Cantarell;-inkscape-font-specification:'Cantarell Ultra-Bold';letter-spacing:2px;word-spacing:0px;fill:#8ff0a4;fill-opacity:1;stroke:none;stroke-width:0.740771px;stroke-linecap:butt;stroke-linejoin:miter;stroke-opacity:1"
           d="m 22.21582,254 1.197265,5.06836 -3.90039,-3.2793 -1.453125,2.5918 5.009765,1.6582 -5.042968,1.58985 1.433593,2.64062 3.955078,-3.30469 L 22.21582,266 h 3.410156 l -1.101562,-4.95898 3.833984,3.31445 1.476562,-2.61914 -4.978515,-1.68555 5.117187,-1.42578 -1.453125,-2.61914 -4.033203,3.08398 L 25.624023,254 Z"
           id="path1940"
           inkscape:connector-curvature="0"
           sodipodi:nodetypes="ccccccccccccccccccc" />
        <path
           sodipodi:nodetypes="ccccccccccccccccccc"
           inkscape:connector-curvature="0"
           id="path1056"
           d="m 38.21582,254 1.197265,5.06836 -3.90039,-3.2793 -1.453125,2.5918 5.009765,1.6582 -5.042968,1.58985 1.433593,2.64062 3.955078,-3.30469 L 38.21582,266 h 3.410156 l -1.101562,-4.95898 3.833984,3.31445 1.476562,-2.61914 -4.978515,-1.68555 5.117187,-1.42578 -1.453125,-2.61914 -4.033203,3.08398 L 41.624023,254 Z"
           style="font-style:normal;font-variant:normal;font-weight:800;font-stretch:normal;font-size:medium;line-height:1000%;font-family:Cantarell;-inkscape-font-specification:'Cantarell Ultra-Bold';letter-spacing:2px;word-spacing:0px;fill:#8ff0a4;fill-opacity:1;stroke:none;stroke-width:0.740771px;stroke-linecap:butt;stroke-linejoin:miter;stroke-opacity:1" />
        <path
           style="font-style:normal;font-variant:normal;font-weight:800;font-stretch:normal;font-size:medium;line-height:1000%;font-family:Cantarell;-inkscape-font-specification:'Cantarell Ultra-Bold';letter-spacing:2px;word-spacing:0px;fill:#8ff0a4;fill-opacity:1;stroke:none;stroke-width:0.740771px;stroke-linecap:butt;stroke-linejoin:miter;stroke-opacity:1"
           d="m 54.21582,254 1.197265,5.06836 -3.90039,-3.2793 -1.453125,2.5918 5.009765,1.6582 -5.042968,1.58985 1.433593,2.64062 3.955078,-3.30469 L 54.21582,266 h 3.410156 l -1.101562,-4.95898 3.833984,3.31445 1.476562,-2.61914 -4.978515,-1.68555 5.117187,-1.42578 -1.453125,-2.61914 -4.033203,3.08398 L 57.624023,254 Z"
           id="path1062"
           inkscape:connector-curvature="0"
           sodipodi:nodetypes="ccccccccccccccccccc" />
        <path
           sodipodi:nodetypes="ccccccccccccccccccc"
           inkscape:connector-curvature="0"
           id="path1068"
           d="m 70.21582,254 1.197265,5.06836 -3.90039,-3.2793 -1.453125,2.5918 5.009765,1.6582 -5.042968,1.58985 1.433593,2.64062 3.955078,-3.30469 L 70.21582,266 h 3.410156 l -1.101562,-4.95898 3.833984,3.31445 1.476562,-2.61914 -4.978515,-1.68555 5.117187,-1.42578 -1.453125,-2.61914 -4.033203,3.08398 L 73.624023,254 Z"
           style="font-style:normal;font-variant:normal;font-weight:800;font-stretch:normal;font-size:medium;line-height:1000%;font-family:Cantarell;-inkscape-font-specification:'Cantarell Ultra-Bold';letter-spacing:2px;word-spacing:0px;fill:#8ff0a4;fill-opacity:1;stroke:none;stroke-width:0.740771px;stroke-linecap:butt;stroke-linejoin:miter;stroke-opacity:1" />
        <path
           style="font-style:normal;font-variant:normal;font-weight:800;font-stretch:normal;font-size:medium;line-height:1000%;font-family:Cantarell;-inkscape-font-specification:'Cantarell Ultra-Bold';letter-spacing:2px;word-spacing:0px;fill:#8ff0a4;fill-opacity:1;stroke:none;stroke-width:0.740771px;stroke-linecap:butt;stroke-linejoin:miter;stroke-opacity:1"
           d="m 86.21582,254 1.197265,5.06836 -3.90039,-3.2793 -1.453125,2.5918 5.009765,1.6582 -5.042968,1.58985 1.433593,2.64062 3.955078,-3.30469 L 86.21582,266 h 3.410156 l -1.101562,-4.95898 3.833984,3.31445 1.476562,-2.61914 -4.978515,-1.68555 5.117187,-1.42578 -1.453125,-2.61914 -4.033203,3.08398 L 89.624023,254 Z"
           id="path1074"
           inkscape:connector-curvature="0"
           sodipodi:nodetypes="ccccccccccccccccccc" />
        <path
           sodipodi:nodetypes="ccccccccccccccccccc"
           inkscape:connector-curvature="0"
           id="path1080"
           d="m 102.21582,254 1.19726,5.06836 -3.900385,-3.2793 -1.453125,2.5918 5.00976,1.6582 -5.042963,1.58985 1.433593,2.64062 3.95508,-3.30469 L 102.21582,266 h 3.41016 l -1.10157,-4.95898 3.83399,3.31445 1.47656,-2.61914 -4.97851,-1.68555 5.11718,-1.42578 -1.45312,-2.61914 -4.03321,3.08398 L 105.62402,254 Z"
           style="font-style:normal;font-variant:normal;font-weight:800;font-stretch:normal;font-size:medium;line-height:1000%;font-family:Cantarell;-inkscape-font-specification:'Cantarell Ultra-Bold';letter-spacing:2px;word-spacing:0px;fill:#8ff0a4;fill-opacity:1;stroke:none;stroke-width:0.740771px;stroke-linecap:butt;stroke-linejoin:miter;stroke-opacity:1" />
      </g>
      <rect
         ry="7.9999995"
         rx="8"
         y="200"
         x="8"
         height="40"
         width="112"
         id="rect954"
         style="display:inline;opacity:1;fill:#2ec27e;fill-opacity:1;stroke:none;stroke-width:0.270031;stroke-linecap:butt;stroke-linejoin:miter;stroke-miterlimit:4;stroke-dasharray:none;stroke-dashoffset:0;stroke-opacity:1;marker:none;marker-start:none;marker-mid:none;marker-end:none;paint-order:normal;enable-background:new" />
      <rect
         y="214"
         x="8"
         height="18"
         width="112"
         id="rect961"
         style="display:inline;opacity:1;fill:#241f31;fill-opacity:1;stroke:none;stroke-width:0.25;stroke-linecap:butt;stroke-linejoin:miter;stroke-miterlimit:4;stroke-dasharray:none;stroke-dashoffset:0;stroke-opacity:1;marker:none;marker-start:none;marker-mid:none;marker-end:none;paint-order:normal;enable-background:new" />
      <g
         transform="translate(-250.02637)"
         id="g1678">
        <g
           style="display:inline;enable-background:new"
           id="g975"
           transform="translate(-219.97363,12)">
          <rect
             ry="8"
             rx="8"
             y="198"
             x="8"
             height="80"
             width="112"
             id="rect933"
             style="display:inline;opacity:1;fill:#deddda;fill-opacity:1;stroke:none;stroke-width:0.25;stroke-linecap:butt;stroke-linejoin:miter;stroke-miterlimit:4;stroke-dasharray:none;stroke-dashoffset:0;stroke-opacity:1;marker:none;marker-start:none;marker-mid:none;marker-end:none;paint-order:normal;enable-background:new" />
          <rect
             style="display:inline;opacity:1;fill:#f6f5f4;fill-opacity:1;stroke:none;stroke-width:1;stroke-linecap:butt;stroke-linejoin:miter;stroke-miterlimit:4;stroke-dasharray:none;stroke-dashoffset:0;stroke-opacity:1;marker:none;marker-start:none;marker-mid:none;marker-end:none;paint-order:normal;enable-background:new"
             id="rect935"
             width="448"
             height="319.99994"
             x="32"
             y="-116"
             rx="32"
             ry="32"
             transform="matrix(0.25,0,0,0.25,6.9488522e-8,225)" />
          <path
             style="font-style:normal;font-variant:normal;font-weight:800;font-stretch:normal;font-size:medium;line-height:1000%;font-family:Cantarell;-inkscape-font-specification:'Cantarell Ultra-Bold';letter-spacing:2px;word-spacing:0px;fill:#98c1f1;fill-opacity:1;stroke:none;stroke-width:0.740771px;stroke-linecap:butt;stroke-linejoin:miter;stroke-opacity:1"
             d="m 23.932617,254 1.197265,5.06836 -3.90039,-3.2793 -1.453125,2.5918 5.009765,1.6582 -5.042968,1.58985 1.433593,2.64062 3.955078,-3.30469 L 23.932617,266 h 3.410156 l -1.101563,-4.95898 3.833985,3.31445 1.476562,-2.61914 -4.978515,-1.68555 5.117187,-1.42578 -1.453125,-2.61914 -4.033203,3.08398 L 27.34082,254 Z m 15.314453,0 1.197265,5.06836 -3.902343,-3.2793 -1.451172,2.5918 5.007812,1.6582 -5.042968,1.58985 1.433593,2.64062 3.955078,-3.30469 L 39.24707,266 h 3.410156 l -1.101562,-4.95898 3.832031,3.31445 1.476562,-2.61914 -4.978515,-1.68555 5.11914,-1.42578 -1.455078,-2.61914 -4.03125,3.08398 L 42.655273,254 Z m 15.3125,0 1.197265,5.06836 -3.90039,-3.2793 -1.453125,2.5918 5.009765,1.6582 -5.044921,1.58985 1.433593,2.64062 3.957031,-3.30469 L 54.55957,266 h 3.410156 l -1.101562,-4.95898 3.832031,3.31445 1.476562,-2.61914 -4.978515,-1.68555 5.11914,-1.42578 -1.455078,-2.61914 -4.03125,3.08398 L 57.967773,254 Z m 15.3125,0 1.197265,5.06836 -3.90039,-3.2793 -1.453125,2.5918 5.009765,1.6582 -5.042968,1.58985 1.43164,2.64062 3.957031,-3.30469 L 69.87207,266 h 3.412109 l -1.103515,-4.95898 3.833984,3.31445 1.476562,-2.61914 -4.978515,-1.68555 5.117187,-1.42578 -1.453125,-2.61914 -4.03125,3.08398 L 73.282226,254 Z m 15.312496,0 1.19922,5.06836 -3.90234,-3.2793 -1.453126,2.58985 5.011716,1.66015 -5.044919,1.58985 1.431639,2.64062 3.95703,-3.30469 L 85.184566,266 h 3.41211 l -1.10156,-4.95898 3.83203,3.31445 1.47656,-2.61914 -4.97851,-1.68555 5.11719,-1.42578 -1.45313,-2.61914 -4.03125,3.08398 L 88.594726,254 Z m 15.314464,0 1.19922,5.06836 -3.904304,-3.2793 -1.45117,2.5918 5.009764,1.6582 -5.042974,1.58985 1.43164,2.64062 3.957044,-3.30469 L 100.49903,266 h 3.41211 l -1.10157,-4.95898 3.83203,3.31445 1.47657,-2.61914 -4.98047,-1.68555 5.11914,-1.42578 -1.45508,-2.61914 -4.03125,3.08398 L 103.90918,254 Z"
             id="path937"
             inkscape:connector-curvature="0" />
          <path
             style="fill:none;fill-rule:evenodd;stroke:#deddda;stroke-width:2;stroke-linecap:butt;stroke-linejoin:miter;stroke-miterlimit:4;stroke-dasharray:none;stroke-opacity:1"
             d="m 16,231 h 96"
             id="path939"
             inkscape:connector-curvature="0" />
          <rect
             style="display:inline;opacity:1;fill:#5e5c64;fill-opacity:1;stroke:none;stroke-width:0.25;stroke-linecap:butt;stroke-linejoin:miter;stroke-miterlimit:4;stroke-dasharray:none;stroke-dashoffset:0;stroke-opacity:1;marker:none;marker-start:none;marker-mid:none;marker-end:none;paint-order:normal;enable-background:new"
             id="rect941"
             width="112"
             height="16"
             x="8"
             y="208" />
          <path
             inkscape:connector-curvature="0"
             id="path943"
             d="m 16,235 h 96"
             style="fill:none;fill-rule:evenodd;stroke:#deddda;stroke-width:2;stroke-linecap:butt;stroke-linejoin:miter;stroke-miterlimit:4;stroke-dasharray:none;stroke-opacity:1" />
          <path
             style="fill:none;fill-rule:evenodd;stroke:#deddda;stroke-width:2;stroke-linecap:butt;stroke-linejoin:miter;stroke-miterlimit:4;stroke-dasharray:none;stroke-opacity:1"
             d="M 16,239 H 92"
             id="path945"
             inkscape:connector-curvature="0"
             sodipodi:nodetypes="cc" />
          <g
             id="g959"
             transform="rotate(-180,105,239)">
            <path
               style="display:inline;opacity:1;vector-effect:none;fill:#9a9996;fill-opacity:1;stroke:none;stroke-width:0.5;stroke-linecap:butt;stroke-linejoin:miter;stroke-miterlimit:4;stroke-dasharray:none;stroke-dashoffset:0;stroke-opacity:1;marker:none;marker-start:none;marker-mid:none;marker-end:none;paint-order:normal;enable-background:new"
               d="m 170,296 a 28,28 0 0 1 -28,-28 28,28 0 0 1 28,-28 28,28 0 0 1 28,28 28,28 0 0 1 -28,28 z m 0.0312,-12 a 6.0312505,6.0000005 0 0 0 6.03125,-6 6.0312505,6.0000005 0 0 0 -6.03125,-6 6.0312505,6.0000005 0 0 0 -6.03125,6 6.0312505,6.0000005 0 0 0 6.03125,6 z"
               id="path947"
               inkscape:connector-curvature="0" />
            <g
               transform="matrix(0.70710678,-0.70710678,-0.70710678,-0.70710678,244.95332,484.3158)"
               id="g955">
              <path
                 sodipodi:nodetypes="ccccccccccccccccccc"
                 inkscape:connector-curvature="0"
                 id="path949"
                 d="m 125.41421,214.44365 -16.97055,16.97056 14.14212,14.14214 h 4.24264 l -1.41421,2.82843 1.41421,1.41421 h 2.82843 l -1.41421,1.41421 1.41421,1.41421 h 5.65685 l -1.41421,4.24265 1.41421,1.41421 h 2.82843 l -1.09142,1.41422 1.09142,1.41421 h 22.62742 l 3.53553,-3.53554 v -4.24264 z"
                 style="display:inline;opacity:1;vector-effect:none;fill:#9a9996;fill-opacity:1;stroke:none;stroke-width:0.5;stroke-linecap:butt;stroke-linejoin:miter;stroke-miterlimit:4;stroke-dasharray:none;stroke-dashoffset:0;stroke-opacity:1;marker:none;marker-start:none;marker-mid:none;marker-end:none;paint-order:normal;enable-background:new" />
              <path
                 style="display:inline;opacity:1;vector-effect:none;fill:url(#linearGradient977);fill-opacity:1;stroke:none;stroke-width:0.5;stroke-linecap:butt;stroke-linejoin:miter;stroke-miterlimit:4;stroke-dasharray:none;stroke-dashoffset:0;stroke-opacity:1;marker:none;marker-start:none;marker-mid:none;marker-end:none;paint-order:normal;enable-background:new"
                 d="M 124,213.02944 107.02945,230 l 14.14212,14.14214 h 4.24264 v 4.24264 h 2.82843 v 2.82842 h 5.65685 v 5.65686 h 2.82843 v 2.82843 h 22.62742 l 3.53553,-3.53554 v -4.24264 z"
                 id="path951"
                 inkscape:connector-curvature="0"
                 sodipodi:nodetypes="ccccccccccccccc" />
              <path
                 sodipodi:nodetypes="cccccc"
                 inkscape:connector-curvature="0"
                 style="display:inline;opacity:1;vector-effect:none;fill:url(#linearGradient979);fill-opacity:1;stroke:none;stroke-width:0.5;stroke-linecap:butt;stroke-linejoin:miter;stroke-miterlimit:4;stroke-dasharray:none;stroke-dashoffset:0;stroke-opacity:1;marker:none;marker-start:none;marker-mid:none;marker-end:none;paint-order:normal;enable-background:new"
                 d="m 125.74823,221.26459 c -1.79388,0.002 -2.67811,2.18243 -1.39257,3.43359 l 34.99968,35.00031 2.82844,-2.82843 -35,-35 c -0.37702,-0.38755 -0.89487,-0.60597 -1.43555,-0.60547 z"
                 id="path953" />
            </g>
            <path
               inkscape:connector-curvature="0"
               id="path957"
               d="m 170,298 a 28,28 0 0 0 28,-28 28,28 0 0 0 -28,-28 28,28 0 0 0 -28,28 28,28 0 0 0 28,28 z m -0.0312,-12 a 6.0312505,6.0000005 0 0 1 -6.03125,-6 6.0312505,6.0000005 0 0 1 6.03125,-6 6.0312505,6.0000005 0 0 1 6.03125,6 6.0312505,6.0000005 0 0 1 -6.03125,6 z"
               style="display:inline;opacity:1;vector-effect:none;fill:#deddda;fill-opacity:1;stroke:none;stroke-width:0.5;stroke-linecap:butt;stroke-linejoin:miter;stroke-miterlimit:4;stroke-dasharray:none;stroke-dashoffset:0;stroke-opacity:1;marker:none;marker-start:none;marker-mid:none;marker-end:none;paint-order:normal;enable-background:new" />
          </g>
        </g>
      </g>
      <path
         sodipodi:nodetypes="cccc"
         inkscape:connector-curvature="0"
         id="path1138"
         d="m 22,242 -7.2,6 7.2,6 z"
         style="display:inline;fill:#26a269;fill-opacity:1;fill-rule:evenodd;stroke:none;stroke-width:1px;stroke-linecap:butt;stroke-linejoin:miter;stroke-opacity:1;enable-background:new" />
      <g
         transform="translate(-340)"
         id="g1797">
        <rect
           style="display:inline;opacity:1;fill:#2ec27e;fill-opacity:1;stroke:none;stroke-width:0.25;stroke-linecap:butt;stroke-linejoin:miter;stroke-miterlimit:4;stroke-dasharray:none;stroke-dashoffset:0;stroke-opacity:1;marker:none;marker-start:none;marker-mid:none;marker-end:none;paint-order:normal;enable-background:new"
           id="rect1680"
           width="112"
           height="63.999977"
           x="8"
           y="224"
           rx="8"
           ry="8" />
        <g
           style="display:inline;opacity:1;stroke:#26a269;enable-background:new"
           id="g1716"
           transform="translate(-4.8522949e-8,12)">
          <path
             style="fill:none;fill-rule:evenodd;stroke:#26a269;stroke-width:2;stroke-linecap:butt;stroke-linejoin:miter;stroke-miterlimit:4;stroke-dasharray:none;stroke-opacity:1"
             d="m 27,230 v 14"
             id="path1682"
             inkscape:connector-curvature="0"
             sodipodi:nodetypes="cc" />
          <path
             inkscape:connector-curvature="0"
             id="path1684"
             d="m 32,230 v 14"
             style="fill:none;fill-rule:evenodd;stroke:#26a269;stroke-width:4;stroke-linecap:butt;stroke-linejoin:miter;stroke-miterlimit:4;stroke-dasharray:none;stroke-opacity:1"
             sodipodi:nodetypes="cc" />
          <path
             inkscape:connector-curvature="0"
             id="path1686"
             d="m 37,230 v 14"
             style="fill:none;fill-rule:evenodd;stroke:#26a269;stroke-width:2;stroke-linecap:butt;stroke-linejoin:miter;stroke-miterlimit:4;stroke-dasharray:none;stroke-opacity:1"
             sodipodi:nodetypes="cc" />
          <path
             style="fill:none;fill-rule:evenodd;stroke:#26a269;stroke-width:2;stroke-linecap:butt;stroke-linejoin:miter;stroke-miterlimit:4;stroke-dasharray:none;stroke-opacity:1"
             d="m 41,230 v 14"
             id="path1688"
             inkscape:connector-curvature="0"
             sodipodi:nodetypes="cc" />
          <path
             style="fill:none;fill-rule:evenodd;stroke:#26a269;stroke-width:4;stroke-linecap:butt;stroke-linejoin:miter;stroke-miterlimit:4;stroke-dasharray:none;stroke-opacity:1"
             d="m 46,230 v 14"
             id="path1690"
             inkscape:connector-curvature="0"
             sodipodi:nodetypes="cc" />
          <path
             inkscape:connector-curvature="0"
             id="path1692"
             d="m 56,230 v 14"
             style="fill:none;fill-rule:evenodd;stroke:#26a269;stroke-width:4;stroke-linecap:butt;stroke-linejoin:miter;stroke-miterlimit:4;stroke-dasharray:none;stroke-opacity:1"
             sodipodi:nodetypes="cc" />
          <path
             style="fill:none;fill-rule:evenodd;stroke:#26a269;stroke-width:2;stroke-linecap:butt;stroke-linejoin:miter;stroke-miterlimit:4;stroke-dasharray:none;stroke-opacity:1"
             d="m 51,230 v 14"
             id="path1694"
             inkscape:connector-curvature="0"
             sodipodi:nodetypes="cc" />
          <path
             inkscape:connector-curvature="0"
             id="path1696"
             d="m 63,230 v 14"
             style="fill:none;fill-rule:evenodd;stroke:#26a269;stroke-width:6;stroke-linecap:butt;stroke-linejoin:miter;stroke-miterlimit:4;stroke-dasharray:none;stroke-opacity:1"
             sodipodi:nodetypes="cc" />
          <path
             inkscape:connector-curvature="0"
             id="path1698"
             d="m 69,230 v 14"
             style="fill:none;fill-rule:evenodd;stroke:#26a269;stroke-width:2;stroke-linecap:butt;stroke-linejoin:miter;stroke-miterlimit:4;stroke-dasharray:none;stroke-opacity:1"
             sodipodi:nodetypes="cc" />
          <path
             inkscape:connector-curvature="0"
             id="path1700"
             d="m 73,230 v 14"
             style="fill:none;fill-rule:evenodd;stroke:#26a269;stroke-width:2;stroke-linecap:butt;stroke-linejoin:miter;stroke-miterlimit:4;stroke-dasharray:none;stroke-opacity:1"
             sodipodi:nodetypes="cc" />
          <path
             style="fill:none;fill-rule:evenodd;stroke:#26a269;stroke-width:2;stroke-linecap:butt;stroke-linejoin:miter;stroke-miterlimit:4;stroke-dasharray:none;stroke-opacity:1"
             d="m 77,230 v 14"
             id="path1702"
             inkscape:connector-curvature="0"
             sodipodi:nodetypes="cc" />
          <path
             style="fill:none;fill-rule:evenodd;stroke:#26a269;stroke-width:4;stroke-linecap:butt;stroke-linejoin:miter;stroke-miterlimit:4;stroke-dasharray:none;stroke-opacity:1"
             d="m 82,230 v 14"
             id="path1704"
             inkscape:connector-curvature="0"
             sodipodi:nodetypes="cc" />
          <path
             inkscape:connector-curvature="0"
             id="path1706"
             d="m 87,230 v 14"
             style="fill:none;fill-rule:evenodd;stroke:#26a269;stroke-width:2;stroke-linecap:butt;stroke-linejoin:miter;stroke-miterlimit:4;stroke-dasharray:none;stroke-opacity:1"
             sodipodi:nodetypes="cc" />
          <path
             style="fill:none;fill-rule:evenodd;stroke:#26a269;stroke-width:2;stroke-linecap:butt;stroke-linejoin:miter;stroke-miterlimit:4;stroke-dasharray:none;stroke-opacity:1"
             d="m 99,230 v 14"
             id="path1708"
             inkscape:connector-curvature="0"
             sodipodi:nodetypes="cc" />
          <path
             style="fill:none;fill-rule:evenodd;stroke:#26a269;stroke-width:6;stroke-linecap:butt;stroke-linejoin:miter;stroke-miterlimit:4;stroke-dasharray:none;stroke-opacity:1"
             d="m 93,230 v 14"
             id="path1710"
             inkscape:connector-curvature="0"
             sodipodi:nodetypes="cc" />
          <path
             inkscape:connector-curvature="0"
             id="path1712"
             d="m 103,230 v 14"
             style="fill:none;fill-rule:evenodd;stroke:#26a269;stroke-width:2;stroke-linecap:butt;stroke-linejoin:miter;stroke-miterlimit:4;stroke-dasharray:none;stroke-opacity:1"
             sodipodi:nodetypes="cc" />
          <path
             style="fill:none;fill-rule:evenodd;stroke:#26a269;stroke-width:2;stroke-linecap:butt;stroke-linejoin:miter;stroke-miterlimit:4;stroke-dasharray:none;stroke-opacity:1"
             d="m 107,230 v 14"
             id="path1714"
             inkscape:connector-curvature="0"
             sodipodi:nodetypes="cc" />
        </g>
        <g
           style="display:inline;fill:#8ff0a4;enable-background:new"
           id="g1730"
           transform="translate(-4.8522949e-8,12)">
          <path
             style="font-style:normal;font-variant:normal;font-weight:800;font-stretch:normal;font-size:medium;line-height:1000%;font-family:Cantarell;-inkscape-font-specification:'Cantarell Ultra-Bold';letter-spacing:2px;word-spacing:0px;fill:#8ff0a4;fill-opacity:1;stroke:none;stroke-width:0.740771px;stroke-linecap:butt;stroke-linejoin:miter;stroke-opacity:1"
             d="m 22.21582,254 1.197265,5.06836 -3.90039,-3.2793 -1.453125,2.5918 5.009765,1.6582 -5.042968,1.58985 1.433593,2.64062 3.955078,-3.30469 L 22.21582,266 h 3.410156 l -1.101562,-4.95898 3.833984,3.31445 1.476562,-2.61914 -4.978515,-1.68555 5.117187,-1.42578 -1.453125,-2.61914 -4.033203,3.08398 L 25.624023,254 Z"
             id="path1718"
             inkscape:connector-curvature="0"
             sodipodi:nodetypes="ccccccccccccccccccc" />
          <path
             sodipodi:nodetypes="ccccccccccccccccccc"
             inkscape:connector-curvature="0"
             id="path1720"
             d="m 38.21582,254 1.197265,5.06836 -3.90039,-3.2793 -1.453125,2.5918 5.009765,1.6582 -5.042968,1.58985 1.433593,2.64062 3.955078,-3.30469 L 38.21582,266 h 3.410156 l -1.101562,-4.95898 3.833984,3.31445 1.476562,-2.61914 -4.978515,-1.68555 5.117187,-1.42578 -1.453125,-2.61914 -4.033203,3.08398 L 41.624023,254 Z"
             style="font-style:normal;font-variant:normal;font-weight:800;font-stretch:normal;font-size:medium;line-height:1000%;font-family:Cantarell;-inkscape-font-specification:'Cantarell Ultra-Bold';letter-spacing:2px;word-spacing:0px;fill:#8ff0a4;fill-opacity:1;stroke:none;stroke-width:0.740771px;stroke-linecap:butt;stroke-linejoin:miter;stroke-opacity:1" />
          <path
             style="font-style:normal;font-variant:normal;font-weight:800;font-stretch:normal;font-size:medium;line-height:1000%;font-family:Cantarell;-inkscape-font-specification:'Cantarell Ultra-Bold';letter-spacing:2px;word-spacing:0px;fill:#8ff0a4;fill-opacity:1;stroke:none;stroke-width:0.740771px;stroke-linecap:butt;stroke-linejoin:miter;stroke-opacity:1"
             d="m 54.21582,254 1.197265,5.06836 -3.90039,-3.2793 -1.453125,2.5918 5.009765,1.6582 -5.042968,1.58985 1.433593,2.64062 3.955078,-3.30469 L 54.21582,266 h 3.410156 l -1.101562,-4.95898 3.833984,3.31445 1.476562,-2.61914 -4.978515,-1.68555 5.117187,-1.42578 -1.453125,-2.61914 -4.033203,3.08398 L 57.624023,254 Z"
             id="path1722"
             inkscape:connector-curvature="0"
             sodipodi:nodetypes="ccccccccccccccccccc" />
          <path
             sodipodi:nodetypes="ccccccccccccccccccc"
             inkscape:connector-curvature="0"
             id="path1724"
             d="m 70.21582,254 1.197265,5.06836 -3.90039,-3.2793 -1.453125,2.5918 5.009765,1.6582 -5.042968,1.58985 1.433593,2.64062 3.955078,-3.30469 L 70.21582,266 h 3.410156 l -1.101562,-4.95898 3.833984,3.31445 1.476562,-2.61914 -4.978515,-1.68555 5.117187,-1.42578 -1.453125,-2.61914 -4.033203,3.08398 L 73.624023,254 Z"
             style="font-style:normal;font-variant:normal;font-weight:800;font-stretch:normal;font-size:medium;line-height:1000%;font-family:Cantarell;-inkscape-font-specification:'Cantarell Ultra-Bold';letter-spacing:2px;word-spacing:0px;fill:#8ff0a4;fill-opacity:1;stroke:none;stroke-width:0.740771px;stroke-linecap:butt;stroke-linejoin:miter;stroke-opacity:1" />
          <path
             style="font-style:normal;font-variant:normal;font-weight:800;font-stretch:normal;font-size:medium;line-height:1000%;font-family:Cantarell;-inkscape-font-specification:'Cantarell Ultra-Bold';letter-spacing:2px;word-spacing:0px;fill:#8ff0a4;fill-opacity:1;stroke:none;stroke-width:0.740771px;stroke-linecap:butt;stroke-linejoin:miter;stroke-opacity:1"
             d="m 86.21582,254 1.197265,5.06836 -3.90039,-3.2793 -1.453125,2.5918 5.009765,1.6582 -5.042968,1.58985 1.433593,2.64062 3.955078,-3.30469 L 86.21582,266 h 3.410156 l -1.101562,-4.95898 3.833984,3.31445 1.476562,-2.61914 -4.978515,-1.68555 5.117187,-1.42578 -1.453125,-2.61914 -4.033203,3.08398 L 89.624023,254 Z"
             id="path1726"
             inkscape:connector-curvature="0"
             sodipodi:nodetypes="ccccccccccccccccccc" />
          <path
             sodipodi:nodetypes="ccccccccccccccccccc"
             inkscape:connector-curvature="0"
             id="path1728"
             d="m 102.21582,254 1.19726,5.06836 -3.900385,-3.2793 -1.453125,2.5918 5.00976,1.6582 -5.042963,1.58985 1.433593,2.64062 3.95508,-3.30469 L 102.21582,266 h 3.41016 l -1.10157,-4.95898 3.83399,3.31445 1.47656,-2.61914 -4.97851,-1.68555 5.11718,-1.42578 -1.45312,-2.61914 -4.03321,3.08398 L 105.62402,254 Z"
             style="font-style:normal;font-variant:normal;font-weight:800;font-stretch:normal;font-size:medium;line-height:1000%;font-family:Cantarell;-inkscape-font-specification:'Cantarell Ultra-Bold';letter-spacing:2px;word-spacing:0px;fill:#8ff0a4;fill-opacity:1;stroke:none;stroke-width:0.740771px;stroke-linecap:butt;stroke-linejoin:miter;stroke-opacity:1" />
        </g>
        <rect
           ry="8"
           rx="8"
           y="208"
           x="8"
           height="24"
           width="112"
           id="rect1732"
           style="display:inline;opacity:1;fill:#2ec27e;fill-opacity:1;stroke:none;stroke-width:0.25;stroke-linecap:butt;stroke-linejoin:miter;stroke-miterlimit:4;stroke-dasharray:none;stroke-dashoffset:0;stroke-opacity:1;marker:none;marker-start:none;marker-mid:none;marker-end:none;paint-order:normal;enable-background:new" />
        <rect
           y="220"
           x="8"
           height="16"
           width="112"
           id="rect1734"
           style="display:inline;opacity:1;fill:#241f31;fill-opacity:1;stroke:none;stroke-width:0.25;stroke-linecap:butt;stroke-linejoin:miter;stroke-miterlimit:4;stroke-dasharray:none;stroke-dashoffset:0;stroke-opacity:1;marker:none;marker-start:none;marker-mid:none;marker-end:none;paint-order:normal;enable-background:new" />
        <path
           sodipodi:nodetypes="cccc"
           inkscape:connector-curvature="0"
           id="path1736"
           d="m 22,244 -6,5 6,5 z"
           style="display:inline;fill:#26a269;fill-opacity:1;fill-rule:evenodd;stroke:none;stroke-width:1px;stroke-linecap:butt;stroke-linejoin:miter;stroke-opacity:1;enable-background:new" />
        <g
           transform="translate(-42,12)"
           id="g1756"
           style="display:inline;enable-background:new">
          <g
             style="fill:#77767b;fill-opacity:1"
             id="g1748"
             transform="rotate(180,130,225.5)">
            <path
               transform="rotate(180,107,137.5)"
               style="display:inline;opacity:1;vector-effect:none;fill:url(#linearGradient1799);fill-opacity:1;stroke:none;stroke-width:0.357143;stroke-linecap:butt;stroke-linejoin:miter;stroke-miterlimit:4;stroke-dasharray:none;stroke-dashoffset:0;stroke-opacity:1;marker:none;marker-start:none;marker-mid:none;marker-end:none;paint-order:normal;enable-background:new"
               d="M 41,10 C 29.40203,10 20,19.40203 20,31 20,42.59797 29.40203,52 41,52 52.59797,52 62,42.59797 62,31 62,19.40203 52.59797,10 41,10 Z m 0,10 c 2.761424,0 5,2.238576 5,5 0,2.761424 -2.238576,5 -5,5 -2.761424,0 -5,-2.238576 -5,-5 0,-2.761424 2.238576,-5 5,-5 z"
               id="path1738"
               inkscape:connector-curvature="0"
               sodipodi:nodetypes="ssssssssss" />
            <path
               style="display:inline;opacity:1;vector-effect:none;fill:#77767b;fill-opacity:1;stroke:none;stroke-width:0.5;stroke-linecap:butt;stroke-linejoin:miter;stroke-miterlimit:4;stroke-dasharray:none;stroke-dashoffset:0;stroke-opacity:1;marker:none;marker-start:none;marker-mid:none;marker-end:none;paint-order:normal;enable-background:new"
               d="m 182,227 v -39 l -3,-3 h -5 l -8,8 v 2 h 2 l -2,2 v 2 l 4,2 -4,4 v 2 h 2 l -2,2 v 2 l 3,1 -3,3 v 4 h -4 v 0 4 4 z"
               id="path1740"
               inkscape:connector-curvature="0"
               sodipodi:nodetypes="ccccccccccccccccccccccc" />
            <path
               sodipodi:nodetypes="cccccc"
               inkscape:connector-curvature="0"
               style="display:inline;opacity:1;vector-effect:none;fill:#77767b;fill-opacity:1;stroke:none;stroke-width:0.5;stroke-linecap:butt;stroke-linejoin:miter;stroke-miterlimit:4;stroke-dasharray:none;stroke-dashoffset:0;stroke-opacity:1;marker:none;marker-start:none;marker-mid:none;marker-end:none;paint-order:normal;enable-background:new"
               d="m 177.41305,220.94068 c -1.26987,1.26705 -3.43692,0.35049 -3.41261,-1.44322 L 174,187 l 4.00001,-1e-5 v 32.49747 c 0.007,0.54063 -0.20428,1.06125 -0.58696,1.44322 z"
               id="path1742" />
            <path
               sodipodi:nodetypes="ccccccccccccccccccccccc"
               inkscape:connector-curvature="0"
               id="path1744"
               d="m 182,227 v -39 l -3,-3 h -5 l -8,8 v 2 h 2 l -2,2 v 2 l 4,2 -4,4 v 2 h 2 l -2,2 v 2 l 3,1 -3,3 v 4 h -4 v 0 4 4 z"
               style="display:inline;opacity:1;vector-effect:none;fill:#77767b;fill-opacity:1;stroke:none;stroke-width:0.5;stroke-linecap:butt;stroke-linejoin:miter;stroke-miterlimit:4;stroke-dasharray:none;stroke-dashoffset:0;stroke-opacity:1;marker:none;marker-start:none;marker-mid:none;marker-end:none;paint-order:normal;enable-background:new" />
            <path
               sodipodi:nodetypes="ssssssssss"
               inkscape:connector-curvature="0"
               id="path1746"
               d="M 41,10 C 29.40203,10 20,19.40203 20,31 20,42.59797 29.40203,52 41,52 52.59797,52 62,42.59797 62,31 62,19.40203 52.59797,10 41,10 Z m 0,10 c 2.761424,0 5,2.238576 5,5 0,2.761424 -2.238576,5 -5,5 -2.761424,0 -5,-2.238576 -5,-5 0,-2.761424 2.238576,-5 5,-5 z"
               style="display:inline;opacity:1;vector-effect:none;fill:url(#linearGradient1801);fill-opacity:1;stroke:none;stroke-width:0.357143;stroke-linecap:butt;stroke-linejoin:miter;stroke-miterlimit:4;stroke-dasharray:none;stroke-dashoffset:0;stroke-opacity:1;marker:none;marker-start:none;marker-mid:none;marker-end:none;paint-order:normal;enable-background:new"
               transform="rotate(180,107,137.5)" />
          </g>
          <path
             style="display:inline;opacity:1;vector-effect:none;fill:url(#linearGradient1803);fill-opacity:1;stroke:none;stroke-width:0.5;stroke-linecap:butt;stroke-linejoin:miter;stroke-miterlimit:4;stroke-dasharray:none;stroke-dashoffset:0;stroke-opacity:1;marker:none;marker-start:none;marker-mid:none;marker-end:none;paint-order:normal;enable-background:new"
             d="m 78,222 v 39 l 3,3 h 5 l 8,-8 -2,-2 2,-2 -4,-4 4,-4 -2,-2 2,-2 -3,-3 3,-3 v -4 h 4 v -2 -2 -4 z"
             id="path1750"
             inkscape:connector-curvature="0"
             sodipodi:nodetypes="ccccccccccccccccccc" />
          <path
             sodipodi:nodetypes="cccccc"
             inkscape:connector-curvature="0"
             style="display:inline;opacity:1;vector-effect:none;fill:url(#linearGradient1805);fill-opacity:1;stroke:none;stroke-width:0.5;stroke-linecap:butt;stroke-linejoin:miter;stroke-miterlimit:4;stroke-dasharray:none;stroke-dashoffset:0;stroke-opacity:1;marker:none;marker-start:none;marker-mid:none;marker-end:none;paint-order:normal;enable-background:new"
             d="m 82.58695,228.05932 c 1.26987,-1.26705 3.43692,-0.35049 3.41261,1.44322 L 86,264 l -4.00001,10e-6 v -34.49747 c -0.007,-0.54063 0.20428,-1.06125 0.58696,-1.44322 z"
             id="path1752" />
          <path
             style="display:inline;opacity:1;vector-effect:none;fill:#f6f5f4;fill-opacity:1;stroke:none;stroke-width:0.357143;stroke-linecap:butt;stroke-linejoin:miter;stroke-miterlimit:4;stroke-dasharray:none;stroke-dashoffset:0;stroke-opacity:1;marker:none;marker-start:none;marker-mid:none;marker-end:none;paint-order:normal;enable-background:new"
             d="m 87,184 c -11.59797,0 -21,9.40203 -21,21 0,11.59797 9.40203,21 21,21 11.59797,0 21,-9.40203 21,-21 0,-11.59797 -9.40203,-21 -21,-21 z m 0,10 c 2.76142,0 5,2.23858 5,5 0,2.76142 -2.23858,5 -5,5 -2.76142,0 -5,-2.23858 -5,-5 0,-2.76142 2.23858,-5 5,-5 z"
             id="path1754"
             inkscape:connector-curvature="0"
             sodipodi:nodetypes="ssssssssss" />
        </g>
      </g>
      <g
         transform="translate(-210)"
         id="g1924">
        <rect
           style="display:inline;opacity:1;fill:#2ec27e;fill-opacity:1;stroke:none;stroke-width:0.25;stroke-linecap:butt;stroke-linejoin:miter;stroke-miterlimit:4;stroke-dasharray:none;stroke-dashoffset:0;stroke-opacity:1;marker:none;marker-start:none;marker-mid:none;marker-end:none;paint-order:normal;enable-background:new"
           id="rect1807"
           width="112"
           height="63.999977"
           x="8"
           y="224"
           rx="8"
           ry="8" />
        <g
           style="display:inline;opacity:1;stroke:#26a269;stroke-width:0.935414;enable-background:new"
           id="g1843"
           transform="matrix(1,0,0,1.1428571,-4.8522949e-8,-22.857143)">
          <path
             style="fill:none;fill-rule:evenodd;stroke:#26a269;stroke-width:1.87083;stroke-linecap:butt;stroke-linejoin:miter;stroke-miterlimit:4;stroke-dasharray:none;stroke-opacity:1"
             d="m 27,230 v 14"
             id="path1809"
             inkscape:connector-curvature="0"
             sodipodi:nodetypes="cc" />
          <path
             inkscape:connector-curvature="0"
             id="path1811"
             d="m 32,230 v 14"
             style="fill:none;fill-rule:evenodd;stroke:#26a269;stroke-width:3.74166;stroke-linecap:butt;stroke-linejoin:miter;stroke-miterlimit:4;stroke-dasharray:none;stroke-opacity:1"
             sodipodi:nodetypes="cc" />
          <path
             inkscape:connector-curvature="0"
             id="path1813"
             d="m 37,230 v 14"
             style="fill:none;fill-rule:evenodd;stroke:#26a269;stroke-width:1.87083;stroke-linecap:butt;stroke-linejoin:miter;stroke-miterlimit:4;stroke-dasharray:none;stroke-opacity:1"
             sodipodi:nodetypes="cc" />
          <path
             style="fill:none;fill-rule:evenodd;stroke:#26a269;stroke-width:1.87083;stroke-linecap:butt;stroke-linejoin:miter;stroke-miterlimit:4;stroke-dasharray:none;stroke-opacity:1"
             d="m 41,230 v 14"
             id="path1815"
             inkscape:connector-curvature="0"
             sodipodi:nodetypes="cc" />
          <path
             style="fill:none;fill-rule:evenodd;stroke:#26a269;stroke-width:3.74166;stroke-linecap:butt;stroke-linejoin:miter;stroke-miterlimit:4;stroke-dasharray:none;stroke-opacity:1"
             d="m 46,230 v 14"
             id="path1817"
             inkscape:connector-curvature="0"
             sodipodi:nodetypes="cc" />
          <path
             inkscape:connector-curvature="0"
             id="path1819"
             d="m 56,230 v 14"
             style="fill:none;fill-rule:evenodd;stroke:#26a269;stroke-width:3.74166;stroke-linecap:butt;stroke-linejoin:miter;stroke-miterlimit:4;stroke-dasharray:none;stroke-opacity:1"
             sodipodi:nodetypes="cc" />
          <path
             style="fill:none;fill-rule:evenodd;stroke:#26a269;stroke-width:1.87083;stroke-linecap:butt;stroke-linejoin:miter;stroke-miterlimit:4;stroke-dasharray:none;stroke-opacity:1"
             d="m 51,230 v 14"
             id="path1821"
             inkscape:connector-curvature="0"
             sodipodi:nodetypes="cc" />
          <path
             inkscape:connector-curvature="0"
             id="path1823"
             d="m 63,230 v 14"
             style="fill:none;fill-rule:evenodd;stroke:#26a269;stroke-width:5.61249;stroke-linecap:butt;stroke-linejoin:miter;stroke-miterlimit:4;stroke-dasharray:none;stroke-opacity:1"
             sodipodi:nodetypes="cc" />
          <path
             inkscape:connector-curvature="0"
             id="path1825"
             d="m 69,230 v 14"
             style="fill:none;fill-rule:evenodd;stroke:#26a269;stroke-width:1.87083;stroke-linecap:butt;stroke-linejoin:miter;stroke-miterlimit:4;stroke-dasharray:none;stroke-opacity:1"
             sodipodi:nodetypes="cc" />
          <path
             inkscape:connector-curvature="0"
             id="path1827"
             d="m 73,230 v 14"
             style="fill:none;fill-rule:evenodd;stroke:#26a269;stroke-width:1.87083;stroke-linecap:butt;stroke-linejoin:miter;stroke-miterlimit:4;stroke-dasharray:none;stroke-opacity:1"
             sodipodi:nodetypes="cc" />
          <path
             style="fill:none;fill-rule:evenodd;stroke:#26a269;stroke-width:1.87083;stroke-linecap:butt;stroke-linejoin:miter;stroke-miterlimit:4;stroke-dasharray:none;stroke-opacity:1"
             d="m 77,230 v 14"
             id="path1829"
             inkscape:connector-curvature="0"
             sodipodi:nodetypes="cc" />
          <path
             style="fill:none;fill-rule:evenodd;stroke:#26a269;stroke-width:3.74166;stroke-linecap:butt;stroke-linejoin:miter;stroke-miterlimit:4;stroke-dasharray:none;stroke-opacity:1"
             d="m 82,230 v 14"
             id="path1831"
             inkscape:connector-curvature="0"
             sodipodi:nodetypes="cc" />
          <path
             inkscape:connector-curvature="0"
             id="path1833"
             d="m 87,230 v 14"
             style="fill:none;fill-rule:evenodd;stroke:#26a269;stroke-width:1.87083;stroke-linecap:butt;stroke-linejoin:miter;stroke-miterlimit:4;stroke-dasharray:none;stroke-opacity:1"
             sodipodi:nodetypes="cc" />
          <path
             style="fill:none;fill-rule:evenodd;stroke:#26a269;stroke-width:1.87083;stroke-linecap:butt;stroke-linejoin:miter;stroke-miterlimit:4;stroke-dasharray:none;stroke-opacity:1"
             d="m 99,230 v 14"
             id="path1835"
             inkscape:connector-curvature="0"
             sodipodi:nodetypes="cc" />
          <path
             style="fill:none;fill-rule:evenodd;stroke:#26a269;stroke-width:5.61249;stroke-linecap:butt;stroke-linejoin:miter;stroke-miterlimit:4;stroke-dasharray:none;stroke-opacity:1"
             d="m 93,230 v 14"
             id="path1837"
             inkscape:connector-curvature="0"
             sodipodi:nodetypes="cc" />
          <path
             inkscape:connector-curvature="0"
             id="path1839"
             d="m 103,230 v 14"
             style="fill:none;fill-rule:evenodd;stroke:#26a269;stroke-width:1.87083;stroke-linecap:butt;stroke-linejoin:miter;stroke-miterlimit:4;stroke-dasharray:none;stroke-opacity:1"
             sodipodi:nodetypes="cc" />
          <path
             style="fill:none;fill-rule:evenodd;stroke:#26a269;stroke-width:1.87083;stroke-linecap:butt;stroke-linejoin:miter;stroke-miterlimit:4;stroke-dasharray:none;stroke-opacity:1"
             d="m 107,230 v 14"
             id="path1841"
             inkscape:connector-curvature="0"
             sodipodi:nodetypes="cc" />
        </g>
        <g
           style="display:inline;fill:#8ff0a4;enable-background:new"
           id="g1857"
           transform="translate(-4.8522949e-8,12)">
          <path
             style="font-style:normal;font-variant:normal;font-weight:800;font-stretch:normal;font-size:medium;line-height:1000%;font-family:Cantarell;-inkscape-font-specification:'Cantarell Ultra-Bold';letter-spacing:2px;word-spacing:0px;fill:#8ff0a4;fill-opacity:1;stroke:none;stroke-width:0.740771px;stroke-linecap:butt;stroke-linejoin:miter;stroke-opacity:1"
             d="m 22.21582,254 1.197265,5.06836 -3.90039,-3.2793 -1.453125,2.5918 5.009765,1.6582 -5.042968,1.58985 1.433593,2.64062 3.955078,-3.30469 L 22.21582,266 h 3.410156 l -1.101562,-4.95898 3.833984,3.31445 1.476562,-2.61914 -4.978515,-1.68555 5.117187,-1.42578 -1.453125,-2.61914 -4.033203,3.08398 L 25.624023,254 Z"
             id="path1845"
             inkscape:connector-curvature="0"
             sodipodi:nodetypes="ccccccccccccccccccc" />
          <path
             sodipodi:nodetypes="ccccccccccccccccccc"
             inkscape:connector-curvature="0"
             id="path1847"
             d="m 38.21582,254 1.197265,5.06836 -3.90039,-3.2793 -1.453125,2.5918 5.009765,1.6582 -5.042968,1.58985 1.433593,2.64062 3.955078,-3.30469 L 38.21582,266 h 3.410156 l -1.101562,-4.95898 3.833984,3.31445 1.476562,-2.61914 -4.978515,-1.68555 5.117187,-1.42578 -1.453125,-2.61914 -4.033203,3.08398 L 41.624023,254 Z"
             style="font-style:normal;font-variant:normal;font-weight:800;font-stretch:normal;font-size:medium;line-height:1000%;font-family:Cantarell;-inkscape-font-specification:'Cantarell Ultra-Bold';letter-spacing:2px;word-spacing:0px;fill:#8ff0a4;fill-opacity:1;stroke:none;stroke-width:0.740771px;stroke-linecap:butt;stroke-linejoin:miter;stroke-opacity:1" />
          <path
             style="font-style:normal;font-variant:normal;font-weight:800;font-stretch:normal;font-size:medium;line-height:1000%;font-family:Cantarell;-inkscape-font-specification:'Cantarell Ultra-Bold';letter-spacing:2px;word-spacing:0px;fill:#8ff0a4;fill-opacity:1;stroke:none;stroke-width:0.740771px;stroke-linecap:butt;stroke-linejoin:miter;stroke-opacity:1"
             d="m 54.21582,254 1.197265,5.06836 -3.90039,-3.2793 -1.453125,2.5918 5.009765,1.6582 -5.042968,1.58985 1.433593,2.64062 3.955078,-3.30469 L 54.21582,266 h 3.410156 l -1.101562,-4.95898 3.833984,3.31445 1.476562,-2.61914 -4.978515,-1.68555 5.117187,-1.42578 -1.453125,-2.61914 -4.033203,3.08398 L 57.624023,254 Z"
             id="path1849"
             inkscape:connector-curvature="0"
             sodipodi:nodetypes="ccccccccccccccccccc" />
          <path
             sodipodi:nodetypes="ccccccccccccccccccc"
             inkscape:connector-curvature="0"
             id="path1851"
             d="m 70.21582,254 1.197265,5.06836 -3.90039,-3.2793 -1.453125,2.5918 5.009765,1.6582 -5.042968,1.58985 1.433593,2.64062 3.955078,-3.30469 L 70.21582,266 h 3.410156 l -1.101562,-4.95898 3.833984,3.31445 1.476562,-2.61914 -4.978515,-1.68555 5.117187,-1.42578 -1.453125,-2.61914 -4.033203,3.08398 L 73.624023,254 Z"
             style="font-style:normal;font-variant:normal;font-weight:800;font-stretch:normal;font-size:medium;line-height:1000%;font-family:Cantarell;-inkscape-font-specification:'Cantarell Ultra-Bold';letter-spacing:2px;word-spacing:0px;fill:#8ff0a4;fill-opacity:1;stroke:none;stroke-width:0.740771px;stroke-linecap:butt;stroke-linejoin:miter;stroke-opacity:1" />
          <path
             style="font-style:normal;font-variant:normal;font-weight:800;font-stretch:normal;font-size:medium;line-height:1000%;font-family:Cantarell;-inkscape-font-specification:'Cantarell Ultra-Bold';letter-spacing:2px;word-spacing:0px;fill:#8ff0a4;fill-opacity:1;stroke:none;stroke-width:0.740771px;stroke-linecap:butt;stroke-linejoin:miter;stroke-opacity:1"
             d="m 86.21582,254 1.197265,5.06836 -3.90039,-3.2793 -1.453125,2.5918 5.009765,1.6582 -5.042968,1.58985 1.433593,2.64062 3.955078,-3.30469 L 86.21582,266 h 3.410156 l -1.101562,-4.95898 3.833984,3.31445 1.476562,-2.61914 -4.978515,-1.68555 5.117187,-1.42578 -1.453125,-2.61914 -4.033203,3.08398 L 89.624023,254 Z"
             id="path1853"
             inkscape:connector-curvature="0"
             sodipodi:nodetypes="ccccccccccccccccccc" />
          <path
             sodipodi:nodetypes="ccccccccccccccccccc"
             inkscape:connector-curvature="0"
             id="path1855"
             d="m 102.21582,254 1.19726,5.06836 -3.900385,-3.2793 -1.453125,2.5918 5.00976,1.6582 -5.042963,1.58985 1.433593,2.64062 3.95508,-3.30469 L 102.21582,266 h 3.41016 l -1.10157,-4.95898 3.83399,3.31445 1.47656,-2.61914 -4.97851,-1.68555 5.11718,-1.42578 -1.45312,-2.61914 -4.03321,3.08398 L 105.62402,254 Z"
             style="font-style:normal;font-variant:normal;font-weight:800;font-stretch:normal;font-size:medium;line-height:1000%;font-family:Cantarell;-inkscape-font-specification:'Cantarell Ultra-Bold';letter-spacing:2px;word-spacing:0px;fill:#8ff0a4;fill-opacity:1;stroke:none;stroke-width:0.740771px;stroke-linecap:butt;stroke-linejoin:miter;stroke-opacity:1" />
        </g>
        <rect
           ry="7.9999995"
           rx="8"
           y="200"
           x="8"
           height="40"
           width="112"
           id="rect1859"
           style="display:inline;opacity:1;fill:#2ec27e;fill-opacity:1;stroke:none;stroke-width:0.270031;stroke-linecap:butt;stroke-linejoin:miter;stroke-miterlimit:4;stroke-dasharray:none;stroke-dashoffset:0;stroke-opacity:1;marker:none;marker-start:none;marker-mid:none;marker-end:none;paint-order:normal;enable-background:new" />
        <rect
           y="214"
           x="8"
           height="18"
           width="112"
           id="rect1861"
           style="display:inline;opacity:1;fill:#241f31;fill-opacity:1;stroke:none;stroke-width:0.25;stroke-linecap:butt;stroke-linejoin:miter;stroke-miterlimit:4;stroke-dasharray:none;stroke-dashoffset:0;stroke-opacity:1;marker:none;marker-start:none;marker-mid:none;marker-end:none;paint-order:normal;enable-background:new" />
        <path
           sodipodi:nodetypes="cccc"
           inkscape:connector-curvature="0"
           id="path1863"
           d="m 22,242 -7.2,6 7.2,6 z"
           style="display:inline;fill:#26a269;fill-opacity:1;fill-rule:evenodd;stroke:none;stroke-width:1px;stroke-linecap:butt;stroke-linejoin:miter;stroke-opacity:1;enable-background:new" />
        <g
           transform="translate(-42,12)"
           id="g1883"
           style="display:inline;enable-background:new">
          <g
             style="fill:#77767b;fill-opacity:1"
             id="g1875"
             transform="rotate(180,130,225.5)">
            <path
               transform="rotate(180,107,137.5)"
               style="display:inline;opacity:1;vector-effect:none;fill:url(#linearGradient1926);fill-opacity:1;stroke:none;stroke-width:0.357143;stroke-linecap:butt;stroke-linejoin:miter;stroke-miterlimit:4;stroke-dasharray:none;stroke-dashoffset:0;stroke-opacity:1;marker:none;marker-start:none;marker-mid:none;marker-end:none;paint-order:normal;enable-background:new"
               d="M 41,10 C 29.40203,10 20,19.40203 20,31 20,42.59797 29.40203,52 41,52 52.59797,52 62,42.59797 62,31 62,19.40203 52.59797,10 41,10 Z m 0,10 c 2.761424,0 5,2.238576 5,5 0,2.761424 -2.238576,5 -5,5 -2.761424,0 -5,-2.238576 -5,-5 0,-2.761424 2.238576,-5 5,-5 z"
               id="path1865"
               inkscape:connector-curvature="0"
               sodipodi:nodetypes="ssssssssss" />
            <path
               style="display:inline;opacity:1;vector-effect:none;fill:#77767b;fill-opacity:1;stroke:none;stroke-width:0.5;stroke-linecap:butt;stroke-linejoin:miter;stroke-miterlimit:4;stroke-dasharray:none;stroke-dashoffset:0;stroke-opacity:1;marker:none;marker-start:none;marker-mid:none;marker-end:none;paint-order:normal;enable-background:new"
               d="m 182,227 v -39 l -3,-3 h -5 l -8,8 v 2 h 2 l -2,2 v 2 l 4,2 -4,4 v 2 h 2 l -2,2 v 2 l 3,1 -3,3 v 4 h -4 v 0 4 4 z"
               id="path1867"
               inkscape:connector-curvature="0"
               sodipodi:nodetypes="ccccccccccccccccccccccc" />
            <path
               sodipodi:nodetypes="cccccc"
               inkscape:connector-curvature="0"
               style="display:inline;opacity:1;vector-effect:none;fill:#77767b;fill-opacity:1;stroke:none;stroke-width:0.5;stroke-linecap:butt;stroke-linejoin:miter;stroke-miterlimit:4;stroke-dasharray:none;stroke-dashoffset:0;stroke-opacity:1;marker:none;marker-start:none;marker-mid:none;marker-end:none;paint-order:normal;enable-background:new"
               d="m 177.41305,220.94068 c -1.26987,1.26705 -3.43692,0.35049 -3.41261,-1.44322 L 174,187 l 4.00001,-1e-5 v 32.49747 c 0.007,0.54063 -0.20428,1.06125 -0.58696,1.44322 z"
               id="path1869" />
            <path
               sodipodi:nodetypes="ccccccccccccccccccccccc"
               inkscape:connector-curvature="0"
               id="path1871"
               d="m 182,227 v -39 l -3,-3 h -5 l -8,8 v 2 h 2 l -2,2 v 2 l 4,2 -4,4 v 2 h 2 l -2,2 v 2 l 3,1 -3,3 v 4 h -4 v 0 4 4 z"
               style="display:inline;opacity:1;vector-effect:none;fill:#77767b;fill-opacity:1;stroke:none;stroke-width:0.5;stroke-linecap:butt;stroke-linejoin:miter;stroke-miterlimit:4;stroke-dasharray:none;stroke-dashoffset:0;stroke-opacity:1;marker:none;marker-start:none;marker-mid:none;marker-end:none;paint-order:normal;enable-background:new" />
            <path
               sodipodi:nodetypes="ssssssssss"
               inkscape:connector-curvature="0"
               id="path1873"
               d="M 41,10 C 29.40203,10 20,19.40203 20,31 20,42.59797 29.40203,52 41,52 52.59797,52 62,42.59797 62,31 62,19.40203 52.59797,10 41,10 Z m 0,10 c 2.761424,0 5,2.238576 5,5 0,2.761424 -2.238576,5 -5,5 -2.761424,0 -5,-2.238576 -5,-5 0,-2.761424 2.238576,-5 5,-5 z"
               style="display:inline;opacity:1;vector-effect:none;fill:url(#linearGradient1928);fill-opacity:1;stroke:none;stroke-width:0.357143;stroke-linecap:butt;stroke-linejoin:miter;stroke-miterlimit:4;stroke-dasharray:none;stroke-dashoffset:0;stroke-opacity:1;marker:none;marker-start:none;marker-mid:none;marker-end:none;paint-order:normal;enable-background:new"
               transform="rotate(180,107,137.5)" />
          </g>
          <path
             style="display:inline;opacity:1;vector-effect:none;fill:url(#linearGradient1930);fill-opacity:1;stroke:none;stroke-width:0.5;stroke-linecap:butt;stroke-linejoin:miter;stroke-miterlimit:4;stroke-dasharray:none;stroke-dashoffset:0;stroke-opacity:1;marker:none;marker-start:none;marker-mid:none;marker-end:none;paint-order:normal;enable-background:new"
             d="m 78,222 v 39 l 3,3 h 5 l 8,-8 -2,-2 2,-2 -4,-4 4,-4 -2,-2 2,-2 -3,-3 3,-3 v -4 h 4 v -2 -2 -4 z"
             id="path1877"
             inkscape:connector-curvature="0"
             sodipodi:nodetypes="ccccccccccccccccccc" />
          <path
             sodipodi:nodetypes="cccccc"
             inkscape:connector-curvature="0"
             style="display:inline;opacity:1;vector-effect:none;fill:url(#linearGradient1933);fill-opacity:1;stroke:none;stroke-width:0.5;stroke-linecap:butt;stroke-linejoin:miter;stroke-miterlimit:4;stroke-dasharray:none;stroke-dashoffset:0;stroke-opacity:1;marker:none;marker-start:none;marker-mid:none;marker-end:none;paint-order:normal;enable-background:new"
             d="m 82.58695,228.05932 c 1.26987,-1.26705 3.43692,-0.35049 3.41261,1.44322 L 86,264 l -4.00001,10e-6 v -34.49747 c -0.007,-0.54063 0.20428,-1.06125 0.58696,-1.44322 z"
             id="path1879" />
          <path
             style="display:inline;opacity:1;vector-effect:none;fill:#f6f5f4;fill-opacity:1;stroke:none;stroke-width:0.357143;stroke-linecap:butt;stroke-linejoin:miter;stroke-miterlimit:4;stroke-dasharray:none;stroke-dashoffset:0;stroke-opacity:1;marker:none;marker-start:none;marker-mid:none;marker-end:none;paint-order:normal;enable-background:new"
             d="m 87,184 c -11.59797,0 -21,9.40203 -21,21 0,11.59797 9.40203,21 21,21 11.59797,0 21,-9.40203 21,-21 0,-11.59797 -9.40203,-21 -21,-21 z m 0,10 c 2.76142,0 5,2.23858 5,5 0,2.76142 -2.23858,5 -5,5 -2.76142,0 -5,-2.23858 -5,-5 0,-2.76142 2.23858,-5 5,-5 z"
             id="path1881"
             inkscape:connector-curvature="0"
             sodipodi:nodetypes="ssssssssss" />
        </g>
      </g>
      <g
         id="layer9-3"
         inkscape:label="apps"
         style="display:inline"
         transform="translate(-223.0002,357)">
        <path
           inkscape:connector-curvature="0"
           d="m 391.28145,-185 c -1.09519,0 -2.19484,0.40659 -3.03125,1.1875 -0.8364,0.78091 -1.25,1.78826 -1.25,2.8125 0,1.02424 0.4136,2.03159 1.25,2.8125 1.23924,1.15701 3.05794,1.43224 4.59375,0.875 l 4.4375,4.3125 h 1.28125 l 0.4375,-0.40625 V -175.25 l -0.75,-0.75 h -0.75 l -0.75,-1.5 h -0.75 v -1.5 l -0.75,-0.5625 c 0.59684,-1.4339 0.30173,-3.09298 -0.9375,-4.25 -0.83641,-0.78091 -1.93606,-1.1875 -3.03125,-1.1875 z m -0.78125,1 c 0.82843,0 1.5,0.67157 1.5,1.5 0,0.82843 -0.67157,1.5 -1.5,1.5 -0.82843,0 -1.5,-0.67157 -1.5,-1.5 0,-0.82843 0.67157,-1.5 1.5,-1.5 z"
           id="path234"
           style="color:#000000;display:inline;overflow:visible;visibility:visible;fill:#bebebe;fill-opacity:1;fill-rule:nonzero;stroke:none;stroke-width:1;marker:none;enable-background:accumulate" />
        <path
           inkscape:connector-curvature="0"
           d="m 387.0002,-184 c -2.20914,0 -4,1.69177 -4,3.78125 0,1.54382 0.97334,2.88051 2.375,3.46875 v 0.75 h 0.625 l 1,1 -1,1 v 1 l 0.81152,1 -0.81152,0.48614 v 0.4342 l 1,1.07966 h 1 l 1,-1 v 0 -5.47656 c -0.15625,-0.0547 -0.1533,-0.0541 -0.15625,-0.0547 -1.26949,-0.61624 -2.2305,-1.75108 -2.625,-3.125 -0.68068,-0.0606 -1.21875,-0.64783 -1.21875,-1.34375 0,-0.6847 0.52256,-1.23675 1.1875,-1.3125 0.16739,-0.61864 0.43612,-1.18913 0.8125,-1.6875 z"
           id="path11032"
           sodipodi:nodetypes="csccccccccccccccccscc"
           style="color:#000000;display:inline;overflow:visible;visibility:visible;fill:#bebebe;fill-opacity:1;fill-rule:nonzero;stroke:none;stroke-width:1;marker:none;enable-background:accumulate" />
      </g>
    </g>
    <g
       id="g959-3"
       transform="rotate(-180,107.5,242)"
       style="display:inline;enable-background:new">
      <path
         style="display:inline;opacity:1;vector-effect:none;fill:url(#linearGradient1039);fill-opacity:1;stroke:none;stroke-width:0.5;stroke-linecap:butt;stroke-linejoin:miter;stroke-miterlimit:4;stroke-dasharray:none;stroke-dashoffset:0;stroke-opacity:1;marker:none;marker-start:none;marker-mid:none;marker-end:none;paint-order:normal;enable-background:new"
         d="m 170,296 a 28,28 0 0 1 -28,-28 28,28 0 0 1 28,-28 28,28 0 0 1 28,28 28,28 0 0 1 -28,28 z m 0.0312,-12 a 6.0312505,6.0000005 0 0 0 6.03125,-6 6.0312505,6.0000005 0 0 0 -6.03125,-6 6.0312505,6.0000005 0 0 0 -6.03125,6 6.0312505,6.0000005 0 0 0 6.03125,6 z"
         id="path947-0"
         inkscape:connector-curvature="0" />
      <g
         transform="matrix(0.70710678,-0.70710678,-0.70710678,-0.70710678,243.95332,484.3158)"
         id="g955-3">
        <path
           sodipodi:nodetypes="cccccccccccccccccccc"
           inkscape:connector-curvature="0"
           id="path1990"
           d="m 125.41422,214.44366 -16.97055,16.97056 8.36742,8.36743 3.65338,-3.41768 4.24264,4.24264 h 2.82843 v 2.82843 l 2.12132,2.12132 h 4.24264 v 4.24264 h 2.82843 v 2.82842 h 5.65685 v 5.65686 h 2.82843 v 2.82843 h 12.72792 l 4.94974,-4.94976 v -4.24264 z"
           style="display:inline;opacity:1;vector-effect:none;fill:#77767b;fill-opacity:1;stroke:none;stroke-width:0.5;stroke-linecap:butt;stroke-linejoin:miter;stroke-miterlimit:4;stroke-dasharray:none;stroke-dashoffset:0;stroke-opacity:1;marker:none;marker-start:none;marker-mid:none;marker-end:none;paint-order:normal;enable-background:new" />
        <path
           style="display:inline;opacity:1;vector-effect:none;fill:url(#linearGradient1986);fill-opacity:1;stroke:none;stroke-width:0.5;stroke-linecap:butt;stroke-linejoin:miter;stroke-miterlimit:4;stroke-dasharray:none;stroke-dashoffset:0;stroke-opacity:1;marker:none;marker-start:none;marker-mid:none;marker-end:none;paint-order:normal;enable-background:new"
           d="M 124,213.02944 107.02945,230 l 8.36742,8.36743 3.65338,-3.41768 4.24264,4.24264 h 2.82843 v 2.82843 l 2.12132,2.12132 h 4.24264 v 4.24264 h 2.82843 v 2.82842 h 5.65685 v 5.65686 h 2.82843 v 2.82843 h 12.72792 l 4.94974,-4.94976 v -4.24264 z"
           id="path951-1"
           inkscape:connector-curvature="0"
           sodipodi:nodetypes="cccccccccccccccccccc" />
        <path
           sodipodi:nodetypes="cccccc"
           inkscape:connector-curvature="0"
           style="display:inline;opacity:1;vector-effect:none;fill:url(#linearGradient1988);fill-opacity:1;stroke:none;stroke-width:0.5;stroke-linecap:butt;stroke-linejoin:miter;stroke-miterlimit:4;stroke-dasharray:none;stroke-dashoffset:0;stroke-opacity:1;marker:none;marker-start:none;marker-mid:none;marker-end:none;paint-order:normal;enable-background:new"
           d="m 125.74823,221.26459 c -1.79388,0.002 -2.67811,2.18243 -1.39257,3.43359 l 33.58547,33.5861 2.82844,-2.82843 -33.58579,-33.58579 c -0.37702,-0.38755 -0.89487,-0.60597 -1.43555,-0.60547 z"
           id="path953-2" />
      </g>
      <path
         inkscape:connector-curvature="0"
         id="path957-8"
         d="m 170,298 a 28,28 0 0 0 28,-28 28,28 0 0 0 -28,-28 28,28 0 0 0 -28,28 28,28 0 0 0 28,28 z m -0.0312,-12 a 6.0312505,6.0000005 0 0 1 -6.03125,-6 6.0312505,6.0000005 0 0 1 6.03125,-6 6.0312505,6.0000005 0 0 1 6.03125,6 6.0312505,6.0000005 0 0 1 -6.03125,6 z"
         style="display:inline;opacity:1;vector-effect:none;fill:#f6f5f4;fill-opacity:1;stroke:none;stroke-width:0.5;stroke-linecap:butt;stroke-linejoin:miter;stroke-miterlimit:4;stroke-dasharray:none;stroke-dashoffset:0;stroke-opacity:1;marker:none;marker-start:none;marker-mid:none;marker-end:none;paint-order:normal;enable-background:new" />
    </g>
  </g>
</svg>
