<?xml version="1.0" encoding="UTF-8"?>
<svg xmlns="http://www.w3.org/2000/svg" xmlns:xlink="http://www.w3.org/1999/xlink" width="128px" height="128px" viewBox="0 0 128 128" version="1.1">
<defs>
<filter id="alpha" filterUnits="objectBoundingBox" x="0%" y="0%" width="100%" height="100%">
  <feColorMatrix type="matrix" in="SourceGraphic" values="0 0 0 0 1 0 0 0 0 1 0 0 0 0 1 0 0 0 1 0"/>
</filter>
<mask id="mask0">
  <g filter="url(#alpha)">
<rect x="0" y="0" width="128" height="128" style="fill:rgb(0%,0%,0%);fill-opacity:0.2;stroke:none;"/>
  </g>
</mask>
<clipPath id="clip1">
  <rect x="0" y="0" width="192" height="152"/>
</clipPath>
<g id="surface30699" clip-path="url(#clip1)">
<path style=" stroke:none;fill-rule:nonzero;fill:rgb(0%,0%,0%);fill-opacity:1;" d="M 70.859375 54.628906 L 70.859375 111.6875 C 70.863281 111.980469 70.835938 112.269531 70.773438 112.554688 C 70.367188 114.976562 68.265625 116.746094 65.8125 116.734375 L 19.964844 116.734375 L 19.964844 49.578125 L 65.8125 49.578125 C 68.601562 49.574219 70.867188 51.835938 70.859375 54.628906 Z M 70.859375 54.628906 "/>
</g>
<mask id="mask1">
  <g filter="url(#alpha)">
<rect x="0" y="0" width="128" height="128" style="fill:rgb(0%,0%,0%);fill-opacity:0.1;stroke:none;"/>
  </g>
</mask>
<clipPath id="clip2">
  <rect x="0" y="0" width="192" height="152"/>
</clipPath>
<g id="surface30702" clip-path="url(#clip2)">
<path style=" stroke:none;fill-rule:nonzero;fill:rgb(0%,0%,0%);fill-opacity:1;" d="M 73.027344 54.628906 L 73.027344 107.355469 C 72.988281 111.324219 69.78125 114.53125 65.8125 114.570312 L 19.964844 114.570312 L 19.964844 47.414062 L 65.8125 47.414062 C 69.792969 47.425781 73.011719 50.648438 73.027344 54.628906 Z M 73.027344 54.628906 "/>
</g>
<mask id="mask2">
  <g filter="url(#alpha)">
<rect x="0" y="0" width="128" height="128" style="fill:rgb(0%,0%,0%);fill-opacity:0.2;stroke:none;"/>
  </g>
</mask>
<clipPath id="clip3">
  <rect x="0" y="0" width="192" height="152"/>
</clipPath>
<g id="surface30705" clip-path="url(#clip3)">
<path style=" stroke:none;fill-rule:nonzero;fill:rgb(0%,0%,0%);fill-opacity:1;" d="M 70.859375 54.628906 L 70.859375 107.355469 C 70.867188 110.144531 68.601562 112.40625 65.8125 112.402344 L 19.964844 112.402344 L 19.964844 49.578125 L 65.8125 49.578125 C 68.601562 49.574219 70.867188 51.835938 70.859375 54.628906 Z M 70.859375 54.628906 "/>
</g>
<mask id="mask3">
  <g filter="url(#alpha)">
<rect x="0" y="0" width="128" height="128" style="fill:rgb(0%,0%,0%);fill-opacity:0.1;stroke:none;"/>
  </g>
</mask>
<clipPath id="clip4">
  <rect x="0" y="0" width="192" height="152"/>
</clipPath>
<g id="surface30708" clip-path="url(#clip4)">
<path style=" stroke:none;fill-rule:nonzero;fill:rgb(0%,0%,0%);fill-opacity:1;" d="M 68.695312 54.628906 L 68.695312 107.355469 C 68.699219 110.144531 66.4375 112.40625 63.644531 112.402344 L 19.964844 112.402344 L 19.964844 49.578125 L 63.644531 49.578125 C 66.4375 49.574219 68.699219 51.835938 68.695312 54.628906 Z M 68.695312 54.628906 "/>
</g>
</defs>
<g id="surface30695">
<path style=" stroke:none;fill-rule:nonzero;fill:rgb(15.686275%,65.882355%,91.764706%);fill-opacity:1;" d="M 108.4375 11.917969 L 81.996094 11.917969 C 79.988281 11.917969 78.066406 12.714844 76.648438 14.132812 L 14.230469 76.546875 C 12.8125 77.964844 12.015625 79.890625 12.015625 81.894531 L 12.015625 108.339844 C 12.015625 112.515625 15.402344 115.898438 19.578125 115.898438 L 46.023438 115.898438 C 48.027344 115.898438 49.949219 115.101562 51.367188 113.683594 L 113.785156 51.269531 C 115.203125 49.851562 116 47.925781 116 45.921875 L 116 19.476562 C 116 15.300781 112.613281 11.917969 108.4375 11.917969 Z M 108.4375 11.917969 "/>
<path style=" stroke:none;fill-rule:nonzero;fill:rgb(0%,47.058824%,83.137256%);fill-opacity:1;" d="M 108.441406 115.898438 L 81.996094 115.898438 C 79.988281 115.898438 78.066406 115.101562 76.648438 113.683594 L 64.007812 101.046875 L 64.007812 77.425781 C 64.007812 69.960938 70.058594 63.90625 77.527344 63.90625 L 101.144531 63.90625 L 113.785156 76.546875 C 115.203125 77.964844 116 79.890625 116 81.894531 L 116 108.339844 C 116 112.515625 112.613281 115.898438 108.441406 115.898438 Z M 108.441406 115.898438 "/>
<path style=" stroke:none;fill-rule:nonzero;fill:rgb(31.37255%,85.09804%,100%);fill-opacity:1;" d="M 19.578125 11.917969 L 46.023438 11.917969 C 48.027344 11.917969 49.949219 12.714844 51.367188 14.132812 L 64.007812 26.769531 L 64.007812 50.390625 C 64.007812 57.855469 57.957031 63.90625 50.492188 63.90625 L 26.871094 63.90625 L 14.230469 51.269531 C 12.8125 49.851562 12.015625 47.925781 12.015625 45.921875 L 12.015625 19.476562 C 12.015625 15.300781 15.402344 11.917969 19.578125 11.917969 Z M 19.578125 11.917969 "/>
<use xlink:href="#surface30699" transform="matrix(1,0,0,1,-8,-16)" mask="url(#mask0)"/>
<use xlink:href="#surface30702" transform="matrix(1,0,0,1,-8,-16)" mask="url(#mask1)"/>
<use xlink:href="#surface30705" transform="matrix(1,0,0,1,-8,-16)" mask="url(#mask2)"/>
<use xlink:href="#surface30708" transform="matrix(1,0,0,1,-8,-16)" mask="url(#mask3)"/>
<path style=" stroke:none;fill-rule:nonzero;fill:rgb(0%,47.058824%,83.137256%);fill-opacity:1;" d="M 2.371094 33.578125 L 58.359375 33.578125 C 59.648438 33.578125 60.695312 34.625 60.695312 35.914062 L 60.695312 91.902344 C 60.695312 93.191406 59.648438 94.238281 58.359375 94.238281 L 2.371094 94.238281 C 1.082031 94.238281 0.0390625 93.191406 0.0390625 91.902344 L 0.0390625 35.914062 C 0.0390625 34.625 1.082031 33.578125 2.371094 33.578125 Z M 2.371094 33.578125 "/>
<path style=" stroke:none;fill-rule:nonzero;fill:rgb(100%,100%,100%);fill-opacity:1;" d="M 40.300781 52.820312 L 22.878906 52.820312 L 22.878906 61.113281 L 39.429688 61.113281 L 39.429688 66.429688 L 22.878906 66.429688 L 22.878906 75.042969 L 41.054688 75.042969 L 41.054688 80.335938 L 16.441406 80.335938 L 16.441406 47.480469 L 40.300781 47.480469 Z M 40.300781 52.820312 "/>
</g>
</svg>
