<?xml version="1.0" encoding="UTF-8" standalone="no"?>
<svg
   xmlns:dc="http://purl.org/dc/elements/1.1/"
   xmlns:cc="http://creativecommons.org/ns#"
   xmlns:rdf="http://www.w3.org/1999/02/22-rdf-syntax-ns#"
   xmlns:svg="http://www.w3.org/2000/svg"
   xmlns="http://www.w3.org/2000/svg"
   xmlns:xlink="http://www.w3.org/1999/xlink"
   xmlns:sodipodi="http://sodipodi.sourceforge.net/DTD/sodipodi-0.dtd"
   xmlns:inkscape="http://www.inkscape.org/namespaces/inkscape"
   inkscape:export-ydpi="96"
   inkscape:export-xdpi="96"
   inkscape:export-filename="Template.png"
   width="192"
   height="152"
   id="svg11300"
   sodipodi:version="0.32"
   inkscape:version="1.0 (4035a4fb49, 2020-05-01)"
   sodipodi:docname="org.parlatype.Parlatype.svg"
   inkscape:output_extension="org.inkscape.output.svg.inkscape"
   version="1.0"
   style="display:inline;enable-background:new"
   viewBox="0 0 192 152">
  <title
     id="title4162">Adwaita Icon Template</title>
  <defs
     id="defs3">
    <linearGradient
       id="linearGradient2390"
       inkscape:collect="always">
      <stop
         id="stop2386"
         offset="0"
         style="stop-color:#deddda;stop-opacity:1" />
      <stop
         id="stop2388"
         offset="1"
         style="stop-color:#c6c5c3;stop-opacity:1" />
    </linearGradient>
    <linearGradient
       id="linearGradient1903">
      <stop
         id="stop1895"
         offset="0"
         style="stop-color:#f6f5f4;stop-opacity:1" />
      <stop
         style="stop-color:#c0bfbc;stop-opacity:1"
         offset="0.41412991"
         id="stop1897" />
      <stop
         style="stop-color:#9a9996;stop-opacity:1"
         offset="0.79592443"
         id="stop1899" />
      <stop
         id="stop1901"
         offset="1"
         style="stop-color:#77767b;stop-opacity:1" />
    </linearGradient>
    <linearGradient
       id="linearGradient1893">
      <stop
         style="stop-color:#deddda;stop-opacity:1"
         offset="0"
         id="stop1889" />
      <stop
         style="stop-color:#cbcac8;stop-opacity:1"
         offset="1"
         id="stop1891" />
    </linearGradient>
    <linearGradient
       id="linearGradient6008-2-1"
       inkscape:collect="always">
      <stop
         id="stop6010-0-0"
         offset="0"
         style="stop-color:#eeeeec;stop-opacity:1;" />
      <stop
         id="stop6012-2-4"
         offset="1"
         style="stop-color:#eeeeec;stop-opacity:0;" />
    </linearGradient>
    <clipPath
       id="clipPath4998-3-3"
       clipPathUnits="userSpaceOnUse">
      <rect
         y="56"
         x="-202"
         width="84.000008"
         style="color:#000000;display:block;overflow:visible;visibility:visible;fill:none;stroke:#000000;stroke-width:0.999999;marker:none;enable-background:new"
         ry="10"
         rx="10"
         inkscape:r_cy="true"
         inkscape:r_cx="true"
         id="rect5000-6-0"
         height="88.000008" />
    </clipPath>
    <linearGradient
       y2="146.47488"
       x2="-160"
       y1="48.997898"
       x1="-160"
       gradientUnits="userSpaceOnUse"
       id="linearGradient55574-7"
       xlink:href="#linearGradient1903"
       inkscape:collect="always"
       gradientTransform="matrix(1.2380951,0,0,1.1818181,262.09522,117.81819)" />
    <filter
       height="1.24"
       y="-0.12"
       width="1.24"
       x="-0.12"
       id="filter5631-2"
       inkscape:collect="always">
      <feGaussianBlur
         id="feGaussianBlur5633-9"
         stdDeviation="1.5594418"
         inkscape:collect="always" />
    </filter>
    <filter
       height="1.24"
       y="-0.12"
       width="1.24"
       x="-0.12"
       id="filter5627-1"
       inkscape:collect="always">
      <feGaussianBlur
         id="feGaussianBlur5629-2"
         stdDeviation="1.5594418"
         inkscape:collect="always" />
    </filter>
    <linearGradient
       y2="61.701748"
       x2="-160.15968"
       y1="68.002144"
       x1="-160.15968"
       gradientUnits="userSpaceOnUse"
       id="linearGradient55576-7"
       xlink:href="#linearGradient6008-2-1"
       inkscape:collect="always"
       gradientTransform="matrix(1.2805177,0,0,1.2805177,268.88283,112.29101)" />
    <linearGradient
       y2="94.939034"
       x2="-199.11382"
       y1="94.939034"
       x1="-184.88535"
       gradientUnits="userSpaceOnUse"
       id="linearGradient55578-3"
       xlink:href="#linearGradient6008-2-1"
       inkscape:collect="always" />
    <filter
       height="1.0860435"
       y="-0.043021768"
       width="1.315493"
       x="-0.15774648"
       id="filter6114-3-5-6"
       inkscape:collect="always"
       color-interpolation-filters="sRGB">
      <feGaussianBlur
         id="feGaussianBlur6116-2-4-0"
         stdDeviation="1.5774648"
         inkscape:collect="always" />
    </filter>
    <radialGradient
       r="15.095438"
       fy="31.046394"
       fx="21.547127"
       cy="31.046394"
       cx="21.547127"
       gradientTransform="matrix(5.1289492,0,0,4.3081305,-189.65929,122.99808)"
       gradientUnits="userSpaceOnUse"
       id="radialGradient55586-9"
       xlink:href="#linearGradient1893"
       inkscape:collect="always" />
    <linearGradient
       inkscape:collect="always"
       xlink:href="#linearGradient2390"
       id="linearGradient1749"
       gradientUnits="userSpaceOnUse"
       gradientTransform="matrix(1.166667,0,0,1.1785713,-250.66673,118.85715)"
       x1="152.8577"
       y1="129.1423"
       x2="169"
       y2="71.5" />
    <linearGradient
       inkscape:collect="always"
       xlink:href="#linearGradient6008-2-1"
       id="linearGradient2341"
       gradientUnits="userSpaceOnUse"
       x1="-184.88535"
       y1="94.939034"
       x2="-199.11382"
       y2="94.939034" />
    <clipPath
       clipPathUnits="userSpaceOnUse"
       id="clipPath2352">
      <rect
         height="103.99999"
         id="rect2354"
         inkscape:r_cx="true"
         inkscape:r_cy="true"
         rx="8"
         ry="8.000001"
         style="color:#000000;display:block;overflow:visible;visibility:visible;fill:url(#linearGradient2356);fill-opacity:1;fill-rule:nonzero;stroke:none;stroke-width:1.28051;marker:none;enable-background:new"
         width="104.00001"
         x="12.00001"
         y="184" />
    </clipPath>
    <linearGradient
       inkscape:collect="always"
       xlink:href="#linearGradient1903"
       id="linearGradient2356"
       gradientUnits="userSpaceOnUse"
       gradientTransform="matrix(1.2380951,0,0,1.1818181,262.09522,117.81819)"
       x1="-160"
       y1="48.997898"
       x2="-160"
       y2="146.47488" />
    <clipPath
       clipPathUnits="userSpaceOnUse"
       id="clipPath2362">
      <rect
         height="103.99999"
         id="rect2364"
         inkscape:r_cx="true"
         inkscape:r_cy="true"
         rx="8"
         ry="8.000001"
         style="color:#000000;display:block;overflow:visible;visibility:visible;fill:url(#linearGradient2366);fill-opacity:1;fill-rule:nonzero;stroke:none;stroke-width:1.28051;marker:none;enable-background:new"
         width="104.00001"
         x="12.00001"
         y="184" />
    </clipPath>
    <linearGradient
       inkscape:collect="always"
       xlink:href="#linearGradient1903"
       id="linearGradient2366"
       gradientUnits="userSpaceOnUse"
       gradientTransform="matrix(1.2380951,0,0,1.1818181,262.09522,117.81819)"
       x1="-160"
       y1="48.997898"
       x2="-160"
       y2="146.47488" />
  </defs>
  <sodipodi:namedview
     stroke="#ef2929"
     fill="#f57900"
     id="base"
     pagecolor="#ffffff"
     bordercolor="#666666"
     borderopacity="0.25490196"
     inkscape:pageopacity="0.0"
     inkscape:pageshadow="2"
     inkscape:zoom="1.7603384"
     inkscape:cx="-10.074534"
     inkscape:cy="40.249229"
     inkscape:current-layer="layer9"
     showgrid="false"
     inkscape:grid-bbox="true"
     inkscape:document-units="px"
     inkscape:showpageshadow="false"
     inkscape:window-width="1920"
     inkscape:window-height="1016"
     inkscape:window-x="0"
     inkscape:window-y="0"
     width="400px"
     height="300px"
     inkscape:snap-nodes="true"
     inkscape:snap-bbox="true"
     objecttolerance="7"
     gridtolerance="12"
     guidetolerance="13"
     inkscape:window-maximized="1"
     inkscape:pagecheckerboard="false"
     showguides="false"
     inkscape:guide-bbox="true"
     inkscape:locked="false"
     inkscape:measure-start="0,0"
     inkscape:measure-end="0,0"
     inkscape:object-nodes="true"
     inkscape:bbox-nodes="true"
     inkscape:snap-global="true"
     inkscape:object-paths="true"
     inkscape:snap-intersection-paths="true"
     inkscape:snap-bbox-edge-midpoints="true"
     inkscape:snap-bbox-midpoints="true"
     showborder="true"
     inkscape:snap-center="true"
     inkscape:snap-object-midpoints="true"
     inkscape:snap-midpoints="true"
     inkscape:snap-smooth-nodes="true"
     inkscape:snap-text-baseline="true"
     borderlayer="true"
     inkscape:document-rotation="0"
     inkscape:bbox-paths="true">
    <inkscape:grid
       type="xygrid"
       id="grid5883"
       spacingx="2"
       spacingy="2"
       enabled="true"
       visible="true"
       empspacing="4"
       originx="8"
       originy="8" />
    <sodipodi:guide
       position="72,16"
       orientation="0,1"
       id="guide1073"
       inkscape:locked="false"
       inkscape:label=""
       inkscape:color="rgb(0,0,255)" />
    <sodipodi:guide
       position="20,72"
       orientation="1,0"
       id="guide1075"
       inkscape:locked="false"
       inkscape:label=""
       inkscape:color="rgb(0,0,255)" />
    <sodipodi:guide
       position="72,112"
       orientation="0,1"
       id="guide1099"
       inkscape:locked="false"
       inkscape:label=""
       inkscape:color="rgb(0,0,255)" />
    <sodipodi:guide
       position="72,136"
       orientation="0,1"
       id="guide993"
       inkscape:locked="false"
       inkscape:label=""
       inkscape:color="rgb(0,0,255)" />
    <sodipodi:guide
       position="112,72"
       orientation="1,0"
       id="guide995"
       inkscape:locked="false"
       inkscape:label=""
       inkscape:color="rgb(0,0,255)" />
    <sodipodi:guide
       position="8.0000001,72"
       orientation="1,0"
       id="guide867"
       inkscape:locked="false"
       inkscape:label=""
       inkscape:color="rgb(0,0,255)" />
    <sodipodi:guide
       position="128,72"
       orientation="1,0"
       id="guide869"
       inkscape:locked="false"
       inkscape:label=""
       inkscape:color="rgb(0,0,255)" />
    <sodipodi:guide
       position="72,124"
       orientation="0,1"
       id="guide871"
       inkscape:locked="false"
       inkscape:label=""
       inkscape:color="rgb(0,0,255)" />
    <inkscape:grid
       type="xygrid"
       id="grid873"
       spacingx="1"
       spacingy="1"
       empspacing="8"
       color="#000000"
       opacity="0.49019608"
       empcolor="#000000"
       empopacity="0.08627451"
       dotted="true"
       originx="8"
       originy="8" />
    <sodipodi:guide
       position="32,72"
       orientation="1,0"
       id="guide877"
       inkscape:locked="false"
       inkscape:label=""
       inkscape:color="rgb(0,0,255)" />
    <sodipodi:guide
       position="124,72"
       orientation="1,0"
       id="guide879"
       inkscape:locked="false"
       inkscape:label=""
       inkscape:color="rgb(0,0,255)" />
    <sodipodi:guide
       position="72,128"
       orientation="0,1"
       id="guide881"
       inkscape:locked="false"
       inkscape:label=""
       inkscape:color="rgb(0,0,255)" />
    <sodipodi:guide
       position="72,20"
       orientation="0,1"
       id="guide883"
       inkscape:locked="false"
       inkscape:label=""
       inkscape:color="rgb(0,0,255)" />
    <sodipodi:guide
       position="16,72"
       orientation="1,0"
       id="guide885"
       inkscape:locked="false"
       inkscape:label=""
       inkscape:color="rgb(0,0,255)" />
    <sodipodi:guide
       position="136,72"
       orientation="1,0"
       id="guide887"
       inkscape:locked="false"
       inkscape:label=""
       inkscape:color="rgb(0,0,255)" />
    <sodipodi:guide
       position="72,8"
       orientation="0,1"
       id="guide897"
       inkscape:locked="false"
       inkscape:label=""
       inkscape:color="rgb(0,0,255)" />
    <sodipodi:guide
       position="72,32"
       orientation="0,1"
       id="guide899"
       inkscape:locked="false"
       inkscape:label=""
       inkscape:color="rgb(0,0,255)" />
    <sodipodi:guide
       position="264,264"
       orientation="-0.70710678,0.70710678"
       id="guide950"
       inkscape:locked="false"
       inkscape:label=""
       inkscape:color="rgb(0,0,255)" />
    <sodipodi:guide
       position="72,72"
       orientation="0.70710678,0.70710678"
       id="guide952"
       inkscape:locked="false"
       inkscape:label=""
       inkscape:color="rgb(0,0,255)" />
  </sodipodi:namedview>
  <metadata
     id="metadata4">
    <rdf:RDF>
      <cc:Work
         rdf:about="">
        <dc:format>image/svg+xml</dc:format>
        <dc:type
           rdf:resource="http://purl.org/dc/dcmitype/StillImage" />
        <dc:creator>
          <cc:Agent>
            <dc:title>GNOME Design Team</dc:title>
          </cc:Agent>
        </dc:creator>
        <dc:source />
        <cc:license
           rdf:resource="http://creativecommons.org/licenses/by-sa/4.0/" />
        <dc:title>Adwaita Icon Template</dc:title>
        <dc:subject>
          <rdf:Bag />
        </dc:subject>
        <dc:date />
        <dc:rights>
          <cc:Agent>
            <dc:title />
          </cc:Agent>
        </dc:rights>
        <dc:publisher>
          <cc:Agent>
            <dc:title />
          </cc:Agent>
        </dc:publisher>
        <dc:identifier />
        <dc:relation />
        <dc:language />
        <dc:coverage />
        <dc:description />
        <dc:contributor>
          <cc:Agent>
            <dc:title />
          </cc:Agent>
        </dc:contributor>
      </cc:Work>
      <cc:License
         rdf:about="http://creativecommons.org/licenses/by-sa/4.0/">
        <cc:permits
           rdf:resource="http://creativecommons.org/ns#Reproduction" />
        <cc:permits
           rdf:resource="http://creativecommons.org/ns#Distribution" />
        <cc:requires
           rdf:resource="http://creativecommons.org/ns#Notice" />
        <cc:requires
           rdf:resource="http://creativecommons.org/ns#Attribution" />
        <cc:permits
           rdf:resource="http://creativecommons.org/ns#DerivativeWorks" />
        <cc:requires
           rdf:resource="http://creativecommons.org/ns#ShareAlike" />
      </cc:License>
    </rdf:RDF>
  </metadata>
  <g
     id="layer1"
     inkscape:label="App Icon"
     inkscape:groupmode="layer"
     style="display:inline"
     transform="translate(8,-156)">
    <g
       inkscape:groupmode="layer"
       id="layer4"
       inkscape:label="template"
       style="display:inline"
       sodipodi:insensitive="true">
      <rect
         inkscape:label="0"
         y="172"
         x="9.2651362e-08"
         height="128"
         width="128"
         id="hicolor"
         style="display:inline;overflow:visible;visibility:visible;fill:#f0f0f0;fill-opacity:0;fill-rule:nonzero;stroke:none;stroke-width:0.5;marker:none;enable-background:accumulate" />
      <rect
         style="display:inline;overflow:visible;visibility:visible;fill:#f0f0f0;fill-opacity:0;fill-rule:nonzero;stroke:none;stroke-width:0.5;marker:none;enable-background:accumulate"
         id="symbolic"
         width="16"
         height="16"
         x="160"
         y="172"
         inkscape:label="0" />
    </g>
    <g
       inkscape:groupmode="layer"
       id="layer2"
       inkscape:label="baseplate"
       style="display:none"
       sodipodi:insensitive="true">
      <g
         style="display:inline;fill:#000000;enable-background:new"
         transform="matrix(7.9911709,0,0,8.0036407,-167.7909,-4846.0776)"
         id="g12027"
         inkscape:export-xdpi="12"
         inkscape:export-ydpi="12" />
      <rect
         style="display:inline;overflow:visible;visibility:visible;fill:#f0f0f0;fill-opacity:1;fill-rule:nonzero;stroke:none;stroke-width:0.5;marker:none;enable-background:accumulate"
         id="128"
         width="128"
         height="128"
         x="9.2651362e-08"
         y="172"
         inkscape:label="0" />
      <g
         id="g883"
         style="fill:none;fill-opacity:0.25098;stroke:#a579b3;stroke-opacity:1"
         transform="translate(-24,24)" />
      <g
         id="g900"
         style="fill:none;fill-opacity:0.25098;stroke:#a579b3;stroke-opacity:1"
         transform="translate(-24,24)" />
      <rect
         inkscape:label=""
         y="172"
         x="160"
         height="16"
         width="16"
         id="16"
         style="display:inline;overflow:visible;visibility:visible;fill:#f0f0f0;fill-opacity:1;fill-rule:nonzero;stroke:none;stroke-width:0.5;marker:none;enable-background:accumulate" />
      <text
         xml:space="preserve"
         style="font-style:normal;font-variant:normal;font-weight:bold;font-stretch:normal;font-size:4px;line-height:125%;font-family:Cantarell;-inkscape-font-specification:'Cantarell, Bold';text-align:start;writing-mode:lr-tb;text-anchor:start;display:inline;fill:#000000;fill-opacity:1;stroke:none;stroke-width:0.332649;enable-background:new"
         x="0"
         y="167"
         id="text863"
         inkscape:label="icon-name"><tspan
           style="font-size:4px;stroke-width:0.332649"
           sodipodi:role="line"
           id="tspan861"
           x="0"
           y="167">Hicolor</tspan></text>
      <text
         inkscape:label="icon-name"
         id="text867"
         y="167"
         x="160"
         style="font-style:normal;font-variant:normal;font-weight:bold;font-stretch:normal;font-size:4px;line-height:125%;font-family:Cantarell;-inkscape-font-specification:'Cantarell, Bold';text-align:start;writing-mode:lr-tb;text-anchor:start;display:inline;fill:#000000;fill-opacity:1;stroke:none;stroke-width:0.332649;enable-background:new"
         xml:space="preserve"><tspan
           y="167"
           x="160"
           id="tspan865"
           sodipodi:role="line"
           style="font-size:4px;stroke-width:0.332649">Symbolic</tspan></text>
    </g>
    <g
       inkscape:groupmode="layer"
       id="layer9"
       inkscape:label="icons"
       style="display:inline">
      <rect
         y="184"
         x="12.00001"
         width="104.00001"
         style="color:#000000;display:block;overflow:visible;visibility:visible;fill:url(#linearGradient55574-7);fill-opacity:1;fill-rule:nonzero;stroke:none;stroke-width:1.28051;marker:none;enable-background:new"
         ry="8.000001"
         rx="8"
         inkscape:r_cy="true"
         inkscape:r_cx="true"
         id="rect2960-9-7-86-2"
         height="103.99999" />
      <path
         inkscape:connector-curvature="0"
         style="color:#000000;display:block;overflow:visible;visibility:visible;opacity:0.703571;fill:url(#linearGradient55576-7);fill-opacity:1;fill-rule:nonzero;stroke:none;stroke-width:1.28052;marker:none;enable-background:new"
         d="m 10.218255,184 30.732424,30.73242 H 87.049317 L 117.78174,184 Z"
         id="rect2960-9-7-86-9-4-1"
         sodipodi:nodetypes="ccccc"
         clip-path="url(#clipPath2362)" />
      <g
         id="g2348"
         clip-path="url(#clipPath2352)">
        <path
           transform="matrix(-1.2805177,0,0,1.2805177,-141.30494,112.29102)"
           sodipodi:nodetypes="ccccc"
           id="rect2960-9-7-9-0-6-4-9"
           d="m -203.06588,47.456701 c -9.68248,0 -7.47741,-2.205076 -7.47741,7.477408 l 30.97289,19.110449 c 0,-4.841242 -6.10254,1.261296 -1.26129,1.261296 z"
           style="color:#000000;display:block;overflow:visible;visibility:visible;fill:#ffffff;fill-opacity:1;fill-rule:nonzero;stroke:none;stroke-width:0.999999;marker:none;filter:url(#filter5631-2);enable-background:new"
           inkscape:connector-curvature="0" />
        <path
           transform="matrix(1.2805177,0,0,1.2805177,268.88283,112.29101)"
           sodipodi:nodetypes="ccccc"
           id="rect2960-9-7-9-0-6-3"
           d="m -203.06588,47.456701 c -9.68248,0 -7.47741,-2.205076 -7.47741,7.477408 l 30.97289,19.110449 c 0,-4.841242 -6.10254,1.261296 -1.26129,1.261296 z"
           style="color:#000000;display:block;overflow:visible;visibility:visible;fill:#ffffff;fill-opacity:1;fill-rule:nonzero;stroke:none;stroke-width:0.999999;marker:none;filter:url(#filter5627-1);enable-background:new"
           inkscape:connector-curvature="0" />
        <path
           transform="matrix(1.2805177,0,0,1.2805177,268.88283,112.29101)"
           sodipodi:nodetypes="ccccc"
           id="rect2960-9-7-86-9-3-9"
           d="M -202,55.999996 V 144 l 24,-32.97159 V 73.752523 Z"
           style="color:#000000;display:block;overflow:visible;visibility:visible;opacity:0.703571;fill:url(#linearGradient55578-3);fill-opacity:1;fill-rule:nonzero;stroke:none;stroke-width:0.999999;marker:none;filter:url(#filter6114-3-5-6);enable-background:new"
           inkscape:connector-curvature="0" />
        <g
           transform="matrix(-1,0,0,1,127.99974,-1.0849063e-4)"
           id="g2337">
          <path
             transform="matrix(1.2805177,0,0,1.2805177,268.88283,112.29101)"
             sodipodi:nodetypes="ccccc"
             id="path2333"
             d="M -202,55.999996 V 144 l 24,-32.97159 V 73.752523 Z"
             style="color:#000000;display:block;overflow:visible;visibility:visible;opacity:0.703571;fill:url(#linearGradient2341);fill-opacity:1;fill-rule:nonzero;stroke:none;stroke-width:0.999999;marker:none;filter:url(#filter6114-3-5-6);enable-background:new"
             inkscape:connector-curvature="0" />
        </g>
      </g>
      <rect
         y="199"
         x="-99.000031"
         width="70.000023"
         transform="scale(-1,1)"
         style="color:#000000;display:block;overflow:visible;visibility:visible;fill:url(#radialGradient55586-9);fill-opacity:1;fill-rule:nonzero;stroke:url(#linearGradient1749);stroke-width:2;stroke-miterlimit:4;stroke-dasharray:none;marker:none;enable-background:new"
         ry="5.999999"
         rx="5.9999995"
         inkscape:r_cy="true"
         inkscape:r_cx="true"
         id="rect3835-9-4-3-4"
         height="65.999992" />
      <g
         id="g2246"
         transform="translate(0,1)"
         style="fill:#c0bfbc">
        <path
           id="path2240"
           style="color:#000000;font-style:normal;font-variant:normal;font-weight:normal;font-stretch:normal;font-size:medium;line-height:normal;font-family:sans-serif;font-variant-ligatures:normal;font-variant-position:normal;font-variant-caps:normal;font-variant-numeric:normal;font-variant-alternates:normal;font-variant-east-asian:normal;font-feature-settings:normal;font-variation-settings:normal;text-indent:0;text-align:start;text-decoration:none;text-decoration-line:none;text-decoration-style:solid;text-decoration-color:#000000;letter-spacing:normal;word-spacing:normal;text-transform:none;writing-mode:lr-tb;direction:ltr;text-orientation:mixed;dominant-baseline:auto;baseline-shift:baseline;text-anchor:start;white-space:normal;shape-padding:0;shape-margin:0;inline-size:0;clip-rule:nonzero;display:inline;overflow:visible;visibility:visible;opacity:1;isolation:auto;mix-blend-mode:normal;color-interpolation:sRGB;color-interpolation-filters:linearRGB;solid-color:#000000;solid-opacity:1;vector-effect:none;fill:#c0bfbc;fill-opacity:1;fill-rule:nonzero;stroke:none;stroke-width:6;stroke-linecap:round;stroke-linejoin:round;stroke-miterlimit:4;stroke-dasharray:none;stroke-dashoffset:0;stroke-opacity:1;color-rendering:auto;image-rendering:auto;shape-rendering:auto;text-rendering:auto;enable-background:accumulate;stop-color:#000000;stop-opacity:1"
           d="M 72,54 C 59.8639,54 50,63.86389 50,76 v 9 c 0,0.335363 0.01049,0.668267 0.02539,1 h 6.023437 C 56.028749,85.667525 56,85.338028 56,85 v -9 c 0,-8.91589 7.084114,-16 16,-16 8.915887,0 16,7.08411 16,16 v 9 c 0,0.338028 -0.02875,0.667525 -0.04883,1 h 6.023437 C 93.989514,85.668267 94,85.335363 94,85 V 76 C 94,63.86389 84.136101,54 72,54 Z"
           transform="translate(-8,156)" />
        <rect
           style="fill:#c0bfbc;fill-opacity:1;stroke:none;stroke-width:2.37076;stroke-linecap:round;stroke-linejoin:round"
           id="rect2242"
           width="12.999977"
           height="19"
           x="42.000023"
           y="235"
           rx="4.9555664"
           ry="4.9555664" />
        <rect
           ry="4.9555664"
           rx="4.9555669"
           y="235"
           x="73"
           height="19"
           width="12.999995"
           id="rect2244"
           style="fill:#c0bfbc;fill-opacity:1;stroke:none;stroke-width:2.37076;stroke-linecap:round;stroke-linejoin:round" />
      </g>
      <g
         id="g2238"
         transform="translate(0,-1)"
         style="fill:#3d3846">
        <path
           transform="translate(-8,156)"
           d="M 72,54 C 59.8639,54 50,63.86389 50,76 v 9 c 0,0.335363 0.01049,0.668267 0.02539,1 h 6.023437 C 56.028749,85.667525 56,85.338028 56,85 v -9 c 0,-8.91589 7.084114,-16 16,-16 8.915887,0 16,7.08411 16,16 v 9 c 0,0.338028 -0.02875,0.667525 -0.04883,1 h 6.023437 C 93.989514,85.668267 94,85.335363 94,85 V 76 C 94,63.86389 84.136101,54 72,54 Z"
           style="color:#000000;font-style:normal;font-variant:normal;font-weight:normal;font-stretch:normal;font-size:medium;line-height:normal;font-family:sans-serif;font-variant-ligatures:normal;font-variant-position:normal;font-variant-caps:normal;font-variant-numeric:normal;font-variant-alternates:normal;font-variant-east-asian:normal;font-feature-settings:normal;font-variation-settings:normal;text-indent:0;text-align:start;text-decoration:none;text-decoration-line:none;text-decoration-style:solid;text-decoration-color:#000000;letter-spacing:normal;word-spacing:normal;text-transform:none;writing-mode:lr-tb;direction:ltr;text-orientation:mixed;dominant-baseline:auto;baseline-shift:baseline;text-anchor:start;white-space:normal;shape-padding:0;shape-margin:0;inline-size:0;clip-rule:nonzero;display:inline;overflow:visible;visibility:visible;opacity:1;isolation:auto;mix-blend-mode:normal;color-interpolation:sRGB;color-interpolation-filters:linearRGB;solid-color:#000000;solid-opacity:1;vector-effect:none;fill:#3d3846;fill-opacity:1;fill-rule:nonzero;stroke:none;stroke-width:6;stroke-linecap:round;stroke-linejoin:round;stroke-miterlimit:4;stroke-dasharray:none;stroke-dashoffset:0;stroke-opacity:1;color-rendering:auto;image-rendering:auto;shape-rendering:auto;text-rendering:auto;enable-background:accumulate;stop-color:#000000;stop-opacity:1"
           id="path2231" />
        <rect
           ry="4.9555664"
           rx="4.9555664"
           y="235"
           x="42.000023"
           height="19"
           width="12.999977"
           id="rect2076"
           style="fill:#3d3846;fill-opacity:1;stroke:none;stroke-width:2.37076;stroke-linecap:round;stroke-linejoin:round" />
        <rect
           style="fill:#3d3846;fill-opacity:1;stroke:none;stroke-width:2.37076;stroke-linecap:round;stroke-linejoin:round"
           id="rect2140"
           width="12.999995"
           height="19"
           x="73"
           y="235"
           rx="4.9555669"
           ry="4.9555664" />
      </g>
      <rect
         style="fill:none;fill-opacity:1;stroke:#241f31;stroke-width:6;stroke-linecap:round;stroke-linejoin:round"
         id="rect2220"
         width="37.999977"
         height="47"
         x="45.000023"
         y="393"
         rx="18.999989"
         ry="18.999989" />
      <rect
         ry="16"
         rx="16"
         y="422"
         x="18.995123"
         height="23.937988"
         width="89.004868"
         id="rect2222"
         style="fill:#d5d4d1;fill-opacity:1;stroke:none;stroke-width:6;stroke-linecap:round;stroke-linejoin:round" />
      <rect
         ry="4.9555664"
         rx="4.9555664"
         y="415"
         x="42.000023"
         height="19"
         width="12.999977"
         id="rect2224"
         style="fill:#241f31;fill-opacity:1;stroke:none;stroke-width:2.37076;stroke-linecap:round;stroke-linejoin:round" />
      <rect
         style="fill:#241f31;fill-opacity:1;stroke:none;stroke-width:2.37076;stroke-linecap:round;stroke-linejoin:round"
         id="rect2226"
         width="12.999995"
         height="19"
         x="73"
         y="415"
         rx="4.9555669"
         ry="4.9555664" />
    </g>
    <g
       inkscape:groupmode="layer"
       id="layer3"
       inkscape:label="grid"
       style="display:none"
       sodipodi:insensitive="true">
      <circle
         cx="64.000031"
         cy="236"
         r="59.504131"
         id="circle2892"
         style="display:inline;opacity:0.1;vector-effect:none;fill:none;fill-opacity:1;stroke:#000000;stroke-width:0.99;stroke-linecap:butt;stroke-linejoin:miter;stroke-miterlimit:4;stroke-dasharray:0.99, 0.99;stroke-dashoffset:0;stroke-opacity:1;marker:none;marker-start:none;marker-mid:none;marker-end:none;paint-order:normal;enable-background:new" />
      <rect
         ry="7.9292889"
         rx="8.701004"
         y="180.49496"
         x="20.495007"
         height="111.01005"
         width="87.009987"
         id="rect2894"
         style="display:inline;opacity:0.1;vector-effect:none;fill:none;fill-opacity:1;stroke:#000000;stroke-width:0.99;stroke-linecap:butt;stroke-linejoin:miter;stroke-miterlimit:4;stroke-dasharray:0.99, 0.99;stroke-dashoffset:0;stroke-opacity:1;marker:none;marker-start:none;marker-mid:none;marker-end:none;paint-order:normal;enable-background:new" />
      <rect
         ry="7.9238095"
         rx="7.9238095"
         y="184.49524"
         x="12.495266"
         height="103.00952"
         width="103.00952"
         id="rect2896"
         style="display:inline;opacity:0.1;vector-effect:none;fill:none;fill-opacity:1;stroke:#000000;stroke-width:0.99;stroke-linecap:butt;stroke-linejoin:miter;stroke-miterlimit:4;stroke-dasharray:0.99, 0.99;stroke-dashoffset:0;stroke-opacity:1;marker:none;marker-start:none;marker-mid:none;marker-end:none;paint-order:normal;enable-background:new" />
      <rect
         ry="8.701005"
         rx="7.9292889"
         y="200.49496"
         x="8.4950066"
         height="87.010048"
         width="111.01004"
         id="rect2898"
         style="display:inline;opacity:0.1;vector-effect:none;fill:none;fill-opacity:1;stroke:#000000;stroke-width:0.99;stroke-linecap:butt;stroke-linejoin:miter;stroke-miterlimit:4;stroke-dasharray:0.99, 0.99;stroke-dashoffset:0;stroke-opacity:1;marker:none;marker-start:none;marker-mid:none;marker-end:none;paint-order:normal;enable-background:new" />
      <path
         inkscape:connector-curvature="0"
         id="path2900"
         d="M 2.6203015e-5,288.99999 H 128.00003"
         style="display:inline;fill:none;stroke:#62a0ea;stroke-width:2;stroke-linecap:butt;stroke-linejoin:miter;stroke-miterlimit:4;stroke-dasharray:none;stroke-opacity:1;enable-background:new" />
    </g>
    <g
       id="g2505"
       transform="translate(0,-1)">
      <path
         transform="translate(-8,156)"
         d="m 176,20 c -2.2027,0 -4,1.7973 -4,4 v 2 h 1.53711 v -2 c 0,-1.37736 1.08553,-2.462891 2.46289,-2.462891 1.37735,0 2.46289,1.085531 2.46289,2.462891 v 2 H 180 v -2 c 0,-2.2027 -1.79731,-4 -4,-4 z"
         style="color:#000000;font-style:normal;font-variant:normal;font-weight:normal;font-stretch:normal;font-size:medium;line-height:normal;font-family:sans-serif;font-variant-ligatures:normal;font-variant-position:normal;font-variant-caps:normal;font-variant-numeric:normal;font-variant-alternates:normal;font-variant-east-asian:normal;font-feature-settings:normal;font-variation-settings:normal;text-indent:0;text-align:start;text-decoration:none;text-decoration-line:none;text-decoration-style:solid;text-decoration-color:#000000;letter-spacing:normal;word-spacing:normal;text-transform:none;writing-mode:lr-tb;direction:ltr;text-orientation:mixed;dominant-baseline:auto;baseline-shift:baseline;text-anchor:start;white-space:normal;shape-padding:0;shape-margin:0;inline-size:0;clip-rule:nonzero;display:inline;overflow:visible;visibility:visible;opacity:1;isolation:auto;mix-blend-mode:normal;color-interpolation:sRGB;color-interpolation-filters:linearRGB;solid-color:#000000;solid-opacity:1;vector-effect:none;fill:#241f31;fill-opacity:1;fill-rule:nonzero;stroke:none;stroke-width:1.53779;stroke-linecap:round;stroke-linejoin:round;stroke-miterlimit:4;stroke-dasharray:none;stroke-dashoffset:0;stroke-opacity:1;color-rendering:auto;image-rendering:auto;shape-rendering:auto;text-rendering:auto;enable-background:new;stop-color:#000000;stop-opacity:1"
         id="path2465" />
      <rect
         ry="1.6249995"
         rx="1.6249995"
         y="180"
         x="164"
         height="4"
         width="3.249999"
         id="rect2224-4"
         style="display:inline;fill:#241f31;fill-opacity:1;stroke:none;stroke-width:0.54389;stroke-linecap:round;stroke-linejoin:round;enable-background:new" />
      <rect
         style="display:inline;fill:#241f31;fill-opacity:1;stroke:none;stroke-width:0.54389;stroke-linecap:round;stroke-linejoin:round;enable-background:new"
         id="rect2449"
         width="3.249999"
         height="4"
         x="168.75002"
         y="180"
         rx="1.6249995"
         ry="1.6249995" />
    </g>
    <rect
       style="display:inline;fill:none;fill-opacity:1;stroke:#241f31;stroke-width:1.53779;stroke-linecap:round;stroke-linejoin:round;enable-background:new"
       id="rect2451"
       width="6.4621911"
       height="10.212227"
       x="294.76892"
       y="176.76889"
       rx="3.2310956"
       ry="3.2310956" />
    <rect
       ry="4.0000057"
       rx="4.0000057"
       y="182.00002"
       x="286.74878"
       height="5.9845061"
       width="22.251249"
       id="rect2453"
       style="display:inline;fill:#d5d4d1;fill-opacity:1;stroke:none;stroke-width:1.5;stroke-linecap:round;stroke-linejoin:round;enable-background:new" />
    <rect
       ry="1.6249995"
       rx="1.6249995"
       y="180"
       x="294"
       height="4"
       width="3.249999"
       id="rect2455"
       style="display:inline;fill:#241f31;fill-opacity:1;stroke:none;stroke-width:0.54389;stroke-linecap:round;stroke-linejoin:round;enable-background:new" />
    <rect
       style="display:inline;fill:#241f31;fill-opacity:1;stroke:none;stroke-width:0.54389;stroke-linecap:round;stroke-linejoin:round;enable-background:new"
       id="rect2459"
       width="3.249999"
       height="4"
       x="298.75"
       y="180"
       rx="1.6249995"
       ry="1.6249995" />
    <path
       d="m 278,176 c -2.2027,0 -4,1.7973 -4,4 v 2 h 1.53711 v -2 c 0,-1.37736 1.08553,-2.46289 2.46289,-2.46289 1.37735,0 2.46289,1.08553 2.46289,2.46289 v 2 H 282 v -2 c 0,-2.2027 -1.79731,-4 -4,-4 z"
       style="color:#000000;font-style:normal;font-variant:normal;font-weight:normal;font-stretch:normal;font-size:medium;line-height:normal;font-family:sans-serif;font-variant-ligatures:normal;font-variant-position:normal;font-variant-caps:normal;font-variant-numeric:normal;font-variant-alternates:normal;font-variant-east-asian:normal;font-feature-settings:normal;font-variation-settings:normal;text-indent:0;text-align:start;text-decoration:none;text-decoration-line:none;text-decoration-style:solid;text-decoration-color:#000000;letter-spacing:normal;word-spacing:normal;text-transform:none;writing-mode:lr-tb;direction:ltr;text-orientation:mixed;dominant-baseline:auto;baseline-shift:baseline;text-anchor:start;white-space:normal;shape-padding:0;shape-margin:0;inline-size:0;clip-rule:nonzero;display:inline;overflow:visible;visibility:visible;opacity:1;isolation:auto;mix-blend-mode:normal;color-interpolation:sRGB;color-interpolation-filters:linearRGB;solid-color:#000000;solid-opacity:1;vector-effect:none;fill:#241f31;fill-opacity:1;fill-rule:nonzero;stroke:none;stroke-width:1.53779;stroke-linecap:round;stroke-linejoin:round;stroke-miterlimit:4;stroke-dasharray:none;stroke-dashoffset:0;stroke-opacity:1;color-rendering:auto;image-rendering:auto;shape-rendering:auto;text-rendering:auto;enable-background:new;stop-color:#000000;stop-opacity:1"
       id="path2473" />
    <rect
       ry="1.6249995"
       rx="1.6249995"
       y="180"
       x="274"
       height="4"
       width="3.249999"
       id="rect2475"
       style="display:inline;fill:#241f31;fill-opacity:1;stroke:none;stroke-width:0.54389;stroke-linecap:round;stroke-linejoin:round;enable-background:new" />
    <rect
       style="display:inline;fill:#241f31;fill-opacity:1;stroke:none;stroke-width:0.54389;stroke-linecap:round;stroke-linejoin:round;enable-background:new"
       id="rect2479"
       width="3.249999"
       height="4"
       x="278.75"
       y="180"
       rx="1.6249995"
       ry="1.6249995" />
    <path
       id="path2500"
       style="color:#000000;font-style:normal;font-variant:normal;font-weight:normal;font-stretch:normal;font-size:medium;line-height:normal;font-family:sans-serif;font-variant-ligatures:normal;font-variant-position:normal;font-variant-caps:normal;font-variant-numeric:normal;font-variant-alternates:normal;font-variant-east-asian:normal;font-feature-settings:normal;font-variation-settings:normal;text-indent:0;text-align:start;text-decoration:none;text-decoration-line:none;text-decoration-style:solid;text-decoration-color:#000000;letter-spacing:normal;word-spacing:normal;text-transform:none;writing-mode:lr-tb;direction:ltr;text-orientation:mixed;dominant-baseline:auto;baseline-shift:baseline;text-anchor:start;white-space:normal;shape-padding:0;shape-margin:0;inline-size:0;clip-rule:nonzero;display:block;overflow:visible;visibility:visible;opacity:1;isolation:auto;mix-blend-mode:normal;color-interpolation:sRGB;color-interpolation-filters:linearRGB;solid-color:#000000;solid-opacity:1;vector-effect:none;fill:#241f31;fill-opacity:1;fill-rule:nonzero;stroke:none;stroke-width:2;stroke-linecap:butt;stroke-linejoin:miter;stroke-miterlimit:4;stroke-dasharray:none;stroke-dashoffset:0;stroke-opacity:1;marker:none;color-rendering:auto;image-rendering:auto;shape-rendering:auto;text-rendering:auto;enable-background:new;stop-color:#000000;stop-opacity:1"
       d="M 171 17 C 169.9093 17 169 17.9093 169 19 L 169 29 C 169 30.0907 169.9093 31 171 31 L 181 31 C 182.0907 31 183 30.0907 183 29 L 183 19 C 183 17.9093 182.0907 17 181 17 L 171 17 z M 172 18 L 180 18 C 180.554 18 181 18.446 181 19 L 181 27 C 181 27.554 180.554 28 180 28 L 172 28 C 171.446 28 171 27.554 171 27 L 171 19 C 171 18.446 171.446 18 172 18 z "
       transform="translate(-8,156)" />
    <rect
       y="174"
       x="-304"
       width="12"
       transform="scale(-1,1)"
       style="color:#000000;display:block;overflow:visible;visibility:visible;fill:none;fill-opacity:1;fill-rule:nonzero;stroke:#241f31;stroke-width:2;stroke-miterlimit:4;stroke-dasharray:none;marker:none;enable-background:new"
       ry="1"
       rx="1"
       inkscape:r_cy="true"
       inkscape:r_cx="true"
       id="rect2483"
       height="12" />
    <path
       style="color:#000000;font-style:normal;font-variant:normal;font-weight:normal;font-stretch:normal;font-size:medium;line-height:normal;font-family:sans-serif;font-variant-ligatures:normal;font-variant-position:normal;font-variant-caps:normal;font-variant-numeric:normal;font-variant-alternates:normal;font-variant-east-asian:normal;font-feature-settings:normal;font-variation-settings:normal;text-indent:0;text-align:start;text-decoration:none;text-decoration-line:none;text-decoration-style:solid;text-decoration-color:#000000;letter-spacing:normal;word-spacing:normal;text-transform:none;writing-mode:lr-tb;direction:ltr;text-orientation:mixed;dominant-baseline:auto;baseline-shift:baseline;text-anchor:start;white-space:normal;shape-padding:0;shape-margin:0;inline-size:0;clip-rule:nonzero;display:block;overflow:visible;visibility:visible;opacity:1;isolation:auto;mix-blend-mode:normal;color-interpolation:sRGB;color-interpolation-filters:linearRGB;solid-color:#000000;solid-opacity:1;vector-effect:none;fill:#241f31;fill-opacity:1;fill-rule:nonzero;stroke:none;stroke-width:2;stroke-linecap:butt;stroke-linejoin:miter;stroke-miterlimit:4;stroke-dasharray:none;stroke-dashoffset:0;stroke-opacity:1;marker:none;color-rendering:auto;image-rendering:auto;shape-rendering:auto;text-rendering:auto;enable-background:new;stop-color:#000000;stop-opacity:1"
       d="m 283,173 c 1.0907,0 2,0.9093 2,2 v 10 c 0,1.0907 -0.9093,2 -2,2 h -10 c -1.0907,0 -2,-0.9093 -2,-2 v -10 c 0,-1.0907 0.9093,-2 2,-2 z m 0,2 h -10 v 10 h 10 z"
       id="path2495" />
    <g
       id="g2522"
       transform="translate(90)">
      <g
         id="g2513"
         transform="translate(0,-1)">
        <path
           transform="translate(-8,156)"
           d="m 176,20 c -2.2027,0 -4,1.7973 -4,4 v 2 h 1.53711 v -2 c 0,-1.37736 1.08553,-2.462891 2.46289,-2.462891 1.37735,0 2.46289,1.085531 2.46289,2.462891 v 2 H 180 v -2 c 0,-2.2027 -1.79731,-4 -4,-4 z"
           style="color:#000000;font-style:normal;font-variant:normal;font-weight:normal;font-stretch:normal;font-size:medium;line-height:normal;font-family:sans-serif;font-variant-ligatures:normal;font-variant-position:normal;font-variant-caps:normal;font-variant-numeric:normal;font-variant-alternates:normal;font-variant-east-asian:normal;font-feature-settings:normal;font-variation-settings:normal;text-indent:0;text-align:start;text-decoration:none;text-decoration-line:none;text-decoration-style:solid;text-decoration-color:#000000;letter-spacing:normal;word-spacing:normal;text-transform:none;writing-mode:lr-tb;direction:ltr;text-orientation:mixed;dominant-baseline:auto;baseline-shift:baseline;text-anchor:start;white-space:normal;shape-padding:0;shape-margin:0;inline-size:0;clip-rule:nonzero;display:inline;overflow:visible;visibility:visible;opacity:1;isolation:auto;mix-blend-mode:normal;color-interpolation:sRGB;color-interpolation-filters:linearRGB;solid-color:#000000;solid-opacity:1;vector-effect:none;fill:#241f31;fill-opacity:1;fill-rule:nonzero;stroke:none;stroke-width:1.53779;stroke-linecap:round;stroke-linejoin:round;stroke-miterlimit:4;stroke-dasharray:none;stroke-dashoffset:0;stroke-opacity:1;color-rendering:auto;image-rendering:auto;shape-rendering:auto;text-rendering:auto;enable-background:new;stop-color:#000000;stop-opacity:1"
           id="path2507" />
        <rect
           ry="1.6249995"
           rx="1.6249995"
           y="180"
           x="164"
           height="4"
           width="3.249999"
           id="rect2509"
           style="display:inline;fill:#241f31;fill-opacity:1;stroke:none;stroke-width:0.54389;stroke-linecap:round;stroke-linejoin:round;enable-background:new" />
        <rect
           style="display:inline;fill:#241f31;fill-opacity:1;stroke:none;stroke-width:0.54389;stroke-linecap:round;stroke-linejoin:round;enable-background:new"
           id="rect2511"
           width="3.249999"
           height="4"
           x="168.75002"
           y="180"
           rx="1.6249995"
           ry="1.6249995" />
      </g>
      <path
         style="color:#000000;font-style:normal;font-variant:normal;font-weight:normal;font-stretch:normal;font-size:medium;line-height:normal;font-family:sans-serif;font-variant-ligatures:normal;font-variant-position:normal;font-variant-caps:normal;font-variant-numeric:normal;font-variant-alternates:normal;font-variant-east-asian:normal;font-feature-settings:normal;font-variation-settings:normal;text-indent:0;text-align:start;text-decoration:none;text-decoration-line:none;text-decoration-style:solid;text-decoration-color:#000000;letter-spacing:normal;word-spacing:normal;text-transform:none;writing-mode:lr-tb;direction:ltr;text-orientation:mixed;dominant-baseline:auto;baseline-shift:baseline;text-anchor:start;white-space:normal;shape-padding:0;shape-margin:0;inline-size:0;clip-rule:nonzero;display:block;overflow:visible;visibility:visible;opacity:1;isolation:auto;mix-blend-mode:normal;color-interpolation:sRGB;color-interpolation-filters:linearRGB;solid-color:#000000;solid-opacity:1;vector-effect:none;fill:#241f31;fill-opacity:1;fill-rule:nonzero;stroke:none;stroke-width:2;stroke-linecap:butt;stroke-linejoin:miter;stroke-miterlimit:4;stroke-dasharray:none;stroke-dashoffset:0;stroke-opacity:1;marker:none;color-rendering:auto;image-rendering:auto;shape-rendering:auto;text-rendering:auto;enable-background:new;stop-color:#000000;stop-opacity:1"
         d="m -173,173 c -1.0907,0 -2,0.9093 -2,2 v 10 c 0,1.0907 0.9093,2 2,2 h 10 c 1.0907,0 2,-0.9093 2,-2 v -10 c 0,-1.0907 -0.9093,-2 -2,-2 z m 0,1 h 10 v 10 h -10 z"
         id="path2515"
         transform="scale(-1,1)"
         sodipodi:nodetypes="sssssssssccccc" />
    </g>
    <path
       sodipodi:nodetypes="sssssssssccccc"
       id="path2528"
       d="m 213,173 c 1.0907,0 2,0.9093 2,2 v 10 c 0,1.0907 -0.9093,2 -2,2 h -10 c -1.0907,0 -2,-0.9093 -2,-2 v -10 c 0,-1.0907 0.9093,-2 2,-2 z m -3,3 h -4 v 7 h 4 z"
       style="color:#000000;font-style:normal;font-variant:normal;font-weight:normal;font-stretch:normal;font-size:medium;line-height:normal;font-family:sans-serif;font-variant-ligatures:normal;font-variant-position:normal;font-variant-caps:normal;font-variant-numeric:normal;font-variant-alternates:normal;font-variant-east-asian:normal;font-feature-settings:normal;font-variation-settings:normal;text-indent:0;text-align:start;text-decoration:none;text-decoration-line:none;text-decoration-style:solid;text-decoration-color:#000000;letter-spacing:normal;word-spacing:normal;text-transform:none;writing-mode:lr-tb;direction:ltr;text-orientation:mixed;dominant-baseline:auto;baseline-shift:baseline;text-anchor:start;white-space:normal;shape-padding:0;shape-margin:0;inline-size:0;clip-rule:nonzero;display:block;overflow:visible;visibility:visible;opacity:1;isolation:auto;mix-blend-mode:normal;color-interpolation:sRGB;color-interpolation-filters:linearRGB;solid-color:#000000;solid-opacity:1;vector-effect:none;fill:#241f31;fill-opacity:1;fill-rule:nonzero;stroke:none;stroke-width:2;stroke-linecap:butt;stroke-linejoin:miter;stroke-miterlimit:4;stroke-dasharray:none;stroke-dashoffset:0;stroke-opacity:1;marker:none;color-rendering:auto;image-rendering:auto;shape-rendering:auto;text-rendering:auto;enable-background:new;stop-color:#000000;stop-opacity:1" />
    <rect
       ry="1"
       rx="1"
       y="174"
       x="203"
       height="10"
       width="10"
       id="rect2530"
       style="fill:#ff7800;fill-opacity:1;stroke:none;stroke-width:1;stroke-linecap:round;stroke-linejoin:round;stroke-opacity:1" />
  </g>
</svg>
