<?xml version="1.0" encoding="UTF-8" standalone="no"?>
<svg
   xmlns:dc="http://purl.org/dc/elements/1.1/"
   xmlns:cc="http://creativecommons.org/ns#"
   xmlns:rdf="http://www.w3.org/1999/02/22-rdf-syntax-ns#"
   xmlns:svg="http://www.w3.org/2000/svg"
   xmlns="http://www.w3.org/2000/svg"
   xmlns:xlink="http://www.w3.org/1999/xlink"
   xmlns:sodipodi="http://sodipodi.sourceforge.net/DTD/sodipodi-0.dtd"
   xmlns:inkscape="http://www.inkscape.org/namespaces/inkscape"
   viewBox="0 0 192 152"
   style="display:inline;enable-background:new"
   version="1.0"
   inkscape:output_extension="org.inkscape.output.svg.inkscape"
   sodipodi:docname="com.transmissionbt.Transmission.svg"
   inkscape:version="0.92.4 5da689c313, 2019-01-14"
   sodipodi:version="0.32"
   id="svg11300"
   height="152"
   width="192"
   inkscape:export-filename="Template.png"
   inkscape:export-xdpi="96"
   inkscape:export-ydpi="96">
  <title
     id="title4162">Adwaita Icon Template</title>
  <defs
     id="defs3">
    <linearGradient
       xlink:href="#linearGradient1036"
       id="linearGradient1099"
       gradientUnits="userSpaceOnUse"
       gradientTransform="translate(604.81684,170.58641)"
       x1="32"
       y1="236"
       x2="96"
       y2="236" />
    <linearGradient
       id="linearGradient1036">
      <stop
         style="stop-color:#d5d3cf;stop-opacity:1;"
         offset="0"
         id="stop1032" />
      <stop
         style="stop-color:#f6f5f4;stop-opacity:1"
         offset="1"
         id="stop1034" />
    </linearGradient>
    <radialGradient
       xlink:href="#linearGradient1069"
       id="radialGradient1103"
       gradientUnits="userSpaceOnUse"
       gradientTransform="matrix(0.88333331,0,0,0.88333331,-460.35018,463.11973)"
       cx="-244"
       cy="-76"
       fx="-244"
       fy="-76"
       r="32" />
    <linearGradient
       id="linearGradient1069">
      <stop
         style="stop-color:#d5d3cf;stop-opacity:1"
         offset="0"
         id="stop1065" />
      <stop
         style="stop-color:#949390;stop-opacity:1"
         offset="1"
         id="stop1067-1" />
    </linearGradient>
    <linearGradient
       gradientTransform="translate(-470.5864,432.81685)"
       xlink:href="#linearGradient1025"
       id="linearGradient1027"
       x1="64"
       y1="262.5"
       x2="64"
       y2="232"
       gradientUnits="userSpaceOnUse" />
    <linearGradient
       id="linearGradient1025">
      <stop
         style="stop-color:#9a9996;stop-opacity:1"
         offset="0"
         id="stop1021" />
      <stop
         style="stop-color:#77767b;stop-opacity:1"
         offset="1"
         id="stop1023" />
    </linearGradient>
    <inkscape:path-effect
       is_visible="true"
       id="path-effect35304-9"
       effect="spiro" />
    <clipPath
       id="clipPath1609-7"
       clipPathUnits="userSpaceOnUse">
      <path
         style="fill:#e74747;stroke:none;stroke-width:0.25px;stroke-linecap:butt;stroke-linejoin:miter;stroke-opacity:1"
         d="m 252,116 28,-28 v -8 h -36 v 36 z"
         id="path1611-5"
         inkscape:connector-curvature="0"
         sodipodi:nodetypes="cccccc" />
    </clipPath>
    <linearGradient
       id="linearGradient1697">
      <stop
         style="stop-color:#deddda;stop-opacity:1"
         offset="0"
         id="stop1685" />
      <stop
         id="stop1687"
         offset="0.04545455"
         style="stop-color:#eeeeec;stop-opacity:1" />
      <stop
         style="stop-color:#deddda;stop-opacity:1"
         offset="0.09090909"
         id="stop1689" />
      <stop
         id="stop1691"
         offset="0.90909094"
         style="stop-color:#deddda;stop-opacity:1" />
      <stop
         style="stop-color:#eeeeec;stop-opacity:1"
         offset="0.95454544"
         id="stop1693" />
      <stop
         style="stop-color:#c0bfbc;stop-opacity:1"
         offset="1"
         id="stop1695" />
    </linearGradient>
    <clipPath
       id="clipPath1289"
       clipPathUnits="userSpaceOnUse">
      <path
         sodipodi:nodetypes="scccsssscccssss"
         inkscape:connector-curvature="0"
         id="path1291"
         d="m 64,-148 h 64 l 64,-64 64,64 h 192 c 17.728,0 32,14.272 32,32 v 288 c 0,17.728 -14.272,32 -32,32 H 256 l -64,-64 -64,64 H 64 C 46.272,204 32,189.728 32,172 v -288 c 0,-17.728 14.408898,-34.19889 32,-32 z"
         style="display:inline;opacity:1;vector-effect:none;fill:none;fill-opacity:1;stroke:#000000;stroke-width:4;stroke-linecap:round;stroke-linejoin:round;stroke-miterlimit:4;stroke-dasharray:none;stroke-dashoffset:0;stroke-opacity:1;marker:none;marker-start:none;marker-mid:none;marker-end:none;paint-order:normal;enable-background:new" />
    </clipPath>
    <linearGradient
       gradientTransform="matrix(0,6,-12,0,-64,209.99687)"
       gradientUnits="userSpaceOnUse"
       x2="1"
       id="paint3_linear-2-6-5">
      <stop
         id="stop91-0-7-4"
         stop-color="#C01C27" />
      <stop
         id="stop93-2-5-7"
         stop-color="#E01B24"
         offset="1" />
    </linearGradient>
    <clipPath
       id="clipPath1609"
       clipPathUnits="userSpaceOnUse">
      <path
         style="fill:#e74747;stroke:none;stroke-width:0.25px;stroke-linecap:butt;stroke-linejoin:miter;stroke-opacity:1"
         d="m 252,116 28,-28 v -8 h -36 v 36 z"
         id="path1611"
         inkscape:connector-curvature="0"
         sodipodi:nodetypes="cccccc" />
    </clipPath>
    <clipPath
       id="clipPath2245"
       clipPathUnits="userSpaceOnUse">
      <rect
         ry="0"
         rx="0"
         y="-71.789413"
         x="270.26764"
         height="229.05319"
         width="288.00003"
         id="rect2243"
         style="display:inline;opacity:1;vector-effect:none;fill:#e66100;fill-opacity:1;stroke:none;stroke-width:0.0123119px;stroke-linecap:butt;stroke-linejoin:miter;stroke-miterlimit:4;stroke-dasharray:none;stroke-dashoffset:0;stroke-opacity:1;marker:none;marker-start:none;marker-mid:none;marker-end:none;paint-order:normal;enable-background:new" />
    </clipPath>
    <clipPath
       id="clipPath2279"
       clipPathUnits="userSpaceOnUse">
      <rect
         transform="scale(-1)"
         style="display:inline;opacity:1;vector-effect:none;fill:#e66100;fill-opacity:1;stroke:none;stroke-width:0.00440593px;stroke-linecap:butt;stroke-linejoin:miter;stroke-miterlimit:4;stroke-dasharray:none;stroke-dashoffset:0;stroke-opacity:1;marker:none;marker-start:none;marker-mid:none;marker-end:none;paint-order:normal;enable-background:new"
         id="rect2281"
         width="96"
         height="90"
         x="-110"
         y="-290"
         rx="0"
         ry="0" />
    </clipPath>
    <linearGradient
       inkscape:collect="always"
       xlink:href="#linearGradient1143"
       id="linearGradient1132"
       x1="255.99997"
       y1="-212.00005"
       x2="255.99997"
       y2="-93.481468"
       gradientUnits="userSpaceOnUse"
       gradientTransform="matrix(0.33333334,0,0,0.29376219,-21.333341,242.27759)" />
    <linearGradient
       id="linearGradient1143"
       inkscape:collect="always">
      <stop
         id="stop1135"
         offset="0"
         style="stop-color:#c8c6c0;stop-opacity:1" />
      <stop
         style="stop-color:#ffffff;stop-opacity:1"
         offset="0.16000028"
         id="stop1137" />
      <stop
         id="stop1139"
         offset="0.36000022"
         style="stop-color:#ffffff;stop-opacity:1" />
      <stop
         id="stop1141"
         offset="1"
         style="stop-color:#68676b;stop-opacity:1" />
    </linearGradient>
    <linearGradient
       inkscape:collect="always"
       xlink:href="#linearGradient2148"
       id="linearGradient1152"
       x1="197.49997"
       y1="-124.34376"
       x2="197.49997"
       y2="-212"
       gradientUnits="userSpaceOnUse"
       gradientTransform="matrix(0.97171711,0,0,0.96216102,5.93132,39.978137)" />
    <linearGradient
       id="linearGradient2148"
       inkscape:collect="always">
      <stop
         id="stop2140"
         offset="0"
         style="stop-color:#e01b24;stop-opacity:1" />
      <stop
         style="stop-color:#ac1d2e;stop-opacity:1"
         offset="0.22499999"
         id="stop2150" />
      <stop
         style="stop-color:#e01b24;stop-opacity:1"
         offset="0.45000002"
         id="stop2142" />
      <stop
         style="stop-color:#f66151;stop-opacity:1"
         offset="0.72500002"
         id="stop2144" />
      <stop
         id="stop2146"
         offset="1"
         style="stop-color:#f66151;stop-opacity:1" />
    </linearGradient>
    <linearGradient
       inkscape:collect="always"
       xlink:href="#linearGradient1058"
       id="linearGradient1060"
       x1="255.75"
       y1="400"
       x2="255.75"
       y2="208"
       gradientUnits="userSpaceOnUse"
       gradientTransform="matrix(0.27200198,0,0,0.27200198,-5.704064,170.34221)" />
    <linearGradient
       inkscape:collect="always"
       id="linearGradient1058">
      <stop
         style="stop-color:#191622;stop-opacity:1"
         offset="0"
         id="stop1054" />
      <stop
         style="stop-color:#949390;stop-opacity:1"
         offset="1"
         id="stop1056" />
    </linearGradient>
    <linearGradient
       inkscape:collect="always"
       xlink:href="#linearGradient897"
       id="linearGradient899"
       x1="64"
       y1="59.999969"
       x2="448"
       y2="59.999969"
       gradientUnits="userSpaceOnUse"
       gradientTransform="matrix(0.27085109,0,0,0.27200198,-5.188466,225.83063)" />
    <linearGradient
       inkscape:collect="always"
       id="linearGradient897">
      <stop
         style="stop-color:#68676b;stop-opacity:1"
         offset="0"
         id="stop893" />
      <stop
         id="stop903"
         offset="0.04166667"
         style="stop-color:#c8c6c0;stop-opacity:1" />
      <stop
         id="stop901"
         offset="0.08333335"
         style="stop-color:#949390;stop-opacity:1" />
      <stop
         style="stop-color:#9e9e9b;stop-opacity:1"
         offset="0.91666669"
         id="stop905" />
      <stop
         id="stop907"
         offset="0.95833331"
         style="stop-color:#c8c6c0;stop-opacity:1" />
      <stop
         style="stop-color:#68676b;stop-opacity:1"
         offset="1"
         id="stop895" />
    </linearGradient>
    <linearGradient
       inkscape:collect="always"
       xlink:href="#linearGradient913"
       id="linearGradient915"
       x1="56"
       y1="-76"
       x2="56"
       y2="-156"
       gradientUnits="userSpaceOnUse"
       gradientTransform="matrix(0.27200198,0,0,0.18429884,-1.3520329,224.21883)" />
    <linearGradient
       inkscape:collect="always"
       id="linearGradient913">
      <stop
         style="stop-color:#68676b;stop-opacity:1"
         offset="0"
         id="stop909" />
      <stop
         id="stop917"
         offset="0.76249999"
         style="stop-color:#edece9;stop-opacity:1" />
      <stop
         style="stop-color:#c8c6c0;stop-opacity:1"
         offset="1"
         id="stop911" />
    </linearGradient>
  </defs>
  <sodipodi:namedview
     inkscape:document-rotation="0"
     inkscape:bbox-paths="true"
     borderlayer="true"
     inkscape:snap-text-baseline="true"
     inkscape:snap-smooth-nodes="true"
     inkscape:snap-midpoints="true"
     inkscape:snap-object-midpoints="true"
     inkscape:snap-center="true"
     showborder="true"
     inkscape:snap-bbox-midpoints="true"
     inkscape:snap-bbox-edge-midpoints="true"
     inkscape:snap-intersection-paths="true"
     inkscape:object-paths="true"
     inkscape:snap-global="true"
     inkscape:bbox-nodes="true"
     inkscape:object-nodes="true"
     inkscape:measure-end="0,0"
     inkscape:measure-start="0,0"
     inkscape:locked="false"
     inkscape:guide-bbox="true"
     showguides="false"
     inkscape:pagecheckerboard="false"
     inkscape:window-maximized="1"
     guidetolerance="13"
     gridtolerance="12"
     objecttolerance="7"
     inkscape:snap-bbox="true"
     inkscape:snap-nodes="true"
     height="300px"
     width="400px"
     inkscape:window-y="27"
     inkscape:window-x="0"
     inkscape:window-height="1376"
     inkscape:window-width="5120"
     inkscape:showpageshadow="false"
     inkscape:document-units="px"
     inkscape:grid-bbox="true"
     showgrid="true"
     inkscape:current-layer="layer9"
     inkscape:cy="127.5125"
     inkscape:cx="169.62426"
     inkscape:zoom="32"
     inkscape:pageshadow="2"
     inkscape:pageopacity="0.0"
     borderopacity="0.25490196"
     bordercolor="#666666"
     pagecolor="#ffffff"
     id="base"
     fill="#f57900"
     stroke="#ef2929">
    <inkscape:grid
       originy="8"
       originx="8"
       empspacing="4"
       visible="true"
       enabled="true"
       spacingy="2"
       spacingx="2"
       id="grid5883"
       type="xygrid" />
    <sodipodi:guide
       inkscape:color="rgb(0,0,255)"
       inkscape:label=""
       inkscape:locked="false"
       id="guide1073"
       orientation="0,1"
       position="72,16" />
    <sodipodi:guide
       inkscape:color="rgb(0,0,255)"
       inkscape:label=""
       inkscape:locked="false"
       id="guide1075"
       orientation="1,0"
       position="20,72" />
    <sodipodi:guide
       inkscape:color="rgb(0,0,255)"
       inkscape:label=""
       inkscape:locked="false"
       id="guide1099"
       orientation="0,1"
       position="72,112" />
    <sodipodi:guide
       inkscape:color="rgb(0,0,255)"
       inkscape:label=""
       inkscape:locked="false"
       id="guide993"
       orientation="0,1"
       position="72,136" />
    <sodipodi:guide
       inkscape:color="rgb(0,0,255)"
       inkscape:label=""
       inkscape:locked="false"
       id="guide995"
       orientation="1,0"
       position="112,72" />
    <sodipodi:guide
       inkscape:color="rgb(0,0,255)"
       inkscape:label=""
       inkscape:locked="false"
       id="guide867"
       orientation="1,0"
       position="8.0000001,72" />
    <sodipodi:guide
       inkscape:color="rgb(0,0,255)"
       inkscape:label=""
       inkscape:locked="false"
       id="guide869"
       orientation="1,0"
       position="128,72" />
    <sodipodi:guide
       inkscape:color="rgb(0,0,255)"
       inkscape:label=""
       inkscape:locked="false"
       id="guide871"
       orientation="0,1"
       position="72,124" />
    <inkscape:grid
       originy="8"
       originx="8"
       dotted="true"
       empopacity="0.08627451"
       empcolor="#000000"
       opacity="0.49019608"
       color="#000000"
       empspacing="8"
       spacingy="1"
       spacingx="1"
       id="grid873"
       type="xygrid" />
    <sodipodi:guide
       inkscape:color="rgb(0,0,255)"
       inkscape:label=""
       inkscape:locked="false"
       id="guide877"
       orientation="1,0"
       position="32,72" />
    <sodipodi:guide
       inkscape:color="rgb(0,0,255)"
       inkscape:label=""
       inkscape:locked="false"
       id="guide879"
       orientation="1,0"
       position="124,72" />
    <sodipodi:guide
       inkscape:color="rgb(0,0,255)"
       inkscape:label=""
       inkscape:locked="false"
       id="guide881"
       orientation="0,1"
       position="72,128" />
    <sodipodi:guide
       inkscape:color="rgb(0,0,255)"
       inkscape:label=""
       inkscape:locked="false"
       id="guide883"
       orientation="0,1"
       position="72,20" />
    <sodipodi:guide
       inkscape:color="rgb(0,0,255)"
       inkscape:label=""
       inkscape:locked="false"
       id="guide885"
       orientation="1,0"
       position="16,72" />
    <sodipodi:guide
       inkscape:color="rgb(0,0,255)"
       inkscape:label=""
       inkscape:locked="false"
       id="guide887"
       orientation="1,0"
       position="136,72" />
    <sodipodi:guide
       inkscape:color="rgb(0,0,255)"
       inkscape:label=""
       inkscape:locked="false"
       id="guide897"
       orientation="0,1"
       position="72,8" />
    <sodipodi:guide
       inkscape:color="rgb(0,0,255)"
       inkscape:label=""
       inkscape:locked="false"
       id="guide899"
       orientation="0,1"
       position="72,32" />
    <sodipodi:guide
       inkscape:color="rgb(0,0,255)"
       inkscape:label=""
       inkscape:locked="false"
       id="guide950"
       orientation="-0.70710678,0.70710678"
       position="264,264" />
    <sodipodi:guide
       inkscape:color="rgb(0,0,255)"
       inkscape:label=""
       inkscape:locked="false"
       id="guide952"
       orientation="0.70710678,0.70710678"
       position="72,72" />
  </sodipodi:namedview>
  <metadata
     id="metadata4">
    <rdf:RDF>
      <cc:Work
         rdf:about="">
        <dc:format>image/svg+xml</dc:format>
        <dc:type
           rdf:resource="http://purl.org/dc/dcmitype/StillImage" />
        <dc:creator>
          <cc:Agent>
            <dc:title>GNOME Design Team</dc:title>
          </cc:Agent>
        </dc:creator>
        <dc:source />
        <cc:license
           rdf:resource="http://creativecommons.org/licenses/by-sa/4.0/" />
        <dc:title>Adwaita Icon Template</dc:title>
        <dc:subject>
          <rdf:Bag />
        </dc:subject>
        <dc:date />
        <dc:rights>
          <cc:Agent>
            <dc:title />
          </cc:Agent>
        </dc:rights>
        <dc:publisher>
          <cc:Agent>
            <dc:title />
          </cc:Agent>
        </dc:publisher>
        <dc:identifier />
        <dc:relation />
        <dc:language />
        <dc:coverage />
        <dc:description />
        <dc:contributor>
          <cc:Agent>
            <dc:title />
          </cc:Agent>
        </dc:contributor>
      </cc:Work>
      <cc:License
         rdf:about="http://creativecommons.org/licenses/by-sa/4.0/">
        <cc:permits
           rdf:resource="http://creativecommons.org/ns#Reproduction" />
        <cc:permits
           rdf:resource="http://creativecommons.org/ns#Distribution" />
        <cc:requires
           rdf:resource="http://creativecommons.org/ns#Notice" />
        <cc:requires
           rdf:resource="http://creativecommons.org/ns#Attribution" />
        <cc:permits
           rdf:resource="http://creativecommons.org/ns#DerivativeWorks" />
        <cc:requires
           rdf:resource="http://creativecommons.org/ns#ShareAlike" />
      </cc:License>
    </rdf:RDF>
  </metadata>
  <g
     transform="translate(8,-156)"
     style="display:inline"
     inkscape:groupmode="layer"
     inkscape:label="App Icon"
     id="layer1">
    <g
       sodipodi:insensitive="true"
       style="display:inline"
       inkscape:label="template (do not hide)"
       id="layer4"
       inkscape:groupmode="layer">
      <rect
         style="display:inline;overflow:visible;visibility:visible;fill:#f0f0f0;fill-opacity:0;fill-rule:nonzero;stroke:none;stroke-width:0.5;marker:none;enable-background:accumulate"
         id="hicolor"
         width="128"
         height="128"
         x="9.2651362e-08"
         y="172"
         inkscape:label="0" />
      <rect
         inkscape:label="0"
         y="172"
         x="160"
         height="16"
         width="16"
         id="symbolic"
         style="display:inline;overflow:visible;visibility:visible;fill:#f0f0f0;fill-opacity:0;fill-rule:nonzero;stroke:none;stroke-width:0.5;marker:none;enable-background:accumulate" />
    </g>
    <g
       style="display:none"
       inkscape:label="baseplate"
       id="layer2"
       inkscape:groupmode="layer"
       sodipodi:insensitive="true">
      <g
         inkscape:export-ydpi="12"
         inkscape:export-xdpi="12"
         id="g12027"
         transform="matrix(7.9911709,0,0,8.0036407,-167.7909,-4846.0776)"
         style="display:inline;fill:#000000;enable-background:new" />
      <rect
         inkscape:label="0"
         y="172"
         x="9.2651362e-08"
         height="128"
         width="128"
         id="128"
         style="display:inline;overflow:visible;visibility:visible;fill:#f0f0f0;fill-opacity:1;fill-rule:nonzero;stroke:none;stroke-width:0.5;marker:none;enable-background:accumulate" />
      <g
         transform="translate(-24,24)"
         style="fill:none;fill-opacity:0.25098039;stroke:#a579b3;stroke-opacity:1"
         id="g883" />
      <g
         transform="translate(-24,24)"
         style="fill:none;fill-opacity:0.25098039;stroke:#a579b3;stroke-opacity:1"
         id="g900" />
      <rect
         style="display:inline;overflow:visible;visibility:visible;fill:#f0f0f0;fill-opacity:1;fill-rule:nonzero;stroke:none;stroke-width:0.5;marker:none;enable-background:accumulate"
         id="16"
         width="16"
         height="16"
         x="160"
         y="172"
         inkscape:label="" />
      <text
         inkscape:label="icon-name"
         id="text863"
         y="167"
         x="0"
         style="font-style:normal;font-variant:normal;font-weight:bold;font-stretch:normal;font-size:4px;line-height:125%;font-family:Cantarell;-inkscape-font-specification:'Cantarell, Bold';text-align:start;writing-mode:lr-tb;text-anchor:start;display:inline;fill:#000000;fill-opacity:1;stroke:none;stroke-width:0.33264899;enable-background:new"
         xml:space="preserve"><tspan
           y="167"
           x="0"
           id="tspan861"
           sodipodi:role="line"
           style="font-size:4px;stroke-width:0.33264899">Hicolor</tspan></text>
      <text
         xml:space="preserve"
         style="font-style:normal;font-variant:normal;font-weight:bold;font-stretch:normal;font-size:4px;line-height:125%;font-family:Cantarell;-inkscape-font-specification:'Cantarell, Bold';text-align:start;writing-mode:lr-tb;text-anchor:start;display:inline;fill:#000000;fill-opacity:1;stroke:none;stroke-width:0.33264899;enable-background:new"
         x="160"
         y="167"
         id="text867"
         inkscape:label="icon-name"><tspan
           style="font-size:4px;stroke-width:0.33264899"
           sodipodi:role="line"
           id="tspan865"
           x="160"
           y="167">Symbolic</tspan></text>
    </g>
    <g
       style="display:inline"
       inkscape:label="icons"
       id="layer9"
       inkscape:groupmode="layer">
      <path
         inkscape:connector-curvature="0"
         style="fill:#3d3846;fill-opacity:1;stroke-width:0.92741805;enable-background:new"
         d="m 298,173 a 7,7 0 0 0 -7,7 7,7 0 0 0 7,7 7,7 0 0 0 7,-7 7,7 0 0 0 -7,-7 z m 0,2.06836 a 4.9313765,4.9313765 0 0 1 2.45898,0.66211 l -6.72656,6.72656 A 4.9313765,4.9313765 0 0 1 293.06836,180 4.9313765,4.9313765 0 0 1 298,175.06836 Z m 4.38281,2.67187 A 4.9313765,4.9313765 0 0 1 302.93164,180 4.9313765,4.9313765 0 0 1 298,184.93164 a 4.9313765,4.9313765 0 0 1 -2.25781,-0.55078 z"
         id="path880" />
      <path
         inkscape:connector-curvature="0"
         id="rect1019"
         d="m 283,172 a 1.0001,1.0001 0 0 0 -1,1 v 14 a 1.0001,1.0001 0 0 0 1,1 h 10 a 1.0001,1.0001 0 0 0 1,-1 v -14 a 1.0001,1.0001 0 0 0 -1,-1 z m 1,2 h 8 v 12 h -8 z"
         style="color:#000000;font-style:normal;font-variant:normal;font-weight:normal;font-stretch:normal;font-size:medium;line-height:normal;font-family:sans-serif;font-variant-ligatures:normal;font-variant-position:normal;font-variant-caps:normal;font-variant-numeric:normal;font-variant-alternates:normal;font-feature-settings:normal;text-indent:0;text-align:start;text-decoration:none;text-decoration-line:none;text-decoration-style:solid;text-decoration-color:#000000;letter-spacing:normal;word-spacing:normal;text-transform:none;writing-mode:lr-tb;direction:ltr;text-orientation:mixed;dominant-baseline:auto;baseline-shift:baseline;text-anchor:start;white-space:normal;shape-padding:0;clip-rule:nonzero;display:inline;overflow:visible;visibility:visible;opacity:1;isolation:auto;mix-blend-mode:normal;color-interpolation:sRGB;color-interpolation-filters:linearRGB;solid-color:#000000;solid-opacity:1;vector-effect:none;fill:#3d3846;fill-opacity:0.97637796;fill-rule:nonzero;stroke:none;stroke-width:2;stroke-linecap:round;stroke-linejoin:round;stroke-miterlimit:4;stroke-dasharray:none;stroke-dashoffset:0;stroke-opacity:1;color-rendering:auto;image-rendering:auto;shape-rendering:auto;text-rendering:auto;enable-background:accumulate" />
      <rect
         y="176"
         x="280"
         height="4"
         width="8.375"
         id="rect1021"
         style="opacity:1;vector-effect:none;fill:#3d3846;fill-opacity:1;stroke:none;stroke-width:2;stroke-linecap:round;stroke-linejoin:round;stroke-miterlimit:4;stroke-dasharray:none;stroke-dashoffset:0;stroke-opacity:0.97637796" />
      <rect
         style="opacity:1;vector-effect:none;fill:#3d3846;fill-opacity:1;stroke:none;stroke-width:2;stroke-linecap:round;stroke-linejoin:round;stroke-miterlimit:4;stroke-dasharray:none;stroke-dashoffset:0;stroke-opacity:0.97637796"
         id="rect1023"
         width="7.3750005"
         height="4"
         x="287"
         y="181" />
      <rect
         style="opacity:1;vector-effect:none;fill:none;fill-opacity:1;stroke:#3d3846;stroke-width:2;stroke-linecap:round;stroke-linejoin:round;stroke-miterlimit:4;stroke-dasharray:none;stroke-dashoffset:0;stroke-opacity:0.97637796"
         id="rect1025"
         width="10"
         height="14"
         x="257"
         y="173" />
      <path
         sodipodi:nodetypes="ssscccs"
         inkscape:connector-curvature="0"
         id="rect2397"
         d="m 222.625,175 c -1.45425,0 -2.625,1.17075 -2.625,2.625 v 6.75 c 0,1.45425 1.17085,2.60809 2.625,2.625 H 226 v -12 z"
         style="display:inline;opacity:1;vector-effect:none;fill:#000000;fill-opacity:0.88627451;fill-rule:nonzero;stroke:none;stroke-width:2;stroke-linecap:butt;stroke-linejoin:miter;stroke-miterlimit:4;stroke-dasharray:none;stroke-dashoffset:0;stroke-opacity:1;marker:none;marker-start:none;marker-mid:none;marker-end:none;paint-order:normal;enable-background:new" />
      <rect
         y="175"
         x="227"
         height="3"
         width="3"
         id="rect2436"
         style="opacity:0.59100001;vector-effect:none;fill:#000000;fill-opacity:1;fill-rule:nonzero;stroke:none;stroke-width:3;stroke-linecap:butt;stroke-linejoin:miter;stroke-miterlimit:4;stroke-dasharray:none;stroke-dashoffset:0;stroke-opacity:1;marker:none;marker-start:none;marker-mid:none;marker-end:none;paint-order:normal" />
      <rect
         style="opacity:0.82900002;vector-effect:none;fill:#000000;fill-opacity:1;fill-rule:nonzero;stroke:none;stroke-width:3;stroke-linecap:butt;stroke-linejoin:miter;stroke-miterlimit:4;stroke-dasharray:none;stroke-dashoffset:0;stroke-opacity:1;marker:none;marker-start:none;marker-mid:none;marker-end:none;paint-order:normal"
         id="rect2438"
         width="3"
         height="3"
         x="230"
         y="175" />
      <rect
         y="178"
         x="230"
         height="3"
         width="3"
         id="rect2440"
         style="opacity:0.556;vector-effect:none;fill:#000000;fill-opacity:1;fill-rule:nonzero;stroke:none;stroke-width:3;stroke-linecap:butt;stroke-linejoin:miter;stroke-miterlimit:4;stroke-dasharray:none;stroke-dashoffset:0;stroke-opacity:1;marker:none;marker-start:none;marker-mid:none;marker-end:none;paint-order:normal" />
      <rect
         style="opacity:0.77999998;vector-effect:none;fill:#000000;fill-opacity:1;fill-rule:nonzero;stroke:none;stroke-width:3;stroke-linecap:butt;stroke-linejoin:miter;stroke-miterlimit:4;stroke-dasharray:none;stroke-dashoffset:0;stroke-opacity:1;marker:none;marker-start:none;marker-mid:none;marker-end:none;paint-order:normal"
         id="rect2442"
         width="3"
         height="3"
         x="227"
         y="178" />
      <rect
         y="178"
         x="233"
         height="3"
         width="3"
         id="rect2444"
         style="opacity:0.40100002;vector-effect:none;fill:#000000;fill-opacity:1;fill-rule:nonzero;stroke:none;stroke-width:3;stroke-linecap:butt;stroke-linejoin:miter;stroke-miterlimit:4;stroke-dasharray:none;stroke-dashoffset:0;stroke-opacity:1;marker:none;marker-start:none;marker-mid:none;marker-end:none;paint-order:normal" />
      <rect
         style="opacity:0.31700003;vector-effect:none;fill:#000000;fill-opacity:1;fill-rule:nonzero;stroke:none;stroke-width:3;stroke-linecap:butt;stroke-linejoin:miter;stroke-miterlimit:4;stroke-dasharray:none;stroke-dashoffset:0;stroke-opacity:1;marker:none;marker-start:none;marker-mid:none;marker-end:none;paint-order:normal"
         id="rect2446"
         width="3"
         height="3"
         x="233"
         y="181" />
      <rect
         y="181"
         x="230"
         height="3"
         width="3"
         id="rect2448"
         style="opacity:0.794;vector-effect:none;fill:#000000;fill-opacity:1;fill-rule:nonzero;stroke:none;stroke-width:3;stroke-linecap:butt;stroke-linejoin:miter;stroke-miterlimit:4;stroke-dasharray:none;stroke-dashoffset:0;stroke-opacity:1;marker:none;marker-start:none;marker-mid:none;marker-end:none;paint-order:normal" />
      <rect
         style="opacity:0.73400005;vector-effect:none;fill:#000000;fill-opacity:1;fill-rule:nonzero;stroke:none;stroke-width:3;stroke-linecap:butt;stroke-linejoin:miter;stroke-miterlimit:4;stroke-dasharray:none;stroke-dashoffset:0;stroke-opacity:1;marker:none;marker-start:none;marker-mid:none;marker-end:none;paint-order:normal"
         id="rect2450"
         width="3"
         height="3"
         x="227"
         y="181" />
      <rect
         y="184"
         x="227"
         height="3"
         width="3"
         id="rect2452"
         style="opacity:0.88599997;vector-effect:none;fill:#000000;fill-opacity:1;fill-rule:nonzero;stroke:none;stroke-width:3;stroke-linecap:butt;stroke-linejoin:miter;stroke-miterlimit:4;stroke-dasharray:none;stroke-dashoffset:0;stroke-opacity:1;marker:none;marker-start:none;marker-mid:none;marker-end:none;paint-order:normal" />
      <rect
         style="opacity:0.42000002;vector-effect:none;fill:#000000;fill-opacity:1;fill-rule:nonzero;stroke:none;stroke-width:3;stroke-linecap:butt;stroke-linejoin:miter;stroke-miterlimit:4;stroke-dasharray:none;stroke-dashoffset:0;stroke-opacity:1;marker:none;marker-start:none;marker-mid:none;marker-end:none;paint-order:normal"
         id="rect2454"
         width="3"
         height="3"
         x="230"
         y="184" />
      <rect
         style="display:inline;opacity:1;fill:url(#linearGradient915);fill-opacity:1;stroke:none;stroke-width:0.22389652;stroke-linecap:butt;stroke-linejoin:miter;stroke-miterlimit:4;stroke-dasharray:none;stroke-dashoffset:0;stroke-opacity:1;marker:none;marker-start:none;marker-mid:none;marker-end:none;paint-order:normal;enable-background:new"
         id="rect906"
         width="21.76016"
         height="17.69269"
         x="2.9999981"
         y="193.9938"
         rx="4.3520327"
         ry="2.9487815" />
      <rect
         style="display:inline;opacity:1;fill:url(#linearGradient899);fill-opacity:1;stroke:none;stroke-width:0.27142596;stroke-linecap:butt;stroke-linejoin:miter;stroke-miterlimit:4;stroke-dasharray:none;stroke-dashoffset:0;stroke-opacity:1;marker:none;marker-start:none;marker-mid:none;marker-end:none;paint-order:normal;enable-background:new"
         id="rect899-5"
         width="104.00683"
         height="95.74469"
         x="12.146007"
         y="194.27841"
         rx="7.9661508"
         ry="8" />
      <rect
         style="display:inline;opacity:1;fill:#d5d3cf;fill-opacity:1;stroke:none;stroke-width:0.27154127;stroke-linecap:butt;stroke-linejoin:miter;stroke-miterlimit:4;stroke-dasharray:none;stroke-dashoffset:0;stroke-opacity:1;marker:none;marker-start:none;marker-mid:none;marker-end:none;paint-order:normal;enable-background:new"
         id="rect899"
         width="104.09521"
         height="100.09673"
         x="12.057618"
         y="185.94934"
         rx="7.9729204"
         ry="8" />
      <rect
         style="display:inline;opacity:1;fill:#ffffff;fill-opacity:1;stroke:none;stroke-width:0.27539995;stroke-linecap:butt;stroke-linejoin:miter;stroke-miterlimit:4;stroke-dasharray:none;stroke-dashoffset:0;stroke-opacity:1;marker:none;marker-start:none;marker-mid:none;marker-end:none;paint-order:normal;enable-background:new"
         id="rect899-3"
         width="88.127983"
         height="83.721588"
         x="20"
         y="194.27841"
         rx="0"
         ry="0" />
      <path
         style="display:inline;opacity:1;fill:#000000;fill-opacity:0.07874014;stroke:none;stroke-width:0.2716164;stroke-linecap:butt;stroke-linejoin:miter;stroke-miterlimit:4;stroke-dasharray:none;stroke-dashoffset:0;stroke-opacity:1;marker:none;marker-start:none;marker-mid:none;marker-end:none;paint-order:normal;enable-background:new"
         d="m 65.742475,191.23272 c -17.142071,-0.0507 -33.765718,1.56185 -50.022579,4.35202 -1.335865,0.2293 -2.602396,0.67869 -3.719896,1.32601 v 32.10422 c 1.119502,0.65274 2.387063,1.11828 3.719896,1.38605 29.985203,6.02391 62.389457,5.57794 96.713034,0 1.33659,-0.21722 2.60304,-0.66076 3.71991,-1.30638 v -32.15627 c -1.11835,-0.64975 -2.38543,-1.10661 -3.71991,-1.35363 -16.036394,-2.96822 -31.565098,-4.30742 -46.690455,-4.35202 z"
         id="rect10293"
         inkscape:connector-curvature="0" />
      <path
         style="display:inline;opacity:1;fill:url(#linearGradient1060);fill-opacity:1;stroke:none;stroke-width:0.27200195;stroke-linecap:butt;stroke-linejoin:miter;stroke-miterlimit:4;stroke-dasharray:none;stroke-dashoffset:0;stroke-opacity:1;marker:none;marker-start:none;marker-mid:none;marker-end:none;paint-order:normal;enable-background:new"
         d="m 48.696335,209.51051 v 26.36217 H 28.976191 L 63.860447,270.43896 98.7447,235.87268 H 79.160557 v -26.36217 z"
         id="rect918-6-7"
         inkscape:connector-curvature="0"
         sodipodi:nodetypes="cccccccc" />
      <path
         style="display:inline;opacity:0.15;fill:#000000;fill-opacity:1;stroke:none;stroke-width:0.27200195;stroke-linecap:butt;stroke-linejoin:miter;stroke-miterlimit:4;stroke-dasharray:none;stroke-dashoffset:0;stroke-opacity:1;marker:none;marker-start:none;marker-mid:none;marker-end:none;paint-order:normal;enable-background:new"
         d="m 28.976191,235.62268 4.360529,4.35205 h 15.359615 v -4.35205 z m 50.184366,0 v 4.35205 h 15.223612 l 4.360531,-4.35205 z"
         id="rect918-6-7-0"
         inkscape:connector-curvature="0"
         sodipodi:nodetypes="cccccccccc" />
      <rect
         style="display:inline;opacity:1;fill:#aaaaaa;fill-opacity:1;stroke:none;stroke-width:0.27200201;stroke-linecap:butt;stroke-linejoin:miter;stroke-miterlimit:4;stroke-dasharray:none;stroke-dashoffset:0;stroke-opacity:1;marker:none;marker-start:none;marker-mid:none;marker-end:none;paint-order:normal;enable-background:new"
         id="rect899-3-3"
         width="87.040642"
         height="2.1760163"
         x="20.408131"
         y="202.98247"
         rx="0"
         ry="0" />
      <g
         id="g1162"
         transform="matrix(0.40432726,0,0,0.41119864,-39.050035,253.0109)"
         style="display:inline;stroke-width:0.64281708;enable-background:new">
        <path
           style="opacity:1;fill:url(#linearGradient1152);fill-opacity:1;stroke:none;stroke-width:0.64281702;stroke-linecap:butt;stroke-linejoin:miter;stroke-miterlimit:4;stroke-dasharray:none;stroke-dashoffset:0;stroke-opacity:1;marker:none;marker-start:none;marker-mid:none;marker-end:none;paint-order:normal"
           d="m 134.75325,-164 c 75.89917,-12.7726 155.02281,-15.39933 239.87532,0 10.89031,1.97641 19.98962,9.44072 19.98962,21.16754 v 42.33508 c 0,11.726822 -9.05797,19.425671 -19.98962,21.167546 -85.1318,13.565105 -165.50387,14.649665 -239.87532,0 -10.85851,-2.138906 -19.98962,-9.440724 -19.98962,-21.167546 v -42.33508 c 0,-11.72682 9.07408,-19.33063 19.98962,-21.16754 z"
           id="rect916"
           inkscape:connector-curvature="0"
           sodipodi:nodetypes="sssssssss" />
      </g>
      <rect
         style="display:inline;opacity:1;fill:url(#linearGradient1132);fill-opacity:1;stroke:none;stroke-width:0.28971022;stroke-linecap:butt;stroke-linejoin:miter;stroke-miterlimit:4;stroke-dasharray:none;stroke-dashoffset:0;stroke-opacity:1;marker:none;marker-start:none;marker-mid:none;marker-end:none;paint-order:normal;enable-background:new"
         id="rect918"
         width="32"
         height="58.75243"
         x="48"
         y="180"
         rx="0"
         ry="0" />
      <path
         style="display:inline;opacity:1;fill:#c8c6c0;fill-opacity:1;stroke:none;stroke-width:0.27200195;stroke-linecap:butt;stroke-linejoin:miter;stroke-miterlimit:4;stroke-dasharray:none;stroke-dashoffset:0;stroke-opacity:1;marker:none;marker-start:none;marker-mid:none;marker-end:none;paint-order:normal;enable-background:new"
         d="m 28.976191,235.62268 2.180264,2.17603 h 16.78988 v -2.17603 z m 51.059366,0 v 2.17603 h 16.528879 l 2.180264,-2.17603 z"
         id="rect918-6-7-6"
         inkscape:connector-curvature="0"
         sodipodi:nodetypes="cccccccccc" />
      <path
         style="display:inline;fill:#5a5a5d;fill-opacity:1;stroke:none;stroke-width:0.27200204px;stroke-linecap:butt;stroke-linejoin:miter;stroke-opacity:1;enable-background:new"
         d="m 37.816256,244.32675 h 52.224383 l -2.176019,2.17603 H 39.992272 Z"
         id="path2185"
         inkscape:connector-curvature="0" />
      <path
         inkscape:connector-curvature="0"
         id="path2187"
         d="m 44.344304,250.8548 h 39.168284 l -2.176015,2.17602 H 46.520319 Z"
         style="display:inline;fill:#424048;fill-opacity:1;stroke:none;stroke-width:0.27200204px;stroke-linecap:butt;stroke-linejoin:miter;stroke-opacity:1;enable-background:new"
         sodipodi:nodetypes="ccccc" />
      <path
         sodipodi:nodetypes="ccccc"
         style="display:inline;fill:#191622;fill-opacity:1;stroke:none;stroke-width:0.27200204px;stroke-linecap:butt;stroke-linejoin:miter;stroke-opacity:1;enable-background:new"
         d="m 50.872351,257.38284 h 26.11219 l -2.176016,2.17603 H 53.048367 Z"
         id="path2189"
         inkscape:connector-curvature="0" />
      <path
         inkscape:connector-curvature="0"
         id="path2191"
         d="m 57.400399,263.91089 h 12.996593 l -2.176016,2.17602 h -8.644562 z"
         style="display:inline;fill:#000000;fill-opacity:1;stroke:none;stroke-width:0.27200204px;stroke-linecap:butt;stroke-linejoin:miter;stroke-opacity:1;enable-background:new"
         sodipodi:nodetypes="ccccc" />
      <path
         style="display:inline;opacity:1;fill:#241f31;fill-opacity:1;stroke:none;stroke-width:0.27539995;stroke-linecap:butt;stroke-linejoin:miter;stroke-miterlimit:4;stroke-dasharray:none;stroke-dashoffset:0;stroke-opacity:1;marker:none;marker-start:none;marker-mid:none;marker-end:none;paint-order:normal;enable-background:new"
         d="m 170,22.548828 v 7.453155 C 170,30.55441 170.51386,31 171,31 h 10 c 0.51015,0 1,-0.35568 1,-0.998017 V 22.552734 C 180.64031,22.770634 179.30908,22.9156 178,23 v 3 h 2 l -4,4 -4,-4 h 2 v -2.964844 c -1.36326,-0.07162 -2.69502,-0.226212 -3.98828,-0.482422 -0.004,-8.18e-4 -0.008,-0.0031 -0.0117,-0.0039 z"
         transform="translate(-8,156)"
         id="rect1116"
         inkscape:connector-curvature="0"
         sodipodi:nodetypes="cccccccccccccccc" />
      <path
         style="opacity:1;fill:#241f31;fill-opacity:1;stroke:none;stroke-width:0.26210767;stroke-linecap:butt;stroke-linejoin:miter;stroke-miterlimit:4;stroke-dasharray:none;stroke-dashoffset:0;stroke-opacity:1;marker:none;marker-start:none;marker-mid:none;marker-end:none;paint-order:normal"
         d="m 170,173.05304 v 4.90671 c 1.30908,-0.0844 2.64031,-0.0968 4,-0.31469 0.54636,-0.0876 1,-0.47498 1,-1.06445 v -2.21534 c 0,-0.58947 -0.4557,-0.96505 -1,-1.06445 -1.36255,-0.2487 -2.69241,-0.17301 -4,-0.24778 z m -4,0.008 c -1.35157,0.0839 -2.68017,0.0186 -3.98828,0.23996 -0.54555,0.0923 -0.99805,0.47499 -0.99805,1.06446 v 2.21534 c 0,0.58947 0.45535,0.95693 0.99805,1.06445 1.29326,0.25621 2.62502,0.27823 3.98828,0.34984 z"
         id="path1118"
         inkscape:connector-curvature="0"
         sodipodi:nodetypes="ccsssccccssccc" />
    </g>
    <g
       sodipodi:insensitive="true"
       style="display:none"
       inkscape:label="grid"
       id="layer3"
       inkscape:groupmode="layer">
      <circle
         style="display:inline;opacity:0.1;vector-effect:none;fill:none;fill-opacity:1;stroke:#000000;stroke-width:0.99000001;stroke-linecap:butt;stroke-linejoin:miter;stroke-miterlimit:4;stroke-dasharray:0.99000001, 0.99000001;stroke-dashoffset:0;stroke-opacity:1;marker:none;marker-start:none;marker-mid:none;marker-end:none;paint-order:normal;enable-background:new"
         id="circle2892"
         r="59.504131"
         cy="236"
         cx="64.000031" />
      <rect
         style="display:inline;opacity:0.1;vector-effect:none;fill:none;fill-opacity:1;stroke:#000000;stroke-width:0.99000001;stroke-linecap:butt;stroke-linejoin:miter;stroke-miterlimit:4;stroke-dasharray:0.99000001, 0.99000001;stroke-dashoffset:0;stroke-opacity:1;marker:none;marker-start:none;marker-mid:none;marker-end:none;paint-order:normal;enable-background:new"
         id="rect2894"
         width="87.009987"
         height="111.01005"
         x="20.495007"
         y="180.49496"
         rx="8.701004"
         ry="7.9292889" />
      <rect
         style="display:inline;opacity:0.1;vector-effect:none;fill:none;fill-opacity:1;stroke:#000000;stroke-width:0.99000001;stroke-linecap:butt;stroke-linejoin:miter;stroke-miterlimit:4;stroke-dasharray:0.99000001, 0.99000001;stroke-dashoffset:0;stroke-opacity:1;marker:none;marker-start:none;marker-mid:none;marker-end:none;paint-order:normal;enable-background:new"
         id="rect2896"
         width="103.00952"
         height="103.00952"
         x="12.495266"
         y="184.49524"
         rx="7.9238095"
         ry="7.9238095" />
      <rect
         style="display:inline;opacity:0.1;vector-effect:none;fill:none;fill-opacity:1;stroke:#000000;stroke-width:0.99000001;stroke-linecap:butt;stroke-linejoin:miter;stroke-miterlimit:4;stroke-dasharray:0.99000001, 0.99000001;stroke-dashoffset:0;stroke-opacity:1;marker:none;marker-start:none;marker-mid:none;marker-end:none;paint-order:normal;enable-background:new"
         id="rect2898"
         width="111.01004"
         height="87.010048"
         x="8.4950066"
         y="200.49496"
         rx="7.9292889"
         ry="8.701005" />
      <path
         style="display:inline;fill:none;stroke:#62a0ea;stroke-width:2;stroke-linecap:butt;stroke-linejoin:miter;stroke-miterlimit:4;stroke-dasharray:none;stroke-opacity:1;enable-background:new"
         d="M 2.6203015e-5,288.99999 H 128.00003"
         id="path2900"
         inkscape:connector-curvature="0" />
    </g>
  </g>
</svg>
