{
    "app-id": "org.gnu.hello",
    "runtime": "org.freedesktop.Platform",
    "runtime-version": "25.08beta",
    "sdk": "org.freedesktop.Sdk",
    "command": "hello",
    "build-options": {
        "arch": {
            "riscv64": {
                "config-opts": ["--build=riscv64"]
            }
        }
    },
    "modules": [
        {
            "name": "gnu-hello",
            "sources": [
                {
                    "type": "archive",
                    "url": "https://mirrors.kernel.org/gnu/hello/hello-2.12.1.tar.gz",
                    "mirror-urls": [
                        "https://mirrors.edge.kernel.org/gnu/hello/hello-2.12.1.tar.gz"
                    ],
                    "sha256": "8d99142afd92576f30b0cd7cb42a8dc6809998bc5d607d88761f512e26c7db20"
                }
            ]
        }
    ]
}
