CHandle: restore the check for only setting the base_url before loading

9 jobs for master in 41 minutes and 39 seconds (queued for 3 seconds)
Status Job ID Name Coverage
  Test
passed #284126
fedora test

00:09:10

 
  Lint
manual #284128
allowed to fail manual
clippy
manual #284127
allowed to fail manual
rustfmt
passed #284129
tarball

00:12:13

 
  Cross Distro
passed #284132
debian_i386:testing

00:20:14

failed #284131
allowed to fail
debian:testing

00:03:00

failed #284134
debian:testing_release_i386

00:04:34

passed #284130
allowed to fail
fedora:rawhide

00:09:35

passed #284133
fedora:test_release

00:09:12

 
Name Stage Failure
failed
debian:testing_release_i386 Cross Distro
make[2]: *** [Makefile:1903: /builds/GNOME/librsvg/_build/target/release/librsvg_internals.a] Error 101
make[1]: Leaving directory '/builds/GNOME/librsvg/_build'
make[1]: *** [Makefile:1415: all-recursive] Error 1
make: *** [Makefile:955: all] Error 2
Uploading artifacts...
WARNING: _build/tests/*.log: no matching files
WARNING: _build/tests/output/: no matching files
ERROR: No files to upload
ERROR: Job failed: exit code 1
failed
debian:testing Cross Distro
make[2]: *** [Makefile:1903: /builds/GNOME/librsvg/_build/target/debug/librsvg_internals.a] Segmentation fault (core dumped)
make[1]: *** [Makefile:1415: all-recursive] Error 1
make[1]: Leaving directory '/builds/GNOME/librsvg/_build'
make: *** [Makefile:955: all] Error 2
Uploading artifacts...
WARNING: _build/tests/*.log: no matching files
WARNING: _build/tests/output/: no matching files
ERROR: No files to upload
ERROR: Job failed: exit code 1