Merge branch 'opensuse-ci'

7 jobs for master in 32 minutes and 58 seconds (queued for 1 second)
Status Job ID Name Coverage
  Test
passed #417743
opensuse:tumbleweed

00:08:50

 
  Lint
manual #417745
allowed to fail manual
clippy
manual #417744
allowed to fail manual
rustfmt
passed #417746
tarball

00:10:34

 
  Cross Distro
failed #417749
allowed to fail
debian_i386:testing

00:13:32

failed #417748
allowed to fail
debian:testing

00:08:55

failed #417747
allowed to fail
fedora:rawhide

00:08:06

 
Name Stage Failure
failed
debian_i386:testing Cross Distro
make[4]: Leaving directory '/builds/GNOME/librsvg/_build/tests'
make[3]: *** [Makefile:1324: check-TESTS] Error 2
make[3]: Leaving directory '/builds/GNOME/librsvg/_build/tests'
make[2]: Leaving directory '/builds/GNOME/librsvg/_build/tests'
make[2]: *** [Makefile:1447: check-am] Error 2
make[1]: Leaving directory '/builds/GNOME/librsvg/_build/tests'
make[1]: *** [Makefile:1450: check] Error 2
make: *** [Makefile:1266: check-recursive] Error 1
ERROR: Job failed: exit code 1
failed
debian:testing Cross Distro
make[4]: *** [Makefile:1216: test-suite.log] Error 1
make[3]: *** [Makefile:1324: check-TESTS] Error 2
make[3]: Leaving directory '/builds/GNOME/librsvg/_build/tests'
make[2]: *** [Makefile:1447: check-am] Error 2
make[2]: Leaving directory '/builds/GNOME/librsvg/_build/tests'
make[1]: *** [Makefile:1450: check] Error 2
make[1]: Leaving directory '/builds/GNOME/librsvg/_build/tests'
make: *** [Makefile:1266: check-recursive] Error 1
ERROR: Job failed: exit code 1
failed
fedora:rawhide Cross Distro
make[4]: Leaving directory '/builds/GNOME/librsvg/_build/tests'
make[3]: *** [Makefile:1324: check-TESTS] Error 2
make[3]: Leaving directory '/builds/GNOME/librsvg/_build/tests'
make[2]: *** [Makefile:1447: check-am] Error 2
make[2]: Leaving directory '/builds/GNOME/librsvg/_build/tests'
make[1]: *** [Makefile:1450: check] Error 2
make[1]: Leaving directory '/builds/GNOME/librsvg/_build/tests'
make: *** [Makefile:1266: check-recursive] Error 1
ERROR: Job failed: exit code 1