Updated Czech translation

1 job for master in 3 minutes and 57 seconds (queued for 2 seconds)
Status Job ID Name Coverage
  Build
failed #105506
build-ubuntu

00:03:57

 
Name Stage Failure
failed
build-ubuntu Build
make[4]: *** [Makefile:1000: gnome_panel-applet.o] Error 1
make[3]: *** [Makefile:1439: all-recursive] Error 1
make[3]: Leaving directory '/builds/GNOME/gnome-panel/gnome-panel'
make[2]: *** [Makefile:699: all] Error 2
make[2]: Leaving directory '/builds/GNOME/gnome-panel/gnome-panel'
make[1]: Leaving directory '/builds/GNOME/gnome-panel'
make[1]: *** [Makefile:540: all-recursive] Error 1
make: *** [Makefile:472: all] Error 2
ERROR: Job failed: exit code 1