Update German translation

1 job for master in 2 minutes and 26 seconds (queued for 3 seconds)
Status Job ID Name Coverage
  Build
failed #105267
build-ubuntu

00:02:26

 
Name Stage Failure
failed
build-ubuntu Build
make[4]: Leaving directory '/builds/GNOME/gnome-panel/gnome-panel'
make[3]: Leaving directory '/builds/GNOME/gnome-panel/gnome-panel'
make[3]: *** [Makefile:1439: all-recursive] Error 1
make[2]: *** [Makefile:699: all] Error 2
make[2]: Leaving directory '/builds/GNOME/gnome-panel/gnome-panel'
make[1]: *** [Makefile:540: all-recursive] Error 1
make[1]: Leaving directory '/builds/GNOME/gnome-panel'
make: *** [Makefile:472: all] Error 2
ERROR: Job failed: exit code 1