Update Swedish translation

1 job for master in 6 minutes and 27 seconds (queued for 2 seconds)
Status Job ID Name Coverage
  Build
failed #103893
build-ubuntu

00:06:27

 
Name Stage Failure
failed
build-ubuntu Build
make[4]: Leaving directory '/builds/GNOME/gnome-panel/gnome-panel'
make[3]: Leaving directory '/builds/GNOME/gnome-panel/gnome-panel'
make[3]: *** [Makefile:1552: all-recursive] Error 1
make[2]: Leaving directory '/builds/GNOME/gnome-panel/gnome-panel'
make[2]: *** [Makefile:748: all] Error 2
make[1]: Leaving directory '/builds/GNOME/gnome-panel'
make[1]: *** [Makefile:540: all-recursive] Error 1
make: *** [Makefile:472: all] Error 2
ERROR: Job failed: exit code 1