ci: Enable test suite

3 jobs from wip/nielsdg/intltool2gettext in 3 minutes and 31 seconds (queued for 4 seconds)
latest
Status Job ID Name Coverage
  Test
failed #71354
flatpak

00:03:31

 
  Review
skipped #71355
review
skipped #71356
allowed to fail manual
stop_review
 
Name Stage Failure
failed
flatpak Test
make[4]: Leaving directory '/builds/GNOME/glade/tests'
make[3]: *** [Makefile:1017: check-TESTS] Error 2
make[3]: Leaving directory '/builds/GNOME/glade/tests'
make[2]: *** [Makefile:1101: check-am] Error 2
make[2]: Leaving directory '/builds/GNOME/glade/tests'
make[1]: *** [Makefile:1103: check] Error 2
make[1]: Leaving directory '/builds/GNOME/glade/tests'
make: *** [Makefile:504: check-recursive] Error 1
ERROR: Job failed: exit code 1