Explicitly build-depend on JSC-dev for Ubuntu and Debian builds

4 jobs for wip/fix-missing-jsc-header in 6 minutes and 5 seconds (queued for 2 seconds)
Status Job ID Name Coverage
  Build
failed #118344
deb-package

00:02:05

passed #118342
fedora

00:03:00

passed #118345
flatpack-package

00:06:02

failed #118343
ubuntu

00:01:44

 
Name Stage Failure
failed
deb-package Build
[351/503] cc  -Itest/geary-test-engine@exe -Itest -I../../test -I. -I../../ -Isrc/engine -I../../src/engine -Itest/data -I/usr/include/gee-0.8 -I/usr/include/glib-2.0 -I/usr/lib/x86_64-linux-gnu/glib-2.0/include -I/usr/include/gmime-2.6 -I/usr/include/webkitgtk-4.0 -I/usr/include/libxml2 -fdiagnostics-color=always -pipe -D_FILE_OFFSET_BITS=64 -g -O2 -fdebug-prefix-map=/builds/GNOME/geary=. -fstack-protector-strong -Wformat -Werror=format-security -Wdate-time -D_FORTIFY_SOURCE=2 -D_LARGEFILE64_SOURCE -pthread -include config.h -DUNW_LOCAL_ONLY -DGOA_API_IS_SUBJECT_TO_CHANGE -MD -MQ 'test/geary-test-engine@exe/meson-generated_.._data_org.gnome.GearyTest.c.o' -MF 'test/geary-test-engine@exe/meson-generated_.._data_org.gnome.GearyTest.c.o.d' -o 'test/geary-test-engine@exe/meson-generated_.._data_org.gnome.GearyTest.c.o' -c test/data/org.gnome.GearyTest.c
ninja: build stopped: subcommand failed.
debian/rules:19: recipe for target 'override_dh_auto_build' failed
make[1]: Leaving directory '/builds/GNOME/geary'
make[1]: *** [override_dh_auto_build] Error 1
debian/rules:13: recipe for target 'build' failed
make: *** [build] Error 2
dpkg-buildpackage: error: debian/rules build subprocess returned exit status 2
ERROR: Job failed: exit code 1
failed
ubuntu Build
[346/503] cc  -Isrc/mailer/geary-mailer@exe -Isrc/mailer -I../src/mailer -I. -I../ -Isrc/engine -I../src/engine -I/usr/include/gee-0.8 -I/usr/include/glib-2.0 -I/usr/lib/x86_64-linux-gnu/glib-2.0/include -I/usr/include/gmime-2.6 -I/usr/include/at-spi2-atk/2.0 -I/usr/include/at-spi-2.0 -I/usr/include/dbus-1.0 -I/usr/lib/x86_64-linux-gnu/dbus-1.0/include -I/usr/include/gtk-3.0 -I/usr/include/gio-unix-2.0/ -I/usr/include/harfbuzz -I/usr/include/pango-1.0 -I/usr/include/atk-1.0 -I/usr/include/cairo -I/usr/include/pixman-1 -I/usr/include/freetype2 -I/usr/include/gdk-pixbuf-2.0 -I/usr/include/libpng16 -I/usr/include/libsoup-2.4 -I/usr/include/libxml2 -I/usr/include/webkitgtk-4.0 -fdiagnostics-color=always -pipe -D_FILE_OFFSET_BITS=64 -w -O0 -g -pthread -D_LARGEFILE64_SOURCE -include config.h -DUNW_LOCAL_ONLY -DGOA_API_IS_SUBJECT_TO_CHANGE -MD -MQ 'src/mailer/geary-mailer@exe/meson-generated_main.c.o' -MF 'src/mailer/geary-mailer@exe/meson-generated_main.c.o.d' -o 'src/mailer/geary-mailer@exe/meson-generated_main.c.o' -c 'src/mailer/geary-mailer@exe/main.c'
[347/503] valac -C --debug --vapidir /builds/GNOME/geary/bindings/vapi --metadatadir /builds/GNOME/geary/bindings/metadata --pkg sqlite3 --pkg posix --pkg libxml-2.0 /builds/GNOME/geary/bindings/vapi/libunwind.vapi --pkg javascriptcoregtk-4.0 --pkg gmime-2.6 --target-glib 2.54 --pkg glib-2.0 --pkg gio-2.0 --pkg gee-0.8 --color=always --directory test/geary-test-engine@exe --basedir ../test --gresources=../test/data/org.gnome.GearyTest.gresource.xml --target-glib=2.54 --thread --enable-checking src/engine/geary-engine-internal.vapi ../test/test-engine.vala ../test/engine/api/geary-account-mock.vala ../test/engine/api/geary-credentials-mediator-mock.vala ../test/engine/api/geary-email-identifier-mock.vala ../test/engine/api/geary-email-properties-mock.vala ../test/engine/api/geary-folder-mock.vala ../test/engine/api/geary-folder-path-mock.vala ../test/engine/api/geary-service-information-mock.vala ../test/engine/api/geary-account-information-test.vala ../test/engine/api/geary-attachment-test.vala ../test/engine/api/geary-engine-test.vala ../test/engine/app/app-conversation-test.vala ../test/engine/app/app-conversation-monitor-test.vala ../test/engine/app/app-conversation-set-test.vala ../test/engine/db/db-database-test.vala ../test/engine/db/db-versioned-database-test.vala ../test/engine/imap/command/imap-create-command-test.vala ../test/engine/imap/command/imap-fetch-command-test.vala ../test/engine/imap/message/imap-data-format-test.vala ../test/engine/imap/message/imap-mailbox-specifier-test.vala ../test/engine/imap/parameter/imap-list-parameter-test.vala ../test/engine/imap/response/imap-namespace-response-test.vala ../test/engine/imap/transport/imap-deserializer-test.vala ../test/engine/imap-db/imap-db-attachment-test.vala ../test/engine/imap-db/imap-db-database-test.vala ../test/engine/imap-engine/account-processor-test.vala ../test/engine/mime-content-type-test.vala ../test/engine/rfc822-mailbox-address-test.vala ../test/engine/rfc822-mailbox-addresses-test.vala ../test/engine/rfc822-message-test.vala ../test/engine/rfc822-message-data-test.vala ../test/engine/rfc822-part-test.vala ../test/engine/rfc822-utils-test.vala ../test/engine/util-ascii-test.vala ../test/engine/util-config-file-test.vala ../test/engine/util-html-test.vala ../test/engine/util-idle-manager-test.vala ../test/engine/util-inet-test.vala ../test/engine/util-js-test.vala ../test/engine/util-string-test.vala ../test/engine/util-timeout-manager-test.vala test/geary-test-lib.vapi
[348/503] cc -Isrc/console/geary-console@exe -Isrc/console -I../src/console -I. -I../ -Isrc/engine -I../src/engine -I/usr/include/at-spi2-atk/2.0 -I/usr/include/at-spi-2.0 -I/usr/include/dbus-1.0 -I/usr/lib/x86_64-linux-gnu/dbus-1.0/include -I/usr/include/gtk-3.0 -I/usr/include/gio-unix-2.0/ -I/usr/include/harfbuzz -I/usr/include/pango-1.0 -I/usr/include/atk-1.0 -I/usr/include/cairo -I/usr/include/pixman-1 -I/usr/include/freetype2 -I/usr/include/gdk-pixbuf-2.0 -I/usr/include/libpng16 -I/usr/include/glib-2.0 -I/usr/lib/x86_64-linux-gnu/glib-2.0/include -I/usr/include/gee-0.8 -I/usr/include/gmime-2.6 -I/usr/include/libsoup-2.4 -I/usr/include/libxml2 -I/usr/include/webkitgtk-4.0 -fdiagnostics-color=always -pipe -D_FILE_OFFSET_BITS=64 -w -O0 -g -pthread -D_LARGEFILE64_SOURCE -include config.h -DUNW_LOCAL_ONLY -DGOA_API_IS_SUBJECT_TO_CHANGE -MD -MQ 'src/console/geary-console@exe/meson-generated_main.c.o' -MF 'src/console/geary-console@exe/meson-generated_main.c.o.d' -o 'src/console/geary-console@exe/meson-generated_main.c.o' -c 'src/console/geary-console@exe/main.c'
[349/503] valac -C --debug --vapidir /builds/GNOME/geary/bindings/vapi --metadatadir /builds/GNOME/geary/bindings/metadata --pkg unity /usr/share/vala/vapi/MessagingMenu-1.0.vapi --pkg webkit2gtk-4.0 --pkg posix --pkg libxml-2.0 --pkg gmime-2.6 --pkg libsoup-2.4 --pkg libsecret-1 --pkg libnotify --pkg libcanberra --pkg json-glib-1.0 --pkg gtk+-3.0 --pkg goa-1.0 --pkg gio-2.0 --pkg gee-0.8 --pkg gcr-3 --pkg enchant --color=always --directory src/client/geary-client@sta --basedir ../src/client --library geary-client --header src/client/geary-client.h --vapi ../geary-client.vapi --gresources=../ui/org.gnome.Geary.gresource.xml --target-glib=2.54 --thread --enable-checking ../src/client/application/autostart-manager.vala ../src/client/application/geary-application.vala ../src/client/application/geary-args.vala ../src/client/application/geary-config.vala ../src/client/application/geary-controller.vala ../src/client/application/goa-mediator.vala ../src/client/application/secret-mediator.vala ../src/client/accounts/account-dialog.vala ../src/client/accounts/account-dialog-account-list-pane.vala ../src/client/accounts/account-dialog-add-edit-pane.vala ../src/client/accounts/account-dialog-edit-alternate-emails-pane.vala ../src/client/accounts/account-dialog-pane.vala ../src/client/accounts/account-dialog-remove-confirm-pane.vala ../src/client/accounts/account-dialog-remove-fail-pane.vala ../src/client/accounts/account-dialog-spinner-pane.vala ../src/client/accounts/account-manager.vala ../src/client/accounts/account-spinner-page.vala ../src/client/accounts/add-edit-page.vala ../src/client/accounts/goa-service-information.vala ../src/client/accounts/local-service-information.vala ../src/client/accounts/login-dialog.vala ../src/client/components/client-web-view.vala ../src/client/components/count-badge.vala ../src/client/components/empty-placeholder.vala ../src/client/components/folder-popover.vala ../src/client/components/icon-factory.vala ../src/client/components/main-toolbar.vala ../src/client/components/main-window.vala ../src/client/components/main-window-info-bar.vala ../src/client/components/monitored-progress-bar.vala ../src/client/components/monitored-spinner.vala ../src/client/components/search-bar.vala ../src/client/components/status-bar.vala ../src/client/components/stock.vala ../src/client/composer/composer-box.vala ../src/client/composer/composer-container.vala ../src/client/composer/composer-embed.vala ../src/client/composer/composer-headerbar.vala ../src/client/composer/composer-link-popover.vala ../src/client/composer/composer-web-view.vala ../src/client/composer/composer-widget.vala ../src/client/composer/composer-window.vala ../src/client/composer/contact-entry-completion.vala ../src/client/composer/contact-list-store.vala ../src/client/composer/contact-list-store-cache.vala ../src/client/composer/email-entry.vala ../src/client/composer/spell-check-popover.vala ../src/client/conversation-list/conversation-list-cell-renderer.vala ../src/client/conversation-list/conversation-list-store.vala ../src/client/conversation-list/conversation-list-view.vala ../src/client/conversation-list/formatted-conversation-data.vala ../src/client/conversation-viewer/conversation-email.vala ../src/client/conversation-viewer/conversation-list-box.vala ../src/client/conversation-viewer/conversation-message.vala ../src/client/conversation-viewer/conversation-viewer.vala ../src/client/conversation-viewer/conversation-web-view.vala ../src/client/dialogs/alert-dialog.vala ../src/client/dialogs/attachment-dialog.vala ../src/client/dialogs/certificate-warning-dialog.vala ../src/client/dialogs/password-dialog.vala ../src/client/dialogs/preferences-dialog.vala ../src/client/dialogs/upgrade-dialog.vala ../src/client/folder-list/folder-list-abstract-folder-entry.vala ../src/client/folder-list/folder-list-account-branch.vala ../src/client/folder-list/folder-list-folder-entry.vala ../src/client/folder-list/folder-list-tree.vala ../src/client/folder-list/folder-list-inboxes-branch.vala ../src/client/folder-list/folder-list-inbox-folder-entry.vala ../src/client/folder-list/folder-list-search-branch.vala ../src/client/folder-list/folder-list-special-grouping.vala ../src/client/notification/in-app-notification.vala ../src/client/notification/libmessagingmenu.vala ../src/client/notification/libnotify.vala ../src/client/notification/new-messages-indicator.vala ../src/client/notification/new-messages-monitor.vala ../src/client/notification/null-indicator.vala ../src/client/notification/unity-launcher.vala ../src/client/sidebar/sidebar-branch.vala ../src/client/sidebar/sidebar-common.vala ../src/client/sidebar/sidebar-count-cell-renderer.vala ../src/client/sidebar/sidebar-entry.vala ../src/client/sidebar/sidebar-tree.vala ../src/client/util/util-date.vala ../src/client/util/util-email.vala ../src/client/util/util-files.vala ../src/client/util/util-gio.vala ../src/client/util/util-gravatar.vala ../src/client/util/util-gtk.vala ../src/client/util/util-international.vala ../src/client/util/util-migrate.vala ../src/client/util/util-webkit.vala src/engine/geary-engine.vapi
unity.vapi:97.4-97.13: warning: [Deprecated] is deprecated. Use [Version (deprecated = true, deprecated_since = "", replacement = "")]
Compilation succeeded - 1 warning(s)
[350/503] cc -Itest/geary-test-engine@exe -Itest -I../test -I. -I../ -Isrc/engine -I../src/engine -Itest/data -I/usr/include/gee-0.8 -I/usr/include/glib-2.0 -I/usr/lib/x86_64-linux-gnu/glib-2.0/include -I/usr/include/gmime-2.6 -I/usr/include/webkitgtk-4.0 -I/usr/include/libxml2 -fdiagnostics-color=always -pipe -D_FILE_OFFSET_BITS=64 -Wall -Winvalid-pch -O0 -g -D_LARGEFILE64_SOURCE -pthread -include config.h -DUNW_LOCAL_ONLY -DGOA_API_IS_SUBJECT_TO_CHANGE -MD -MQ 'test/geary-test-engine@exe/meson-generated_.._data_org.gnome.GearyTest.c.o' -MF 'test/geary-test-engine@exe/meson-generated_.._data_org.gnome.GearyTest.c.o.d' -o 'test/geary-test-engine@exe/meson-generated_.._data_org.gnome.GearyTest.c.o' -c test/data/org.gnome.GearyTest.c
ninja: build stopped: subcommand failed.
ERROR: Job failed: exit code 1