{
  "id": "org.gnome.Showtime.Devel",
  "runtime": "org.gnome.Platform",
  "runtime-version": "master",
  "sdk": "org.gnome.Sdk",
  "command": "showtime",
  "finish-args": [
    "--share=ipc",
    "--socket=fallback-x11",
    "--device=dri",
    "--socket=wayland",
    "--socket=pulseaudio",
    "--filesystem=xdg-pictures/Screenshots:create"
  ],
  "add-extensions": {
    "org.freedesktop.Platform.ffmpeg-full": {
      "version": "24.08beta",
      "directory": "lib/ffmpeg",
      "add-ld-path": ".",
      "no-autodownload": false,
      "autodelete": false
    }
  },
  "cleanup-commands": ["mkdir -p ${FLATPAK_DEST}/lib/ffmpeg"],
  "cleanup": [
    "/include",
    "/lib/pkgconfig",
    "/man",
    "/share/doc",
    "/share/gtk-doc",
    "/share/man",
    "/share/pkgconfig",
    "*.la",
    "*.a"
  ],
  "modules": [
    {
      "name": "blueprint-compiler",
      "buildsystem": "meson",
      "sources": [
        {
          "type": "git",
          "url": "https://gitlab.gnome.org/jwestman/blueprint-compiler",
          "tag": "v0.16.0"
        }
      ],
      "cleanup": ["*"]
    },
    {
      "name": "showtime",
      "builddir": true,
      "buildsystem": "meson",
      "config-opts": ["-Dprofile=development"],
      "sources": [
        {
          "type": "dir",
          "path": "../../"
        }
      ]
    }
  ]
}
